beam-builds mailing list archives

Site index · List index
Message view « Date » · « Thread »
Top « Date » · « Thread »
From Apache Jenkins Server <jenk...@builds.apache.org>
Subject Build failed in Jenkins: beam_PostCommit_Python2 #1266
Date Fri, 20 Dec 2019 18:46:32 GMT
See <https://builds.apache.org/job/beam_PostCommit_Python2/1266/display/redirect?page=changes>

Changes:

[valentyn] Sickbay VR tests that don't pass


------------------------------------------
[...truncated 1.62 MB...]
19/12/20 18:00:46 INFO org.apache.beam.runners.fnexecution.jobsubmission.InMemoryJobService:
Getting job metrics for BeamApp-jenkins-1220175929-2d8c3d5d_3ef2d05e-7413-45f0-8ecc-5681d7116f79
19/12/20 18:00:46 INFO org.apache.beam.runners.fnexecution.jobsubmission.InMemoryJobService:
Finished getting job metrics for BeamApp-jenkins-1220175929-2d8c3d5d_3ef2d05e-7413-45f0-8ecc-5681d7116f79
Exception in thread run_worker_1-1:
Traceback (most recent call last):
  File "/usr/lib/python2.7/threading.py", line 801, in __bootstrap_inner
    self.run()
  File "/usr/lib/python2.7/threading.py", line 754, in run
    self.__target(*self.__args, **self.__kwargs)
  File "<https://builds.apache.org/job/beam_PostCommit_Python2/ws/src/sdks/python/apache_beam/runners/worker/sdk_worker.py",>
line 131, in run
    for work_request in control_stub.Control(get_responses()):
  File "<https://builds.apache.org/job/beam_PostCommit_Python2/ws/src/build/gradleenv/1866363813/local/lib/python2.7/site-packages/grpc/_channel.py",>
line 413, in next
    return self._next()
  File "<https://builds.apache.org/job/beam_PostCommit_Python2/ws/src/build/gradleenv/1866363813/local/lib/python2.7/site-packages/grpc/_channel.py",>
line 703, in _next
    raise self
_MultiThreadedRendezvous: <_MultiThreadedRendezvous of RPC that terminated with:
	status = StatusCode.UNAVAILABLE
	details = "Socket closed"
	debug_error_string = "{"created":"@1576864846.754898294","description":"Error received from
peer ipv4:127.0.0.1:34901","file":"src/core/lib/surface/call.cc","file_line":1056,"grpc_message":"Socket
closed","grpc_status":14}"
>

Exception in thread read_state:
Traceback (most recent call last):
  File "/usr/lib/python2.7/threading.py", line 801, in __bootstrap_inner
    self.run()
  File "/usr/lib/python2.7/threading.py", line 754, in run
    self.__target(*self.__args, **self.__kwargs)
  File "<https://builds.apache.org/job/beam_PostCommit_Python2/ws/src/sdks/python/apache_beam/runners/worker/sdk_worker.py",>
line 614, in pull_responses
    for response in responses:
  File "<https://builds.apache.org/job/beam_PostCommit_Python2/ws/src/build/gradleenv/1866363813/local/lib/python2.7/site-packages/grpc/_channel.py",>
line 413, in next
    return self._next()
  File "<https://builds.apache.org/job/beam_PostCommit_Python2/ws/src/build/gradleenv/1866363813/local/lib/python2.7/site-packages/grpc/_channel.py",>
line 703, in _next
    raise self
_MultiThreadedRendezvous: <_MultiThreadedRendezvous of RPC that terminated with:
	status = StatusCode.UNAVAILABLE
	details = "Socket closed"
	debug_error_string = "{"created":"@1576864846.754890336","description":"Error received from
peer ipv4:127.0.0.1:45927","file":"src/core/lib/surface/call.cc","file_line":1056,"grpc_message":"Socket
closed","grpc_status":14}"
>

ERROR:apache_beam.runners.worker.data_plane:Failed to read inputs in the data plane.
Traceback (most recent call last):
  File "<https://builds.apache.org/job/beam_PostCommit_Python2/ws/src/sdks/python/apache_beam/runners/worker/data_plane.py",>
line 318, in _read_inputs
    for elements in elements_iterator:
  File "<https://builds.apache.org/job/beam_PostCommit_Python2/ws/src/build/gradleenv/1866363813/local/lib/python2.7/site-packages/grpc/_channel.py",>
line 413, in next
    return self._next()
  File "<https://builds.apache.org/job/beam_PostCommit_Python2/ws/src/build/gradleenv/1866363813/local/lib/python2.7/site-packages/grpc/_channel.py",>
line 703, in _next
    raise self
_MultiThreadedRendezvous: <_MultiThreadedRendezvous of RPC that terminated with:
	status = StatusCode.UNAVAILABLE
	details = "Socket closed"
	debug_error_string = "{"created":"@1576864846.754861142","description":"Error received from
peer ipv4:127.0.0.1:33863","file":"src/core/lib/surface/call.cc","file_line":1056,"grpc_message":"Socket
closed","grpc_status":14}"
>
Exception in thread read_grpc_client_inputs:
Traceback (most recent call last):
  File "/usr/lib/python2.7/threading.py", line 801, in __bootstrap_inner
    self.run()
  File "/usr/lib/python2.7/threading.py", line 754, in run
    self.__target(*self.__args, **self.__kwargs)
  File "<https://builds.apache.org/job/beam_PostCommit_Python2/ws/src/sdks/python/apache_beam/runners/worker/data_plane.py",>
line 333, in <lambda>
    target=lambda: self._read_inputs(elements_iterator),
  File "<https://builds.apache.org/job/beam_PostCommit_Python2/ws/src/sdks/python/apache_beam/runners/worker/data_plane.py",>
line 318, in _read_inputs
    for elements in elements_iterator:
  File "<https://builds.apache.org/job/beam_PostCommit_Python2/ws/src/build/gradleenv/1866363813/local/lib/python2.7/site-packages/grpc/_channel.py",>
line 413, in next
    return self._next()
  File "<https://builds.apache.org/job/beam_PostCommit_Python2/ws/src/build/gradleenv/1866363813/local/lib/python2.7/site-packages/grpc/_channel.py",>
line 703, in _next
    raise self
_MultiThreadedRendezvous: <_MultiThreadedRendezvous of RPC that terminated with:
	status = StatusCode.UNAVAILABLE
	details = "Socket closed"
	debug_error_string = "{"created":"@1576864846.754861142","description":"Error received from
peer ipv4:127.0.0.1:33863","file":"src/core/lib/surface/call.cc","file_line":1056,"grpc_message":"Socket
closed","grpc_status":14}"
>


> Task :sdks:python:test-suites:portable:py2:postCommitPy2

> Task :sdks:python:test-suites:dataflow:py2:postCommitIT
test_leader_board_it (apache_beam.examples.complete.game.leader_board_it_test.LeaderBoardIT)
... ok
<https://builds.apache.org/job/beam_PostCommit_Python2/ws/src/sdks/python/apache_beam/io/gcp/bigquery_file_loads.py>:769:
BeamDeprecationWarning: options is deprecated since First stable release. References to <pipeline>.options
will not be supported
  temp_location = p.options.view_as(GoogleCloudOptions).temp_location
test_wordcount_fnapi_it (apache_beam.examples.wordcount_it_test.WordCountIT) ... ok
test_wordcount_it (apache_beam.examples.wordcount_it_test.WordCountIT) ... ok
<https://builds.apache.org/job/beam_PostCommit_Python2/ws/src/sdks/python/apache_beam/io/gcp/bigquery_read_it_test.py>:261:
FutureWarning: _ReadFromBigQuery is experimental.
  query=self.query, use_standard_sql=True, project=self.project))
<https://builds.apache.org/job/beam_PostCommit_Python2/ws/src/sdks/python/apache_beam/io/gcp/bigquery.py>:1593:
BeamDeprecationWarning: options is deprecated since First stable release. References to <pipeline>.options
will not be supported
  temp_location = pcoll.pipeline.options.view_as(
test_game_stats_it (apache_beam.examples.complete.game.game_stats_it_test.GameStatsIT) ...
ok
<https://builds.apache.org/job/beam_PostCommit_Python2/ws/src/sdks/python/apache_beam/io/gcp/bigquery_read_it_test.py>:155:
FutureWarning: _ReadFromBigQuery is experimental.
  query=self.query, use_standard_sql=True, project=self.project))
test_hourly_team_score_it (apache_beam.examples.complete.game.hourly_team_score_it_test.HourlyTeamScoreIT)
... ok
<https://builds.apache.org/job/beam_PostCommit_Python2/ws/src/sdks/python/apache_beam/io/gcp/bigquery_test.py>:755:
BeamDeprecationWarning: options is deprecated since First stable release. References to <pipeline>.options
will not be supported
  streaming = self.test_pipeline.options.view_as(StandardOptions).streaming
<https://builds.apache.org/job/beam_PostCommit_Python2/ws/src/sdks/python/apache_beam/io/gcp/bigquery.py>:1409:
BeamDeprecationWarning: options is deprecated since First stable release. References to <pipeline>.options
will not be supported
  experiments = p.options.view_as(DebugOptions).experiments or []
test_avro_it (apache_beam.examples.fastavro_it_test.FastavroIT) ... ok
<https://builds.apache.org/job/beam_PostCommit_Python2/ws/src/sdks/python/apache_beam/io/gcp/bigquery.py>:1409:
BeamDeprecationWarning: options is deprecated since First stable release. References to <pipeline>.options
will not be supported
  experiments = p.options.view_as(DebugOptions).experiments or []
<https://builds.apache.org/job/beam_PostCommit_Python2/ws/src/sdks/python/apache_beam/io/gcp/bigquery_file_loads.py>:769:
BeamDeprecationWarning: options is deprecated since First stable release. References to <pipeline>.options
will not be supported
  temp_location = p.options.view_as(GoogleCloudOptions).temp_location
test_user_score_it (apache_beam.examples.complete.game.user_score_it_test.UserScoreIT) ...
ok
<https://builds.apache.org/job/beam_PostCommit_Python2/ws/src/sdks/python/apache_beam/io/gcp/bigquery.py>:1406:
BeamDeprecationWarning: options is deprecated since First stable release. References to <pipeline>.options
will not be supported
  self.table_reference.projectId = pcoll.pipeline.options.view_as(
test_bigquery_read_1M_python (apache_beam.io.gcp.bigquery_io_read_it_test.BigqueryIOReadIT)
... ok
test_multiple_destinations_transform (apache_beam.io.gcp.bigquery_test.BigQueryStreamingInsertTransformIntegrationTests)
... ok
test_value_provider_transform (apache_beam.io.gcp.bigquery_test.BigQueryStreamingInsertTransformIntegrationTests)
... ok
test_copy (apache_beam.io.gcp.gcsio_integration_test.GcsIOIntegrationTest) ... ok
test_copy_batch (apache_beam.io.gcp.gcsio_integration_test.GcsIOIntegrationTest) ... ok
test_copy_batch_kms (apache_beam.io.gcp.gcsio_integration_test.GcsIOIntegrationTest) ... ok
test_copy_batch_rewrite_token (apache_beam.io.gcp.gcsio_integration_test.GcsIOIntegrationTest)
... ok
test_copy_kms (apache_beam.io.gcp.gcsio_integration_test.GcsIOIntegrationTest) ... ok
test_copy_rewrite_token (apache_beam.io.gcp.gcsio_integration_test.GcsIOIntegrationTest) ...
ok
<https://builds.apache.org/job/beam_PostCommit_Python2/ws/src/sdks/python/apache_beam/io/gcp/big_query_query_to_table_pipeline.py>:73:
BeamDeprecationWarning: BigQuerySink is deprecated since 2.11.0. Use WriteToBigQuery instead.
  kms_key=kms_key))
test_iobase_source (apache_beam.io.gcp.bigquery_read_it_test.ReadNewTypesTests) ... ok
test_native_source (apache_beam.io.gcp.bigquery_read_it_test.ReadNewTypesTests) ... ok
<https://builds.apache.org/job/beam_PostCommit_Python2/ws/src/sdks/python/apache_beam/io/fileio_test.py>:296:
FutureWarning: MatchAll is experimental.
  | 'GetPath' >> beam.Map(lambda metadata: metadata.path))
<https://builds.apache.org/job/beam_PostCommit_Python2/ws/src/sdks/python/apache_beam/io/fileio_test.py>:307:
FutureWarning: MatchAll is experimental.
  | 'Checksums' >> beam.Map(compute_hash))
<https://builds.apache.org/job/beam_PostCommit_Python2/ws/src/sdks/python/apache_beam/io/fileio_test.py>:307:
FutureWarning: ReadMatches is experimental.
  | 'Checksums' >> beam.Map(compute_hash))
test_iobase_source (apache_beam.io.gcp.bigquery_read_it_test.ReadTests) ... ok
test_native_source (apache_beam.io.gcp.bigquery_read_it_test.ReadTests) ... ok
test_bqfl_streaming (apache_beam.io.gcp.bigquery_file_loads_test.BigQueryFileLoadsIT) ...
SKIP: TestStream is not supported on TestDataflowRunner
test_multiple_destinations_transform (apache_beam.io.gcp.bigquery_file_loads_test.BigQueryFileLoadsIT)
... ok
test_one_job_fails_all_jobs_fail (apache_beam.io.gcp.bigquery_file_loads_test.BigQueryFileLoadsIT)
... ok
test_big_query_legacy_sql (apache_beam.io.gcp.big_query_query_to_table_it_test.BigQueryQueryToTableIT)
... ok
test_big_query_new_types (apache_beam.io.gcp.big_query_query_to_table_it_test.BigQueryQueryToTableIT)
... ok
test_big_query_standard_sql (apache_beam.io.gcp.big_query_query_to_table_it_test.BigQueryQueryToTableIT)
... ok
test_big_query_standard_sql_kms_key_native (apache_beam.io.gcp.big_query_query_to_table_it_test.BigQueryQueryToTableIT)
... ok
Runs streaming Dataflow job and verifies that user metrics are reported ... ERROR
test_transform_on_gcs (apache_beam.io.fileio_test.MatchIntegrationTest) ... ok
test_file_loads (apache_beam.io.gcp.bigquery_test.PubSubBigQueryIT) ... SKIP: https://issuetracker.google.com/issues/118375066
test_streaming_inserts (apache_beam.io.gcp.bigquery_test.PubSubBigQueryIT) ... ok
test_parquetio_it (apache_beam.io.parquetio_it_test.TestParquetIT) ... ok
test_job_python_from_python_it (apache_beam.transforms.external_test_it.ExternalTransformIT)
... ok
test_streaming_data_only (apache_beam.io.gcp.pubsub_integration_test.PubSubIntegrationTest)
... ok
test_streaming_with_attributes (apache_beam.io.gcp.pubsub_integration_test.PubSubIntegrationTest)
... ok
test_big_query_write (apache_beam.io.gcp.bigquery_write_it_test.BigQueryWriteIntegrationTests)
... ok
test_big_query_write_new_types (apache_beam.io.gcp.bigquery_write_it_test.BigQueryWriteIntegrationTests)
... ok
test_big_query_write_schema_autodetect (apache_beam.io.gcp.bigquery_write_it_test.BigQueryWriteIntegrationTests)
... SKIP: DataflowRunner does not support schema autodetection
test_big_query_write_without_schema (apache_beam.io.gcp.bigquery_write_it_test.BigQueryWriteIntegrationTests)
... ok
test_metrics_fnapi_it (apache_beam.runners.dataflow.dataflow_exercise_metrics_pipeline_test.ExerciseMetricsPipelineTest)
... ok
test_metrics_it (apache_beam.runners.dataflow.dataflow_exercise_metrics_pipeline_test.ExerciseMetricsPipelineTest)
... ok
test_datastore_write_limit (apache_beam.io.gcp.datastore_write_it_test.DatastoreWriteIT) ...
ok

======================================================================
ERROR: test_streaming_wordcount_it (apache_beam.examples.streaming_wordcount_it_test.StreamingWordCountIT)
----------------------------------------------------------------------
Traceback (most recent call last):
  File "<https://builds.apache.org/job/beam_PostCommit_Python2/ws/src/sdks/python/apache_beam/examples/streaming_wordcount_it_test.py",>
line 57, in setUp
    self.pub_client.topic_path(self.project, INPUT_TOPIC + self.uuid))
  File "<https://builds.apache.org/job/beam_PostCommit_Python2/ws/src/build/gradleenv/-194514014/local/lib/python2.7/site-packages/google/cloud/pubsub_v1/_gapic.py",>
line 40, in <lambda>
    fx = lambda self, *a, **kw: wrapped_fx(self.api, *a, **kw)  # noqa
  File "<https://builds.apache.org/job/beam_PostCommit_Python2/ws/src/build/gradleenv/-194514014/local/lib/python2.7/site-packages/google/cloud/pubsub_v1/gapic/publisher_client.py",>
line 332, in create_topic
    request, retry=retry, timeout=timeout, metadata=metadata
  File "<https://builds.apache.org/job/beam_PostCommit_Python2/ws/src/build/gradleenv/-194514014/local/lib/python2.7/site-packages/google/api_core/gapic_v1/method.py",>
line 143, in __call__
    return wrapped_func(*args, **kwargs)
  File "<https://builds.apache.org/job/beam_PostCommit_Python2/ws/src/build/gradleenv/-194514014/local/lib/python2.7/site-packages/google/api_core/retry.py",>
line 286, in retry_wrapped_func
    on_error=on_error,
  File "<https://builds.apache.org/job/beam_PostCommit_Python2/ws/src/build/gradleenv/-194514014/local/lib/python2.7/site-packages/google/api_core/retry.py",>
line 184, in retry_target
    return target()
  File "<https://builds.apache.org/job/beam_PostCommit_Python2/ws/src/build/gradleenv/-194514014/local/lib/python2.7/site-packages/google/api_core/timeout.py",>
line 214, in func_with_timeout
    return func(*args, **kwargs)
  File "<https://builds.apache.org/job/beam_PostCommit_Python2/ws/src/build/gradleenv/-194514014/local/lib/python2.7/site-packages/google/api_core/grpc_helpers.py",>
line 59, in error_remapped_callable
    six.raise_from(exceptions.from_grpc_error(exc), exc)
  File "<https://builds.apache.org/job/beam_PostCommit_Python2/ws/src/build/gradleenv/-194514014/local/lib/python2.7/site-packages/six.py",>
line 740, in raise_from
    raise value
ResourceExhausted: 429 Your project has exceeded a limit: (type="topics-per-project", current=10000,
maximum=10000).
-------------------- >> begin captured logging << --------------------
apache_beam.options.pipeline_options: WARNING: --region not set; will default to us-central1.
Future releases of Beam will require the user to set --region explicitly, or else have a default
set via the gcloud tool. https://cloud.google.com/compute/docs/regions-zones
google.auth.transport._http_client: DEBUG: Making request: GET http://169.254.169.254
google.auth.transport._http_client: DEBUG: Making request: GET http://metadata.google.internal/computeMetadata/v1/project/project-id
google.auth.transport.requests: DEBUG: Making request: GET http://metadata.google.internal/computeMetadata/v1/instance/service-accounts/default/?recursive=true
urllib3.connectionpool: DEBUG: Starting new HTTP connection (1): metadata.google.internal:80
urllib3.connectionpool: DEBUG: http://metadata.google.internal:80 "GET /computeMetadata/v1/instance/service-accounts/default/?recursive=true
HTTP/1.1" 200 144
google.auth.transport.requests: DEBUG: Making request: GET http://metadata.google.internal/computeMetadata/v1/instance/service-accounts/844138762903-compute@developer.gserviceaccount.com/token
urllib3.connectionpool: DEBUG: http://metadata.google.internal:80 "GET /computeMetadata/v1/instance/service-accounts/844138762903-compute@developer.gserviceaccount.com/token
HTTP/1.1" 200 181
--------------------- >> end captured logging << ---------------------

======================================================================
ERROR: Runs streaming Dataflow job and verifies that user metrics are reported
----------------------------------------------------------------------
Traceback (most recent call last):
  File "<https://builds.apache.org/job/beam_PostCommit_Python2/ws/src/sdks/python/apache_beam/runners/dataflow/dataflow_exercise_streaming_metrics_pipeline_test.py",>
line 65, in setUp
    self.pub_client.topic_path(self.project, self.input_topic_name))
  File "<https://builds.apache.org/job/beam_PostCommit_Python2/ws/src/build/gradleenv/-194514014/local/lib/python2.7/site-packages/google/cloud/pubsub_v1/_gapic.py",>
line 40, in <lambda>
    fx = lambda self, *a, **kw: wrapped_fx(self.api, *a, **kw)  # noqa
  File "<https://builds.apache.org/job/beam_PostCommit_Python2/ws/src/build/gradleenv/-194514014/local/lib/python2.7/site-packages/google/cloud/pubsub_v1/gapic/publisher_client.py",>
line 332, in create_topic
    request, retry=retry, timeout=timeout, metadata=metadata
  File "<https://builds.apache.org/job/beam_PostCommit_Python2/ws/src/build/gradleenv/-194514014/local/lib/python2.7/site-packages/google/api_core/gapic_v1/method.py",>
line 143, in __call__
    return wrapped_func(*args, **kwargs)
  File "<https://builds.apache.org/job/beam_PostCommit_Python2/ws/src/build/gradleenv/-194514014/local/lib/python2.7/site-packages/google/api_core/retry.py",>
line 286, in retry_wrapped_func
    on_error=on_error,
  File "<https://builds.apache.org/job/beam_PostCommit_Python2/ws/src/build/gradleenv/-194514014/local/lib/python2.7/site-packages/google/api_core/retry.py",>
line 184, in retry_target
    return target()
  File "<https://builds.apache.org/job/beam_PostCommit_Python2/ws/src/build/gradleenv/-194514014/local/lib/python2.7/site-packages/google/api_core/timeout.py",>
line 214, in func_with_timeout
    return func(*args, **kwargs)
  File "<https://builds.apache.org/job/beam_PostCommit_Python2/ws/src/build/gradleenv/-194514014/local/lib/python2.7/site-packages/google/api_core/grpc_helpers.py",>
line 59, in error_remapped_callable
    six.raise_from(exceptions.from_grpc_error(exc), exc)
  File "<https://builds.apache.org/job/beam_PostCommit_Python2/ws/src/build/gradleenv/-194514014/local/lib/python2.7/site-packages/six.py",>
line 740, in raise_from
    raise value
ResourceExhausted: 429 Your project has exceeded a limit: (type="topics-per-project", current=10000,
maximum=10000).
-------------------- >> begin captured logging << --------------------
apache_beam.options.pipeline_options: WARNING: --region not set; will default to us-central1.
Future releases of Beam will require the user to set --region explicitly, or else have a default
set via the gcloud tool. https://cloud.google.com/compute/docs/regions-zones
google.auth.transport._http_client: DEBUG: Making request: GET http://169.254.169.254
google.auth.transport._http_client: DEBUG: Making request: GET http://metadata.google.internal/computeMetadata/v1/project/project-id
google.auth.transport.requests: DEBUG: Making request: GET http://metadata.google.internal/computeMetadata/v1/instance/service-accounts/default/?recursive=true
urllib3.connectionpool: DEBUG: Starting new HTTP connection (1): metadata.google.internal:80
urllib3.connectionpool: DEBUG: http://metadata.google.internal:80 "GET /computeMetadata/v1/instance/service-accounts/default/?recursive=true
HTTP/1.1" 200 144
google.auth.transport.requests: DEBUG: Making request: GET http://metadata.google.internal/computeMetadata/v1/instance/service-accounts/844138762903-compute@developer.gserviceaccount.com/token
urllib3.connectionpool: DEBUG: http://metadata.google.internal:80 "GET /computeMetadata/v1/instance/service-accounts/844138762903-compute@developer.gserviceaccount.com/token
HTTP/1.1" 200 181
--------------------- >> end captured logging << ---------------------

----------------------------------------------------------------------
XML: nosetests-postCommitIT-df.xml
----------------------------------------------------------------------
XML: <https://builds.apache.org/job/beam_PostCommit_Python2/ws/src/sdks/python/nosetests.xml>
----------------------------------------------------------------------
Ran 47 tests in 3378.308s

FAILED (SKIP=4, errors=2)

> Task :sdks:python:test-suites:dataflow:py2:postCommitIT FAILED

FAILURE: Build failed with an exception.

* Where:
Build file '<https://builds.apache.org/job/beam_PostCommit_Python2/ws/src/sdks/python/test-suites/dataflow/py2/build.gradle'>
line: 85

* What went wrong:
Execution failed for task ':sdks:python:test-suites:dataflow:py2:postCommitIT'.
> Process 'command 'sh'' finished with non-zero exit value 1

* Try:
Run with --stacktrace option to get the stack trace. Run with --info or --debug option to
get more log output. Run with --scan to get full insights.

* Get more help at https://help.gradle.org

Deprecated Gradle features were used in this build, making it incompatible with Gradle 6.0.
Use '--warning-mode all' to show the individual deprecation warnings.
See https://docs.gradle.org/5.2.1/userguide/command_line_interface.html#sec:command_line_warnings

BUILD FAILED in 57m 20s
120 actionable tasks: 94 executed, 23 from cache, 3 up-to-date

Publishing build scan...
https://gradle.com/s/wzhlmjxli3ss2

Build step 'Invoke Gradle script' changed build result to FAILURE
Build step 'Invoke Gradle script' marked build as failure

---------------------------------------------------------------------
To unsubscribe, e-mail: builds-unsubscribe@beam.apache.org
For additional commands, e-mail: builds-help@beam.apache.org


Mime
View raw message