beam-builds mailing list archives

Site index · List index
Message view « Date » · « Thread »
Top « Date » · « Thread »
From Apache Jenkins Server <jenk...@builds.apache.org>
Subject Build failed in Jenkins: beam_PostCommit_Py_ValCont #5117
Date Tue, 24 Dec 2019 13:10:06 GMT
See <https://builds.apache.org/job/beam_PostCommit_Py_ValCont/5117/display/redirect?page=changes>

Changes:

[echauchot] [BEAM-9019] Improve Encoders: replace as much as possible of catalyst


------------------------------------------
[...truncated 621.43 KB...]
copying apache_beam/transforms/dataflow_distribution_counter_test.py -> apache-beam-2.19.0.dev0/apache_beam/transforms
copying apache_beam/transforms/display.py -> apache-beam-2.19.0.dev0/apache_beam/transforms
copying apache_beam/transforms/display_test.py -> apache-beam-2.19.0.dev0/apache_beam/transforms
copying apache_beam/transforms/dofn_lifecycle_test.py -> apache-beam-2.19.0.dev0/apache_beam/transforms
copying apache_beam/transforms/environments.py -> apache-beam-2.19.0.dev0/apache_beam/transforms
copying apache_beam/transforms/environments_test.py -> apache-beam-2.19.0.dev0/apache_beam/transforms
copying apache_beam/transforms/external.py -> apache-beam-2.19.0.dev0/apache_beam/transforms
copying apache_beam/transforms/external_test.py -> apache-beam-2.19.0.dev0/apache_beam/transforms
copying apache_beam/transforms/external_test_it.py -> apache-beam-2.19.0.dev0/apache_beam/transforms
copying apache_beam/transforms/external_test_py3.py -> apache-beam-2.19.0.dev0/apache_beam/transforms
copying apache_beam/transforms/external_test_py37.py -> apache-beam-2.19.0.dev0/apache_beam/transforms
copying apache_beam/transforms/ptransform.py -> apache-beam-2.19.0.dev0/apache_beam/transforms
copying apache_beam/transforms/ptransform_test.py -> apache-beam-2.19.0.dev0/apache_beam/transforms
copying apache_beam/transforms/py_dataflow_distribution_counter.py -> apache-beam-2.19.0.dev0/apache_beam/transforms
copying apache_beam/transforms/sideinputs.py -> apache-beam-2.19.0.dev0/apache_beam/transforms
copying apache_beam/transforms/sideinputs_test.py -> apache-beam-2.19.0.dev0/apache_beam/transforms
copying apache_beam/transforms/stats.py -> apache-beam-2.19.0.dev0/apache_beam/transforms
copying apache_beam/transforms/stats_test.py -> apache-beam-2.19.0.dev0/apache_beam/transforms
copying apache_beam/transforms/timeutil.py -> apache-beam-2.19.0.dev0/apache_beam/transforms
copying apache_beam/transforms/transforms_keyword_only_args_test_py3.py -> apache-beam-2.19.0.dev0/apache_beam/transforms
copying apache_beam/transforms/trigger.py -> apache-beam-2.19.0.dev0/apache_beam/transforms
copying apache_beam/transforms/trigger_test.py -> apache-beam-2.19.0.dev0/apache_beam/transforms
copying apache_beam/transforms/userstate.py -> apache-beam-2.19.0.dev0/apache_beam/transforms
copying apache_beam/transforms/userstate_test.py -> apache-beam-2.19.0.dev0/apache_beam/transforms
copying apache_beam/transforms/util.py -> apache-beam-2.19.0.dev0/apache_beam/transforms
copying apache_beam/transforms/util_test.py -> apache-beam-2.19.0.dev0/apache_beam/transforms
copying apache_beam/transforms/window.py -> apache-beam-2.19.0.dev0/apache_beam/transforms
copying apache_beam/transforms/window_test.py -> apache-beam-2.19.0.dev0/apache_beam/transforms
copying apache_beam/transforms/write_ptransform_test.py -> apache-beam-2.19.0.dev0/apache_beam/transforms
copying apache_beam/typehints/__init__.py -> apache-beam-2.19.0.dev0/apache_beam/typehints
copying apache_beam/typehints/decorators.py -> apache-beam-2.19.0.dev0/apache_beam/typehints
copying apache_beam/typehints/decorators_test.py -> apache-beam-2.19.0.dev0/apache_beam/typehints
copying apache_beam/typehints/decorators_test_py3.py -> apache-beam-2.19.0.dev0/apache_beam/typehints
copying apache_beam/typehints/native_type_compatibility.py -> apache-beam-2.19.0.dev0/apache_beam/typehints
copying apache_beam/typehints/native_type_compatibility_test.py -> apache-beam-2.19.0.dev0/apache_beam/typehints
copying apache_beam/typehints/opcodes.py -> apache-beam-2.19.0.dev0/apache_beam/typehints
copying apache_beam/typehints/schemas.py -> apache-beam-2.19.0.dev0/apache_beam/typehints
copying apache_beam/typehints/schemas_test.py -> apache-beam-2.19.0.dev0/apache_beam/typehints
copying apache_beam/typehints/trivial_inference.py -> apache-beam-2.19.0.dev0/apache_beam/typehints
copying apache_beam/typehints/trivial_inference_test.py -> apache-beam-2.19.0.dev0/apache_beam/typehints
copying apache_beam/typehints/trivial_inference_test_py3.py -> apache-beam-2.19.0.dev0/apache_beam/typehints
copying apache_beam/typehints/typecheck.py -> apache-beam-2.19.0.dev0/apache_beam/typehints
copying apache_beam/typehints/typed_pipeline_test.py -> apache-beam-2.19.0.dev0/apache_beam/typehints
copying apache_beam/typehints/typed_pipeline_test_py3.py -> apache-beam-2.19.0.dev0/apache_beam/typehints
copying apache_beam/typehints/typehints.py -> apache-beam-2.19.0.dev0/apache_beam/typehints
copying apache_beam/typehints/typehints_test.py -> apache-beam-2.19.0.dev0/apache_beam/typehints
copying apache_beam/typehints/typehints_test_py3.py -> apache-beam-2.19.0.dev0/apache_beam/typehints
copying apache_beam/utils/__init__.py -> apache-beam-2.19.0.dev0/apache_beam/utils
copying apache_beam/utils/annotations.py -> apache-beam-2.19.0.dev0/apache_beam/utils
copying apache_beam/utils/annotations_test.py -> apache-beam-2.19.0.dev0/apache_beam/utils
copying apache_beam/utils/counters.pxd -> apache-beam-2.19.0.dev0/apache_beam/utils
copying apache_beam/utils/counters.py -> apache-beam-2.19.0.dev0/apache_beam/utils
copying apache_beam/utils/counters_test.py -> apache-beam-2.19.0.dev0/apache_beam/utils
copying apache_beam/utils/interactive_utils.py -> apache-beam-2.19.0.dev0/apache_beam/utils
copying apache_beam/utils/plugin.py -> apache-beam-2.19.0.dev0/apache_beam/utils
copying apache_beam/utils/processes.py -> apache-beam-2.19.0.dev0/apache_beam/utils
copying apache_beam/utils/processes_test.py -> apache-beam-2.19.0.dev0/apache_beam/utils
copying apache_beam/utils/profiler.py -> apache-beam-2.19.0.dev0/apache_beam/utils
copying apache_beam/utils/proto_utils.py -> apache-beam-2.19.0.dev0/apache_beam/utils
copying apache_beam/utils/retry.py -> apache-beam-2.19.0.dev0/apache_beam/utils
copying apache_beam/utils/retry_test.py -> apache-beam-2.19.0.dev0/apache_beam/utils
copying apache_beam/utils/subprocess_server.py -> apache-beam-2.19.0.dev0/apache_beam/utils
copying apache_beam/utils/thread_pool_executor.py -> apache-beam-2.19.0.dev0/apache_beam/utils
copying apache_beam/utils/thread_pool_executor_test.py -> apache-beam-2.19.0.dev0/apache_beam/utils
copying apache_beam/utils/timestamp.py -> apache-beam-2.19.0.dev0/apache_beam/utils
copying apache_beam/utils/timestamp_test.py -> apache-beam-2.19.0.dev0/apache_beam/utils
copying apache_beam/utils/urns.py -> apache-beam-2.19.0.dev0/apache_beam/utils
copying apache_beam/utils/windowed_value.pxd -> apache-beam-2.19.0.dev0/apache_beam/utils
copying apache_beam/utils/windowed_value.py -> apache-beam-2.19.0.dev0/apache_beam/utils
copying apache_beam/utils/windowed_value_test.py -> apache-beam-2.19.0.dev0/apache_beam/utils
Writing apache-beam-2.19.0.dev0/setup.cfg
creating dist
Creating tar archive
removing 'apache-beam-2.19.0.dev0' (and everything under it)
SDK_LOCATION=$(find dist/apache-beam-*.tar.gz)
find dist/apache-beam-*.tar.gz

# Run ValidatesRunner tests on Google Cloud Dataflow service
echo ">>> RUNNING DATAFLOW RUNNER VALIDATESCONTAINER TEST"
>>> RUNNING DATAFLOW RUNNER VALIDATESCONTAINER TEST
python setup.py nosetests \
  --attr ValidatesContainer \
  --nologcapture \
  --processes=1 \
  --process-timeout=900 \
  --with-xunitmp \
  --xunitmp-file=$XUNIT_FILE \
  --ignore-files '.*py3\d?\.py$' \
  --test-pipeline-options=" \
    --runner=TestDataflowRunner \
    --project=$PROJECT \
    --worker_harness_container_image=$CONTAINER:$TAG \
    --staging_location=$GCS_LOCATION/staging-validatesrunner-test \
    --temp_location=$GCS_LOCATION/temp-validatesrunner-test \
    --output=$GCS_LOCATION/output \
    --sdk_location=$SDK_LOCATION \
    --num_workers=1"
setup.py:236: UserWarning: You are using Apache Beam with Python 2. New releases of Apache
Beam will soon support Python 3 only.
  'You are using Apache Beam with Python 2. '
<https://builds.apache.org/job/beam_PostCommit_Py_ValCont/ws/src/sdks/python/container/venv/python/local/lib/python2.7/site-packages/setuptools/dist.py>:476:
UserWarning: Normalizing '2.19.0.dev' to '2.19.0.dev0'
  normalized_version,
running nosetests
running egg_info
<https://builds.apache.org/job/beam_PostCommit_Py_ValCont/ws/src/sdks/python/gen_protos.py>:55:
UserWarning: Installing grpcio-tools is recommended for development.
  warnings.warn('Installing grpcio-tools is recommended for development.')
writing requirements to apache_beam.egg-info/requires.txt
writing apache_beam.egg-info/PKG-INFO
writing top-level names to apache_beam.egg-info/top_level.txt
writing dependency_links to apache_beam.egg-info/dependency_links.txt
writing entry points to apache_beam.egg-info/entry_points.txt
reading manifest file 'apache_beam.egg-info/SOURCES.txt'
reading manifest template 'MANIFEST.in'
warning: no files found matching 'README.md'
warning: no files found matching 'NOTICE'
warning: no files found matching 'LICENSE'
writing manifest file 'apache_beam.egg-info/SOURCES.txt'
<https://builds.apache.org/job/beam_PostCommit_Py_ValCont/ws/src/sdks/python/apache_beam/__init__.py>:84:
UserWarning: You are using Apache Beam with Python 2. New releases of Apache Beam will soon
support Python 3 only.
  'You are using Apache Beam with Python 2. '
No handlers could be found for logger "apache_beam.io.gcp.datastore.v1.datastoreio"
WARNING:root:python-snappy is not installed; some tests will be skipped.
WARNING:root:Tensorflow is not installed, so skipping some tests.
WARNING:apache_beam.runners.interactive.interactive_environment:Interactive Beam requires
Python 3.5.3+.
WARNING:apache_beam.runners.interactive.interactive_environment:Dependencies required for
Interactive Beam PCollection visualization are not available, please use: `pip install apache-beam[interactive]`
to install necessary dependencies to enable all data visualization features.
WARNING:apache_beam.runners.interactive.interactive_environment:You cannot use Interactive
Beam features when you are not in an interactive environment such as a Jupyter notebook or
ipython terminal.
WARNING:root:Make sure that locally built Python SDK docker image has Python 2.7 interpreter.
<https://builds.apache.org/job/beam_PostCommit_Py_ValCont/ws/src/sdks/python/apache_beam/transforms/trigger_test.py>:506:
YAMLLoadWarning: calling yaml.load_all() without Loader=... is deprecated, as the default
Loader is unsafe. Please read https://msg.pyyaml.org/load for full details.
  for spec in yaml.load_all(open(transcript_filename)):
WARNING:apache_beam.options.pipeline_options:--region not set; will default to us-central1.
Future releases of Beam will require the user to set --region explicitly, or else have a default
set via the gcloud tool. https://cloud.google.com/compute/docs/regions-zones
WARNING:apache_beam.options.pipeline_options:--region not set; will default to us-central1.
Future releases of Beam will require the user to set --region explicitly, or else have a default
set via the gcloud tool. https://cloud.google.com/compute/docs/regions-zones
test_wordcount_fnapi_it (apache_beam.examples.wordcount_it_test.WordCountIT) ... ERROR
test_metrics_fnapi_it (apache_beam.runners.dataflow.dataflow_exercise_metrics_pipeline_test.ExerciseMetricsPipelineTest)
... ERROR

======================================================================
ERROR: test suite for <class 'apache_beam.examples.wordcount_it_test.WordCountIT'>
----------------------------------------------------------------------
Traceback (most recent call last):
  File "<https://builds.apache.org/job/beam_PostCommit_Py_ValCont/ws/src/sdks/python/container/venv/python/local/lib/python2.7/site-packages/nose/plugins/multiprocess.py",>
line 812, in run
    test(orig)
  File "<https://builds.apache.org/job/beam_PostCommit_Py_ValCont/ws/src/sdks/python/container/venv/python/local/lib/python2.7/site-packages/nose/suite.py",>
line 177, in __call__
    return self.run(*arg, **kw)
  File "<https://builds.apache.org/job/beam_PostCommit_Py_ValCont/ws/src/sdks/python/container/venv/python/local/lib/python2.7/site-packages/nose/plugins/multiprocess.py",>
line 822, in run
    test.config.plugins.addError(test,err)
  File "<https://builds.apache.org/job/beam_PostCommit_Py_ValCont/ws/src/sdks/python/container/venv/python/local/lib/python2.7/site-packages/nose/plugins/manager.py",>
line 99, in __call__
    return self.call(*arg, **kw)
  File "<https://builds.apache.org/job/beam_PostCommit_Py_ValCont/ws/src/sdks/python/container/venv/python/local/lib/python2.7/site-packages/nose/plugins/manager.py",>
line 167, in simple
    result = meth(*arg, **kw)
  File "<https://builds.apache.org/job/beam_PostCommit_Py_ValCont/ws/src/sdks/python/container/venv/python/local/lib/python2.7/site-packages/nose/plugins/xunit.py",>
line 287, in addError
    tb = format_exception(err, self.encoding)
  File "<https://builds.apache.org/job/beam_PostCommit_Py_ValCont/ws/src/sdks/python/container/venv/python/local/lib/python2.7/site-packages/nose/pyversion.py",>
line 214, in format_exception
    ''.join(traceback.format_exception(*exc_info)),
  File "/usr/lib/python2.7/traceback.py", line 141, in format_exception
    list = list + format_tb(tb, limit)
  File "/usr/lib/python2.7/traceback.py", line 76, in format_tb
    return format_list(extract_tb(tb, limit))
  File "/usr/lib/python2.7/traceback.py", line 101, in extract_tb
    line = linecache.getline(filename, lineno, f.f_globals)
  File "<https://builds.apache.org/job/beam_PostCommit_Py_ValCont/ws/src/sdks/python/container/venv/python/lib/python2.7/linecache.py",>
line 14, in getline
    lines = getlines(filename, module_globals)
  File "<https://builds.apache.org/job/beam_PostCommit_Py_ValCont/ws/src/sdks/python/container/venv/python/lib/python2.7/linecache.py",>
line 41, in getlines
    return updatecache(filename, module_globals)
  File "<https://builds.apache.org/job/beam_PostCommit_Py_ValCont/ws/src/sdks/python/container/venv/python/lib/python2.7/linecache.py",>
line 132, in updatecache
    lines = fp.readlines()
  File "<https://builds.apache.org/job/beam_PostCommit_Py_ValCont/ws/src/sdks/python/container/venv/python/local/lib/python2.7/site-packages/nose/plugins/multiprocess.py",>
line 276, in signalhandler
    raise TimedOutException()
TimedOutException: '<nose.plugins.multiprocess.NoSharedFixtureContextSuite context=WordCountIT>'

======================================================================
ERROR: test_metrics_fnapi_it (apache_beam.runners.dataflow.dataflow_exercise_metrics_pipeline_test.ExerciseMetricsPipelineTest)
----------------------------------------------------------------------
Traceback (most recent call last):
  File "<https://builds.apache.org/job/beam_PostCommit_Py_ValCont/ws/src/sdks/python/container/venv/python/local/lib/python2.7/site-packages/nose/plugins/multiprocess.py",>
line 812, in run
    test(orig)
  File "<https://builds.apache.org/job/beam_PostCommit_Py_ValCont/ws/src/sdks/python/container/venv/python/local/lib/python2.7/site-packages/nose/case.py",>
line 45, in __call__
    return self.run(*arg, **kwarg)
  File "<https://builds.apache.org/job/beam_PostCommit_Py_ValCont/ws/src/sdks/python/container/venv/python/local/lib/python2.7/site-packages/nose/case.py",>
line 133, in run
    self.runTest(result)
  File "<https://builds.apache.org/job/beam_PostCommit_Py_ValCont/ws/src/sdks/python/container/venv/python/local/lib/python2.7/site-packages/nose/case.py",>
line 151, in runTest
    test(result)
  File "/usr/lib/python2.7/unittest/case.py", line 393, in __call__
    return self.run(*args, **kwds)
  File "/usr/lib/python2.7/unittest/case.py", line 329, in run
    testMethod()
  File "<https://builds.apache.org/job/beam_PostCommit_Py_ValCont/ws/src/sdks/python/apache_beam/runners/dataflow/dataflow_exercise_metrics_pipeline_test.py",>
line 56, in test_metrics_fnapi_it
    result = self.run_pipeline(experiment='beam_fn_api')
  File "<https://builds.apache.org/job/beam_PostCommit_Py_ValCont/ws/src/sdks/python/apache_beam/runners/dataflow/dataflow_exercise_metrics_pipeline_test.py",>
line 37, in run_pipeline
    test_pipeline = TestPipeline(is_integration_test=True)
  File "<https://builds.apache.org/job/beam_PostCommit_Py_ValCont/ws/src/sdks/python/apache_beam/testing/test_pipeline.py",>
line 107, in __init__
    super(TestPipeline, self).__init__(runner, options)
  File "<https://builds.apache.org/job/beam_PostCommit_Py_ValCont/ws/src/sdks/python/apache_beam/pipeline.py",>
line 183, in __init__
    errors = PipelineOptionsValidator(self._options, runner).validate()
  File "<https://builds.apache.org/job/beam_PostCommit_Py_ValCont/ws/src/sdks/python/apache_beam/options/pipeline_options_validator.py",>
line 111, in validate
    errors.extend(self.options.view_as(cls).validate(self))
  File "<https://builds.apache.org/job/beam_PostCommit_Py_ValCont/ws/src/sdks/python/apache_beam/options/pipeline_options.py",>
line 584, in validate
    self.view_as(GoogleCloudOptions).region = self._get_default_gcp_region()
  File "<https://builds.apache.org/job/beam_PostCommit_Py_ValCont/ws/src/sdks/python/apache_beam/options/pipeline_options.py",>
line 552, in _get_default_gcp_region
    raw_output = processes.check_output(cmd, stderr=DEVNULL)
  File "<https://builds.apache.org/job/beam_PostCommit_Py_ValCont/ws/src/sdks/python/apache_beam/utils/processes.py",>
line 83, in check_output
    out = subprocess.check_output(*args, **kwargs)
  File "/usr/lib/python2.7/subprocess.py", line 568, in check_output
    output, unused_err = process.communicate()
  File "/usr/lib/python2.7/subprocess.py", line 792, in communicate
    stdout = _eintr_retry_call(self.stdout.read)
  File "/usr/lib/python2.7/subprocess.py", line 476, in _eintr_retry_call
    return func(*args)
  File "<https://builds.apache.org/job/beam_PostCommit_Py_ValCont/ws/src/sdks/python/container/venv/python/local/lib/python2.7/site-packages/nose/plugins/multiprocess.py",>
line 276, in signalhandler
    raise TimedOutException()
TimedOutException: 'test_metrics_fnapi_it (apache_beam.runners.dataflow.dataflow_exercise_metrics_pipeline_test.ExerciseMetricsPipelineTest)'

----------------------------------------------------------------------
XML: nosetests-python2.7_sdk.xml
----------------------------------------------------------------------
XML: <https://builds.apache.org/job/beam_PostCommit_Py_ValCont/ws/src/sdks/python/nosetests.xml>
----------------------------------------------------------------------
Ran 2 tests in 904.004s

FAILED (errors=2)
cleanup_container
Untagged: us.gcr.io/apache-beam-testing/jenkins/python2.7_sdk:20191224-124740
Untagged: us.gcr.io/apache-beam-testing/jenkins/python2.7_sdk@sha256:1da078c538e2db834997a5d8dbcc087a8807e8725c7a02f058d4fc7f175bd3b7
Deleted: sha256:9102bb8a854b9b81045f20830256eabbb04090b528785c3146ac6abe3b1f7711
Deleted: sha256:dfccf7d750a027f396b2d5c39623c003a16f99a358fd0cb92a6eba8067fb87c2
Deleted: sha256:9bda2b22c74ba02ab06a5c8fbbb84e349e628ae1bba66e6a5f9dbfade2c17983
Deleted: sha256:f0386468a8411f39077129aed9b44a7c8ca7866e05b11e811c39021cdf24a78e
Deleted: sha256:0fb224b4175e48e7eee0cfba1af9ca1f19d4d21f07142ad6b0b92936fc694e42
Deleted: sha256:77103d84e07ad9e7cc7e9405358ad1a0af76552bf2b74e96c27d61a8b0e3d024
Deleted: sha256:8313357919fbaceba3ab23f714b9a560beb4538f79815da1395f56beeac789a4
Deleted: sha256:eabc916272e9d407785f2aef5304093dfe57c532c360c4f59a33562374b5371b
Deleted: sha256:c97092cdf0998192b2ad40ef982fe72aaa2d696a2668de843db983697efd0532
Deleted: sha256:7169a5e29343e477dc45834b8dca2cc1003eed1082d360aa93dfaf16444440bb
Deleted: sha256:29911972b3c9c3e351535cbab8be514239a3fa670dc34e71e2d5d6c5e67cad6e
Deleted: sha256:3cc3e39d590e4e46ed5bfc3ac7b1f470e3fa7125653dbce6305dcdc4e82cdfcb
Deleted: sha256:080b9e78573ddde51aaddae233801af40712c025ae76528cb4975a769ff95ae5
Deleted: sha256:f4dabb4c21798d34a661489f3321cd977f75d11a16671528ac4853dbe5ca8efa
Deleted: sha256:0042a4e0524057b91ad6af4732b579c265e3cc8bf6ffb24cc71e574c87ae5f01
Deleted: sha256:2d24f0b69b8906033e9e4c275fe57c2bfa4b1b90d9f74242e07f017ca5711d20
Deleted: sha256:3e94339ac63f045a47ec14badfe9918e1d7780ae82fb9fe42a99adf2812dc9fc
Deleted: sha256:3a57b8e8bba083d2a40b5bd787d39752c74d2e20e9c494014ac3798d6106437e
Deleted: sha256:78b2d4c8bef44a87cfd23b75215e4abcdff14e77881b8f1b8e2550c11cb65f2a
Deleted: sha256:0585d1c78a88e8f59568fad906e9514f6df0e979e726e43f675feeb131340261
Digests:
- us.gcr.io/apache-beam-testing/jenkins/python2.7_sdk@sha256:1da078c538e2db834997a5d8dbcc087a8807e8725c7a02f058d4fc7f175bd3b7
  Associated tags:
 - 20191224-124740
Tags:
- us.gcr.io/apache-beam-testing/jenkins/python2.7_sdk:20191224-124740
Deleted [us.gcr.io/apache-beam-testing/jenkins/python2.7_sdk:20191224-124740].
Deleted [us.gcr.io/apache-beam-testing/jenkins/python2.7_sdk@sha256:1da078c538e2db834997a5d8dbcc087a8807e8725c7a02f058d4fc7f175bd3b7].
Removed the container
Build step 'Execute shell' marked build as failure

---------------------------------------------------------------------
To unsubscribe, e-mail: builds-unsubscribe@beam.apache.org
For additional commands, e-mail: builds-help@beam.apache.org


Mime
View raw message