beam-builds mailing list archives

Site index · List index
Message view « Date » · « Thread »
Top « Date » · « Thread »
From Apache Jenkins Server <jenk...@builds.apache.org>
Subject Build failed in Jenkins: beam_PostRelease_NightlySnapshot #838
Date Mon, 23 Dec 2019 11:16:15 GMT
See <https://builds.apache.org/job/beam_PostRelease_NightlySnapshot/838/display/redirect>

Changes:


------------------------------------------
[...truncated 3.42 MB...]
[INFO] Downloading from central: https://repo.maven.apache.org/maven2/asm/asm-commons/3.2/asm-commons-3.2.pom
[INFO] Downloaded from central: https://repo.maven.apache.org/maven2/asm/asm-commons/3.2/asm-commons-3.2.pom
(415 B at 17 kB/s)
[INFO] Downloading from central: https://repo.maven.apache.org/maven2/asm/asm-tree/3.2/asm-tree-3.2.pom
[INFO] Downloaded from central: https://repo.maven.apache.org/maven2/asm/asm-tree/3.2/asm-tree-3.2.pom
(404 B at 17 kB/s)
[INFO] Downloading from central: https://repo.maven.apache.org/maven2/asm/asm-util/3.2/asm-util-3.2.pom
[INFO] Downloaded from central: https://repo.maven.apache.org/maven2/asm/asm-util/3.2/asm-util-3.2.pom
(409 B at 11 kB/s)
[INFO] Downloading from central: https://repo.maven.apache.org/maven2/asm/asm-analysis/3.2/asm-analysis-3.2.pom
[INFO] Downloaded from central: https://repo.maven.apache.org/maven2/asm/asm-analysis/3.2/asm-analysis-3.2.pom
(417 B at 17 kB/s)
[INFO] Downloading from central: https://repo.maven.apache.org/maven2/org/beanshell/bsh/2.0b4/bsh-2.0b4.pom
[INFO] Downloaded from central: https://repo.maven.apache.org/maven2/org/beanshell/bsh/2.0b4/bsh-2.0b4.pom
(1.2 kB at 50 kB/s)
[INFO] Downloading from central: https://repo.maven.apache.org/maven2/org/beanshell/beanshell/2.0b4/beanshell-2.0b4.pom
[INFO] Downloaded from central: https://repo.maven.apache.org/maven2/org/beanshell/beanshell/2.0b4/beanshell-2.0b4.pom
(1.4 kB at 59 kB/s)
[INFO] Downloading from central: https://repo.maven.apache.org/maven2/org/apache/ant/ant/1.8.1/ant-1.8.1.pom
[INFO] Downloaded from central: https://repo.maven.apache.org/maven2/org/apache/ant/ant/1.8.1/ant-1.8.1.pom
(8.8 kB at 352 kB/s)
[INFO] Downloading from central: https://repo.maven.apache.org/maven2/org/apache/ant/ant-parent/1.8.1/ant-parent-1.8.1.pom
[INFO] Downloaded from central: https://repo.maven.apache.org/maven2/org/apache/ant/ant-parent/1.8.1/ant-parent-1.8.1.pom
(4.3 kB at 178 kB/s)
[INFO] Downloading from central: https://repo.maven.apache.org/maven2/org/apache/maven/archetype/archetype-catalog/3.1.2/archetype-catalog-3.1.2.jar
[INFO] Downloading from central: https://repo.maven.apache.org/maven2/org/apache/maven/archetype/archetype-descriptor/3.1.2/archetype-descriptor-3.1.2.jar
[INFO] Downloading from central: https://repo.maven.apache.org/maven2/org/apache/maven/archetype/archetype-common/3.1.2/archetype-common-3.1.2.jar
[INFO] Downloading from central: https://repo.maven.apache.org/maven2/org/codehaus/groovy/groovy/2.4.16/groovy-2.4.16.jar
[INFO] Downloading from central: https://repo.maven.apache.org/maven2/org/apache/ivy/ivy/2.4.0/ivy-2.4.0.jar
[INFO] Downloaded from central: https://repo.maven.apache.org/maven2/org/apache/maven/archetype/archetype-catalog/3.1.2/archetype-catalog-3.1.2.jar
(19 kB at 336 kB/s)
[INFO] Downloading from central: https://repo.maven.apache.org/maven2/net/sourceforge/jchardet/jchardet/1.0/jchardet-1.0.jar
[INFO] Downloaded from central: https://repo.maven.apache.org/maven2/org/apache/maven/archetype/archetype-descriptor/3.1.2/archetype-descriptor-3.1.2.jar
(24 kB at 414 kB/s)
[INFO] Downloading from central: https://repo.maven.apache.org/maven2/org/codehaus/plexus/plexus-component-annotations/1.7.1/plexus-component-annotations-1.7.1.jar
[INFO] Downloaded from central: https://repo.maven.apache.org/maven2/net/sourceforge/jchardet/jchardet/1.0/jchardet-1.0.jar
(27 kB at 502 kB/s)
[INFO] Downloading from central: https://repo.maven.apache.org/maven2/jdom/jdom/1.0/jdom-1.0.jar
[INFO] Downloaded from central: https://repo.maven.apache.org/maven2/org/codehaus/plexus/plexus-component-annotations/1.7.1/plexus-component-annotations-1.7.1.jar
(4.3 kB at 78 kB/s)
[INFO] Downloading from central: https://repo.maven.apache.org/maven2/org/apache/maven/maven-artifact/3.0/maven-artifact-3.0.jar
[INFO] Downloaded from central: https://repo.maven.apache.org/maven2/org/apache/maven/maven-artifact/3.0/maven-artifact-3.0.jar
(52 kB at 641 kB/s)
[INFO] Downloading from central: https://repo.maven.apache.org/maven2/org/apache/maven/maven-settings-builder/3.0/maven-settings-builder-3.0.jar
[INFO] Downloaded from central: https://repo.maven.apache.org/maven2/org/apache/maven/archetype/archetype-common/3.1.2/archetype-common-3.1.2.jar
(185 kB at 1.7 MB/s)
[INFO] Downloading from central: https://repo.maven.apache.org/maven2/commons-io/commons-io/2.2/commons-io-2.2.jar
[INFO] Downloaded from central: https://repo.maven.apache.org/maven2/jdom/jdom/1.0/jdom-1.0.jar
(153 kB at 1.7 MB/s)
[INFO] Downloading from central: https://repo.maven.apache.org/maven2/org/codehaus/plexus/plexus-velocity/1.1.8/plexus-velocity-1.1.8.jar
[INFO] Downloaded from central: https://repo.maven.apache.org/maven2/org/apache/maven/maven-settings-builder/3.0/maven-settings-builder-3.0.jar
(38 kB at 353 kB/s)
[INFO] Downloading from central: https://repo.maven.apache.org/maven2/org/apache/velocity/velocity/1.7/velocity-1.7.jar
[INFO] Downloaded from central: https://repo.maven.apache.org/maven2/org/codehaus/plexus/plexus-velocity/1.1.8/plexus-velocity-1.1.8.jar
(7.9 kB at 69 kB/s)
[INFO] Downloading from central: https://repo.maven.apache.org/maven2/commons-lang/commons-lang/2.4/commons-lang-2.4.jar
[INFO] Downloaded from central: https://repo.maven.apache.org/maven2/commons-io/commons-io/2.2/commons-io-2.2.jar
(174 kB at 1.3 MB/s)
[INFO] Downloading from central: https://repo.maven.apache.org/maven2/org/apache/maven/wagon/wagon-provider-api/3.3.3/wagon-provider-api-3.3.3.jar
[INFO] Downloaded from central: https://repo.maven.apache.org/maven2/org/apache/velocity/velocity/1.7/velocity-1.7.jar
(450 kB at 2.9 MB/s)
[INFO] Downloading from central: https://repo.maven.apache.org/maven2/org/codehaus/plexus/plexus-utils/3.2.0/plexus-utils-3.2.0.jar
[INFO] Downloaded from central: https://repo.maven.apache.org/maven2/org/apache/maven/wagon/wagon-provider-api/3.3.3/wagon-provider-api-3.3.3.jar
(56 kB at 341 kB/s)
[INFO] Downloading from central: https://repo.maven.apache.org/maven2/org/codehaus/plexus/plexus-interactivity-api/1.0-alpha-6/plexus-interactivity-api-1.0-alpha-6.jar
[INFO] Downloaded from central: https://repo.maven.apache.org/maven2/commons-lang/commons-lang/2.4/commons-lang-2.4.jar
(262 kB at 1.5 MB/s)
[INFO] Downloading from central: https://repo.maven.apache.org/maven2/org/apache/maven/maven-plugin-api/3.0/maven-plugin-api-3.0.jar
[INFO] Downloaded from central: https://repo.maven.apache.org/maven2/org/codehaus/plexus/plexus-interactivity-api/1.0-alpha-6/plexus-interactivity-api-1.0-alpha-6.jar
(12 kB at 63 kB/s)
[INFO] Downloading from central: https://repo.maven.apache.org/maven2/org/sonatype/sisu/sisu-inject-plexus/1.4.2/sisu-inject-plexus-1.4.2.jar
[INFO] Downloaded from central: https://repo.maven.apache.org/maven2/org/codehaus/plexus/plexus-utils/3.2.0/plexus-utils-3.2.0.jar
(263 kB at 1.4 MB/s)
[INFO] Downloading from central: https://repo.maven.apache.org/maven2/org/sonatype/sisu/sisu-inject-bean/1.4.2/sisu-inject-bean-1.4.2.jar
[INFO] Downloaded from central: https://repo.maven.apache.org/maven2/org/apache/maven/maven-plugin-api/3.0/maven-plugin-api-3.0.jar
(49 kB at 250 kB/s)
[INFO] Downloading from central: https://repo.maven.apache.org/maven2/org/sonatype/sisu/sisu-guice/2.1.7/sisu-guice-2.1.7-noaop.jar
[INFO] Downloaded from central: https://repo.maven.apache.org/maven2/org/sonatype/sisu/sisu-inject-plexus/1.4.2/sisu-inject-plexus-1.4.2.jar
(202 kB at 913 kB/s)
[INFO] Downloading from central: https://repo.maven.apache.org/maven2/org/apache/maven/maven-core/3.0/maven-core-3.0.jar
[INFO] Downloaded from central: https://repo.maven.apache.org/maven2/org/sonatype/sisu/sisu-inject-bean/1.4.2/sisu-inject-bean-1.4.2.jar
(153 kB at 674 kB/s)
[INFO] Downloading from central: https://repo.maven.apache.org/maven2/org/apache/maven/maven-repository-metadata/3.0/maven-repository-metadata-3.0.jar
[INFO] Downloaded from central: https://repo.maven.apache.org/maven2/org/apache/ivy/ivy/2.4.0/ivy-2.4.0.jar
(1.3 MB at 5.0 MB/s)
[INFO] Downloading from central: https://repo.maven.apache.org/maven2/org/apache/maven/maven-model-builder/3.0/maven-model-builder-3.0.jar
[INFO] Downloaded from central: https://repo.maven.apache.org/maven2/org/sonatype/sisu/sisu-guice/2.1.7/sisu-guice-2.1.7-noaop.jar
(472 kB at 1.9 MB/s)
[INFO] Downloading from central: https://repo.maven.apache.org/maven2/org/apache/maven/maven-aether-provider/3.0/maven-aether-provider-3.0.jar
[INFO] Downloaded from central: https://repo.maven.apache.org/maven2/org/apache/maven/maven-repository-metadata/3.0/maven-repository-metadata-3.0.jar
(30 kB at 119 kB/s)
[INFO] Downloading from central: https://repo.maven.apache.org/maven2/org/sonatype/aether/aether-impl/1.7/aether-impl-1.7.jar
[INFO] Downloaded from central: https://repo.maven.apache.org/maven2/org/apache/maven/maven-model-builder/3.0/maven-model-builder-3.0.jar
(148 kB at 552 kB/s)
[INFO] Downloading from central: https://repo.maven.apache.org/maven2/org/sonatype/aether/aether-spi/1.7/aether-spi-1.7.jar
[INFO] Downloaded from central: https://repo.maven.apache.org/maven2/org/apache/maven/maven-aether-provider/3.0/maven-aether-provider-3.0.jar
(51 kB at 185 kB/s)
[INFO] Downloading from central: https://repo.maven.apache.org/maven2/org/sonatype/aether/aether-api/1.7/aether-api-1.7.jar
[INFO] Downloaded from central: https://repo.maven.apache.org/maven2/org/sonatype/aether/aether-impl/1.7/aether-impl-1.7.jar
(106 kB at 378 kB/s)
[INFO] Downloading from central: https://repo.maven.apache.org/maven2/org/sonatype/aether/aether-util/1.7/aether-util-1.7.jar
[INFO] Downloaded from central: https://repo.maven.apache.org/maven2/org/apache/maven/maven-core/3.0/maven-core-3.0.jar
(527 kB at 1.9 MB/s)
[INFO] Downloading from central: https://repo.maven.apache.org/maven2/org/codehaus/plexus/plexus-interpolation/1.14/plexus-interpolation-1.14.jar
[INFO] Downloaded from central: https://repo.maven.apache.org/maven2/org/sonatype/aether/aether-spi/1.7/aether-spi-1.7.jar
(14 kB at 46 kB/s)
[INFO] Downloading from central: https://repo.maven.apache.org/maven2/org/codehaus/plexus/plexus-classworlds/2.2.3/plexus-classworlds-2.2.3.jar
[INFO] Downloaded from central: https://repo.maven.apache.org/maven2/org/sonatype/aether/aether-api/1.7/aether-api-1.7.jar
(74 kB at 246 kB/s)
[INFO] Downloading from central: https://repo.maven.apache.org/maven2/org/sonatype/plexus/plexus-sec-dispatcher/1.3/plexus-sec-dispatcher-1.3.jar
[INFO] Downloaded from central: https://repo.maven.apache.org/maven2/org/codehaus/plexus/plexus-interpolation/1.14/plexus-interpolation-1.14.jar
(61 kB at 198 kB/s)
[INFO] Downloading from central: https://repo.maven.apache.org/maven2/org/sonatype/plexus/plexus-cipher/1.4/plexus-cipher-1.4.jar
[INFO] Downloaded from central: https://repo.maven.apache.org/maven2/org/sonatype/aether/aether-util/1.7/aether-util-1.7.jar
(108 kB at 349 kB/s)
[INFO] Downloading from central: https://repo.maven.apache.org/maven2/org/apache/maven/maven-model/3.0/maven-model-3.0.jar
[INFO] Downloaded from central: https://repo.maven.apache.org/maven2/org/codehaus/plexus/plexus-classworlds/2.2.3/plexus-classworlds-2.2.3.jar
(46 kB at 145 kB/s)
[INFO] Downloading from central: https://repo.maven.apache.org/maven2/org/apache/maven/maven-settings/3.0/maven-settings-3.0.jar
[INFO] Downloaded from central: https://repo.maven.apache.org/maven2/org/sonatype/plexus/plexus-sec-dispatcher/1.3/plexus-sec-dispatcher-1.3.jar
(29 kB at 87 kB/s)
[INFO] Downloading from central: https://repo.maven.apache.org/maven2/org/apache/maven/shared/maven-invoker/3.0.1/maven-invoker-3.0.1.jar
[INFO] Downloaded from central: https://repo.maven.apache.org/maven2/org/codehaus/groovy/groovy/2.4.16/groovy-2.4.16.jar
(4.7 MB at 13 MB/s)
[INFO] Downloading from central: https://repo.maven.apache.org/maven2/org/apache/maven/shared/maven-shared-utils/3.2.1/maven-shared-utils-3.2.1.jar
[INFO] Downloaded from central: https://repo.maven.apache.org/maven2/org/sonatype/plexus/plexus-cipher/1.4/plexus-cipher-1.4.jar
(13 kB at 41 kB/s)
[INFO] Downloading from central: https://repo.maven.apache.org/maven2/org/apache/maven/shared/maven-artifact-transfer/0.11.0/maven-artifact-transfer-0.11.0.jar
[INFO] Downloaded from central: https://repo.maven.apache.org/maven2/org/apache/maven/maven-model/3.0/maven-model-3.0.jar
(165 kB at 483 kB/s)
[INFO] Downloading from central: https://repo.maven.apache.org/maven2/org/apache/maven/shared/maven-common-artifact-filters/3.0.1/maven-common-artifact-filters-3.0.1.jar
[INFO] Downloaded from central: https://repo.maven.apache.org/maven2/org/apache/maven/maven-settings/3.0/maven-settings-3.0.jar
(47 kB at 136 kB/s)
[INFO] Downloading from central: https://repo.maven.apache.org/maven2/commons-codec/commons-codec/1.11/commons-codec-1.11.jar
[INFO] Downloaded from central: https://repo.maven.apache.org/maven2/org/apache/maven/shared/maven-invoker/3.0.1/maven-invoker-3.0.1.jar
(33 kB at 94 kB/s)
[INFO] Downloading from central: https://repo.maven.apache.org/maven2/org/slf4j/slf4j-api/1.7.5/slf4j-api-1.7.5.jar
[INFO] Downloaded from central: https://repo.maven.apache.org/maven2/org/apache/maven/shared/maven-shared-utils/3.2.1/maven-shared-utils-3.2.1.jar
(167 kB at 464 kB/s)
[INFO] Downloading from central: https://repo.maven.apache.org/maven2/commons-collections/commons-collections/3.2.1/commons-collections-3.2.1.jar
[INFO] Downloaded from central: https://repo.maven.apache.org/maven2/org/apache/maven/shared/maven-artifact-transfer/0.11.0/maven-artifact-transfer-0.11.0.jar
(128 kB at 352 kB/s)
[INFO] Downloading from central: https://repo.maven.apache.org/maven2/org/apache/maven/shared/maven-script-interpreter/1.0/maven-script-interpreter-1.0.jar
[INFO] Downloaded from central: https://repo.maven.apache.org/maven2/org/apache/maven/shared/maven-common-artifact-filters/3.0.1/maven-common-artifact-filters-3.0.1.jar
(61 kB at 167 kB/s)
[INFO] Downloading from central: https://repo.maven.apache.org/maven2/org/beanshell/bsh/2.0b4/bsh-2.0b4.jar
[INFO] Downloaded from central: https://repo.maven.apache.org/maven2/org/slf4j/slf4j-api/1.7.5/slf4j-api-1.7.5.jar
(26 kB at 70 kB/s)
[INFO] Downloading from central: https://repo.maven.apache.org/maven2/org/apache/ant/ant/1.8.1/ant-1.8.1.jar
[INFO] Downloaded from central: https://repo.maven.apache.org/maven2/commons-codec/commons-codec/1.11/commons-codec-1.11.jar
(335 kB at 875 kB/s)
[INFO] Downloaded from central: https://repo.maven.apache.org/maven2/org/apache/maven/shared/maven-script-interpreter/1.0/maven-script-interpreter-1.0.jar
(21 kB at 54 kB/s)
[INFO] Downloaded from central: https://repo.maven.apache.org/maven2/org/beanshell/bsh/2.0b4/bsh-2.0b4.jar
(282 kB at 704 kB/s)
[INFO] Downloaded from central: https://repo.maven.apache.org/maven2/commons-collections/commons-collections/3.2.1/commons-collections-3.2.1.jar
(575 kB at 1.4 MB/s)
[INFO] Downloaded from central: https://repo.maven.apache.org/maven2/org/apache/ant/ant/1.8.1/ant-1.8.1.jar
(1.5 MB at 3.1 MB/s)
[INFO] Generating project in Batch mode
[INFO] Archetype repository not defined. Using the one from [org.apache.beam:beam-sdks-java-maven-archetypes-examples:2.16.0]
found in catalog remote
[INFO] Downloading from test.release: https://repository.apache.org/content/repositories/snapshots/org/apache/beam/beam-sdks-java-maven-archetypes-examples/2.19.0-SNAPSHOT/maven-metadata.xml
[INFO] Downloaded from test.release: https://repository.apache.org/content/repositories/snapshots/org/apache/beam/beam-sdks-java-maven-archetypes-examples/2.19.0-SNAPSHOT/maven-metadata.xml
(1.7 kB at 5.3 kB/s)
[INFO] Downloading from test.release: https://repository.apache.org/content/repositories/snapshots/org/apache/beam/beam-sdks-java-maven-archetypes-examples/2.19.0-SNAPSHOT/beam-sdks-java-maven-archetypes-examples-2.19.0-20191223.074256-19.pom
[INFO] Downloaded from test.release: https://repository.apache.org/content/repositories/snapshots/org/apache/beam/beam-sdks-java-maven-archetypes-examples/2.19.0-SNAPSHOT/beam-sdks-java-maven-archetypes-examples-2.19.0-20191223.074256-19.pom
(4.0 kB at 14 kB/s)
[INFO] Downloading from test.release: https://repository.apache.org/content/repositories/snapshots/org/apache/beam/beam-sdks-java-maven-archetypes-examples/2.19.0-SNAPSHOT/beam-sdks-java-maven-archetypes-examples-2.19.0-20191223.074256-19.jar
[INFO] Downloaded from test.release: https://repository.apache.org/content/repositories/snapshots/org/apache/beam/beam-sdks-java-maven-archetypes-examples/2.19.0-SNAPSHOT/beam-sdks-java-maven-archetypes-examples-2.19.0-20191223.074256-19.jar
(222 kB at 536 kB/s)
[INFO] ----------------------------------------------------------------------------
[INFO] Using following parameters for creating project from Archetype: beam-sdks-java-maven-archetypes-examples:2.19.0-SNAPSHOT
[INFO] ----------------------------------------------------------------------------
[INFO] Parameter: groupId, Value: org.example
[INFO] Parameter: artifactId, Value: word-count-beam
[INFO] Parameter: version, Value: 0.1
[INFO] Parameter: package, Value: org.apache.beam.examples
[INFO] Parameter: packageInPathFormat, Value: org/apache/beam/examples
[INFO] Parameter: package, Value: org.apache.beam.examples
[INFO] Parameter: version, Value: 0.1
[INFO] Parameter: groupId, Value: org.example
[INFO] Parameter: targetPlatform, Value: 1.8
[INFO] Parameter: artifactId, Value: word-count-beam
[INFO] Project created from Archetype in dir: /tmp/groovy-generated-3046236682231310321-tmpdir/word-count-beam
[INFO] ------------------------------------------------------------------------
[INFO] BUILD SUCCESS
[INFO] ------------------------------------------------------------------------
[INFO] Total time: 8.041 s
[INFO] Finished at: 2019-12-23T11:14:41Z
[INFO] ------------------------------------------------------------------------
Verified [INFO] BUILD SUCCESS
cd word-count-beam
ls
pom.xml
src
Verified pom.xml
Verified src
ls src/main/java/org/apache/beam/examples/
common
complete
DebuggingWordCount.java
MinimalWordCount.java
subprocess
WindowedWordCount.java
WordCount.java
Verified WordCount.java
ls src/main/java/org/apache/beam/examples/complete/game/
GameStats.java
HourlyTeamScore.java
injector
LeaderBoard.java
StatefulTeamScore.java
UserScore.java
utils
Verified UserScore.java

**************************************
* Test: Runs the WordCount Code with Direct runner
**************************************

mvn compile exec:java -q       -Dexec.mainClass=org.apache.beam.examples.WordCount       -Dexec.args="--inputFile=pom.xml
--output=counts"       -Pdirect-runner
Using maven /home/jenkins/tools/maven/apache-maven-3.5.4
Dec 23, 2019 11:16:05 AM org.apache.beam.sdk.io.FileBasedSource getEstimatedSizeBytes
INFO: Filepattern pom.xml matched 1 files with total size 17698
Dec 23, 2019 11:16:05 AM org.apache.beam.sdk.io.FileBasedSource split
INFO: Splitting filepattern pom.xml into bundles of size 1106 took 4 ms and produced 1 files
and 16 bundles
Dec 23, 2019 11:16:10 AM org.apache.beam.sdk.io.WriteFiles$WriteShardsIntoTempFilesFn processElement
INFO: Opening writer 168ad3f4-a72d-4111-ae0d-129554b049be for window org.apache.beam.sdk.transforms.windowing.GlobalWindow@68b16fbb
pane PaneInfo{isFirst=true, isLast=true, timing=ON_TIME, index=0, onTimeIndex=0} destination
null
Dec 23, 2019 11:16:10 AM org.apache.beam.sdk.io.WriteFiles$WriteShardsIntoTempFilesFn processElement
INFO: Opening writer e32c3b70-e65b-4be9-8ebe-6293117b6066 for window org.apache.beam.sdk.transforms.windowing.GlobalWindow@68b16fbb
pane PaneInfo{isFirst=true, isLast=true, timing=ON_TIME, index=0, onTimeIndex=0} destination
null
Dec 23, 2019 11:16:10 AM org.apache.beam.sdk.io.WriteFiles$WriteShardsIntoTempFilesFn processElement
INFO: Opening writer 04712822-2e0a-42ef-bedf-d08ecadb50d4 for window org.apache.beam.sdk.transforms.windowing.GlobalWindow@68b16fbb
pane PaneInfo{isFirst=true, isLast=true, timing=ON_TIME, index=0, onTimeIndex=0} destination
null
Dec 23, 2019 11:16:10 AM org.apache.beam.sdk.io.WriteFiles$WriteShardsIntoTempFilesFn processElement
INFO: Opening writer 99965b6d-122b-4ae8-88c9-2ccc1e699c1b for window org.apache.beam.sdk.transforms.windowing.GlobalWindow@68b16fbb
pane PaneInfo{isFirst=true, isLast=true, timing=ON_TIME, index=0, onTimeIndex=0} destination
null
Dec 23, 2019 11:16:10 AM org.apache.beam.sdk.io.FileBasedSink$Writer close
INFO: Successfully wrote temporary file /tmp/groovy-generated-3046236682231310321-tmpdir/word-count-beam/.temp-beam-7506a18c-584e-416b-876f-661d4c64f628/99965b6d-122b-4ae8-88c9-2ccc1e699c1b
Dec 23, 2019 11:16:10 AM org.apache.beam.sdk.io.FileBasedSink$Writer close
INFO: Successfully wrote temporary file /tmp/groovy-generated-3046236682231310321-tmpdir/word-count-beam/.temp-beam-7506a18c-584e-416b-876f-661d4c64f628/04712822-2e0a-42ef-bedf-d08ecadb50d4
Dec 23, 2019 11:16:10 AM org.apache.beam.sdk.io.FileBasedSink$Writer close
INFO: Successfully wrote temporary file /tmp/groovy-generated-3046236682231310321-tmpdir/word-count-beam/.temp-beam-7506a18c-584e-416b-876f-661d4c64f628/168ad3f4-a72d-4111-ae0d-129554b049be
Dec 23, 2019 11:16:10 AM org.apache.beam.sdk.io.FileBasedSink$Writer close
INFO: Successfully wrote temporary file /tmp/groovy-generated-3046236682231310321-tmpdir/word-count-beam/.temp-beam-7506a18c-584e-416b-876f-661d4c64f628/e32c3b70-e65b-4be9-8ebe-6293117b6066
Dec 23, 2019 11:16:10 AM org.apache.beam.sdk.io.WriteFiles$FinalizeTempFileBundles$FinalizeFn
process
INFO: Finalizing 4 file results
Dec 23, 2019 11:16:10 AM org.apache.beam.sdk.io.FileBasedSink$WriteOperation createMissingEmptyShards
INFO: Finalizing for destination null num shards 4.
Dec 23, 2019 11:16:10 AM org.apache.beam.sdk.io.FileBasedSink$WriteOperation moveToOutputFiles
INFO: Will copy temporary file FileResult{tempFilename=/tmp/groovy-generated-3046236682231310321-tmpdir/word-count-beam/.temp-beam-7506a18c-584e-416b-876f-661d4c64f628/168ad3f4-a72d-4111-ae0d-129554b049be,
shard=0, window=org.apache.beam.sdk.transforms.windowing.GlobalWindow@68b16fbb, paneInfo=PaneInfo{isFirst=true,
isLast=true, timing=ON_TIME, index=0, onTimeIndex=0}} to final location /tmp/groovy-generated-3046236682231310321-tmpdir/word-count-beam/counts-00000-of-00004
Dec 23, 2019 11:16:10 AM org.apache.beam.sdk.io.FileBasedSink$WriteOperation moveToOutputFiles
INFO: Will copy temporary file FileResult{tempFilename=/tmp/groovy-generated-3046236682231310321-tmpdir/word-count-beam/.temp-beam-7506a18c-584e-416b-876f-661d4c64f628/04712822-2e0a-42ef-bedf-d08ecadb50d4,
shard=3, window=org.apache.beam.sdk.transforms.windowing.GlobalWindow@68b16fbb, paneInfo=PaneInfo{isFirst=true,
isLast=true, timing=ON_TIME, index=0, onTimeIndex=0}} to final location /tmp/groovy-generated-3046236682231310321-tmpdir/word-count-beam/counts-00003-of-00004
Dec 23, 2019 11:16:10 AM org.apache.beam.sdk.io.FileBasedSink$WriteOperation moveToOutputFiles
INFO: Will copy temporary file FileResult{tempFilename=/tmp/groovy-generated-3046236682231310321-tmpdir/word-count-beam/.temp-beam-7506a18c-584e-416b-876f-661d4c64f628/99965b6d-122b-4ae8-88c9-2ccc1e699c1b,
shard=2, window=org.apache.beam.sdk.transforms.windowing.GlobalWindow@68b16fbb, paneInfo=PaneInfo{isFirst=true,
isLast=true, timing=ON_TIME, index=0, onTimeIndex=0}} to final location /tmp/groovy-generated-3046236682231310321-tmpdir/word-count-beam/counts-00002-of-00004
Dec 23, 2019 11:16:10 AM org.apache.beam.sdk.io.FileBasedSink$WriteOperation moveToOutputFiles
INFO: Will copy temporary file FileResult{tempFilename=/tmp/groovy-generated-3046236682231310321-tmpdir/word-count-beam/.temp-beam-7506a18c-584e-416b-876f-661d4c64f628/e32c3b70-e65b-4be9-8ebe-6293117b6066,
shard=1, window=org.apache.beam.sdk.transforms.windowing.GlobalWindow@68b16fbb, paneInfo=PaneInfo{isFirst=true,
isLast=true, timing=ON_TIME, index=0, onTimeIndex=0}} to final location /tmp/groovy-generated-3046236682231310321-tmpdir/word-count-beam/counts-00001-of-00004
Dec 23, 2019 11:16:10 AM org.apache.beam.sdk.io.FileBasedSink$WriteOperation removeTemporaryFiles
INFO: Will remove known temporary file /tmp/groovy-generated-3046236682231310321-tmpdir/word-count-beam/.temp-beam-7506a18c-584e-416b-876f-661d4c64f628/168ad3f4-a72d-4111-ae0d-129554b049be
Dec 23, 2019 11:16:10 AM org.apache.beam.sdk.io.FileBasedSink$WriteOperation removeTemporaryFiles
INFO: Will remove known temporary file /tmp/groovy-generated-3046236682231310321-tmpdir/word-count-beam/.temp-beam-7506a18c-584e-416b-876f-661d4c64f628/99965b6d-122b-4ae8-88c9-2ccc1e699c1b
Dec 23, 2019 11:16:10 AM org.apache.beam.sdk.io.FileBasedSink$WriteOperation removeTemporaryFiles
INFO: Will remove known temporary file /tmp/groovy-generated-3046236682231310321-tmpdir/word-count-beam/.temp-beam-7506a18c-584e-416b-876f-661d4c64f628/04712822-2e0a-42ef-bedf-d08ecadb50d4
Dec 23, 2019 11:16:10 AM org.apache.beam.sdk.io.FileBasedSink$WriteOperation removeTemporaryFiles
INFO: Will remove known temporary file /tmp/groovy-generated-3046236682231310321-tmpdir/word-count-beam/.temp-beam-7506a18c-584e-416b-876f-661d4c64f628/e32c3b70-e65b-4be9-8ebe-6293117b6066
Dec 23, 2019 11:16:10 AM org.apache.beam.sdk.io.FileBasedSink$WriteOperation removeTemporaryFiles
WARNING: Failed to match temporary files under: [/tmp/groovy-generated-3046236682231310321-tmpdir/word-count-beam/.temp-beam-7506a18c-584e-416b-876f-661d4c64f628/].
grep Foundation counts*
counts-00003-of-00004:Foundation: 1
Verified Foundation: 1
[SUCCESS]

FAILURE: Build completed with 2 failures.

1: Task failed with an exception.
-----------
* What went wrong:
Execution failed for task ':runners:google-cloud-dataflow-java:runMobileGamingJavaDataflow'.
> Process 'command '/usr/lib/jvm/java-8-openjdk-amd64/bin/java'' finished with non-zero
exit value 1

* Try:
Run with --stacktrace option to get the stack trace. Run with --info or --debug option to
get more log output. Run with --scan to get full insights.
==============================================================================

2: Task failed with an exception.
-----------
* What went wrong:
Execution failed for task ':runners:google-cloud-dataflow-java:runQuickstartJavaDataflow'.
> Process 'command '/usr/lib/jvm/java-8-openjdk-amd64/bin/java'' finished with non-zero
exit value 1

* Try:
Run with --stacktrace option to get the stack trace. Run with --info or --debug option to
get more log output. Run with --scan to get full insights.
==============================================================================

* Get more help at https://help.gradle.org

Deprecated Gradle features were used in this build, making it incompatible with Gradle 6.0.
Use '--warning-mode all' to show the individual deprecation warnings.
See https://docs.gradle.org/5.2.1/userguide/command_line_interface.html#sec:command_line_warnings

BUILD FAILED in 15m 48s
8 actionable tasks: 7 executed, 1 from cache

Publishing build scan...
https://gradle.com/s/wxjo5v4pa5byo

Build step 'Invoke Gradle script' changed build result to FAILURE
Build step 'Invoke Gradle script' marked build as failure

---------------------------------------------------------------------
To unsubscribe, e-mail: builds-unsubscribe@beam.apache.org
For additional commands, e-mail: builds-help@beam.apache.org


Mime
View raw message