beam-builds mailing list archives

Site index · List index
Message view « Date » · « Thread »
Top « Date » · « Thread »
From Apache Jenkins Server <jenk...@builds.apache.org>
Subject Build failed in Jenkins: beam_PostCommit_Python35 #1135
Date Tue, 03 Dec 2019 20:32:49 GMT
See <https://builds.apache.org/job/beam_PostCommit_Python35/1135/display/redirect?page=changes>

Changes:

[kcweaver] [BEAM-8251] plumb worker_(region|zone) to Environment proto

[kcweaver] Add null checks for worker region/zone options


------------------------------------------
[...truncated 566.34 KB...]
19/12/03 19:41:32 INFO org.apache.beam.runners.fnexecution.control.FnApiControlClientPoolService:
Beam Fn Control client connected with id 1-1
INFO:apache_beam.runners.worker.sdk_worker:Creating insecure state channel for localhost:33585.
INFO:apache_beam.runners.worker.sdk_worker:State channel established.
INFO:apache_beam.runners.worker.data_plane:Creating client data channel for localhost:36391
19/12/03 19:41:32 INFO org.apache.beam.runners.fnexecution.data.GrpcDataService: Beam Fn Data
client connected.
19/12/03 19:41:32 WARN org.apache.beam.runners.spark.translation.GroupNonMergingWindowsFunctions:
Either coder LengthPrefixCoder(ByteArrayCoder) or GlobalWindow$Coder is not consistent with
equals. That might cause issues on some runners.
WARNING:apache_beam.io.filebasedsink:Deleting 4 existing files in target path matching: -*-of-%(num_shards)05d
19/12/03 19:41:48 INFO org.apache.beam.runners.spark.SparkPipelineRunner: Job BeamApp-jenkins-1203194127-581d7def_f9da9117-529c-47f3-bf0f-aef9cdbb7d95:
Pipeline translated successfully. Computing outputs
INFO:apache_beam.io.filebasedsink:Starting finalize_write threads with num_shards: 4 (skipped:
0), batches: 4, num_threads: 4
INFO:apache_beam.io.filebasedsink:Renamed 4 shards in 0.10 seconds.
19/12/03 19:42:03 INFO org.apache.beam.runners.spark.SparkPipelineRunner: Job BeamApp-jenkins-1203194127-581d7def_f9da9117-529c-47f3-bf0f-aef9cdbb7d95
finished.
19/12/03 19:42:03 WARN org.apache.beam.runners.spark.SparkPipelineResult$BatchMode: Collecting
monitoring infos is not implemented yet in Spark portable runner.
19/12/03 19:42:03 INFO org.apache.beam.runners.fnexecution.artifact.AbstractArtifactRetrievalService:
Manifest at /tmp/beam-temphg7027vw/artifacts54h443r_/job_8bdffb47-5788-4beb-bcd9-f882bc82c94a/MANIFEST
has 1 artifact locations
19/12/03 19:42:03 INFO org.apache.beam.runners.fnexecution.artifact.BeamFileSystemArtifactStagingService:
Removed dir /tmp/beam-temphg7027vw/artifacts54h443r_/job_8bdffb47-5788-4beb-bcd9-f882bc82c94a/
INFO:apache_beam.runners.portability.portable_runner:Job state changed to DONE
19/12/03 19:42:03 INFO org.apache.beam.runners.fnexecution.jobsubmission.InMemoryJobService:
Getting job metrics for BeamApp-jenkins-1203194127-581d7def_f9da9117-529c-47f3-bf0f-aef9cdbb7d95
19/12/03 19:42:03 INFO org.apache.beam.runners.fnexecution.jobsubmission.InMemoryJobService:
Finished getting job metrics for BeamApp-jenkins-1203194127-581d7def_f9da9117-529c-47f3-bf0f-aef9cdbb7d95
Exception in thread run_worker_1-1:
Traceback (most recent call last):
  File "/usr/lib/python3.5/threading.py", line 914, in _bootstrap_inner
    self.run()
  File "/usr/lib/python3.5/threading.py", line 862, in run
    self._target(*self._args, **self._kwargs)
  File "<https://builds.apache.org/job/beam_PostCommit_Python35/ws/src/sdks/python/apache_beam/runners/worker/sdk_worker.py",>
line 111, in run
    for work_request in control_stub.Control(get_responses()):
  File "<https://builds.apache.org/job/beam_PostCommit_Python35/ws/src/build/gradleenv/2022703439/lib/python3.5/site-packages/grpc/_channel.py",>
line 392, in __next__
    return self._next()
  File "<https://builds.apache.org/job/beam_PostCommit_Python35/ws/src/build/gradleenv/2022703439/lib/python3.5/site-packages/grpc/_channel.py",>
line 561, in _next
    raise self
grpc._channel._Rendezvous: <_Rendezvous of RPC that terminated with:
	status = StatusCode.UNAVAILABLE
	details = "Socket closed"
	debug_error_string = "{"created":"@1575402124.323893814","description":"Error received from
peer ipv4:127.0.0.1:40323","file":"src/core/lib/surface/call.cc","file_line":1055,"grpc_message":"Socket
closed","grpc_status":14}"
>

ERROR:apache_beam.runners.worker.data_plane:Failed to read inputs in the data plane.
Traceback (most recent call last):
  File "<https://builds.apache.org/job/beam_PostCommit_Python35/ws/src/sdks/python/apache_beam/runners/worker/data_plane.py",>
line 272, in _read_inputs
    for elements in elements_iterator:
  File "<https://builds.apache.org/job/beam_PostCommit_Python35/ws/src/build/gradleenv/2022703439/lib/python3.5/site-packages/grpc/_channel.py",>
line 392, in __next__
    return self._next()
  File "<https://builds.apache.org/job/beam_PostCommit_Python35/ws/src/build/gradleenv/2022703439/lib/python3.5/site-packages/grpc/_channel.py",>
line 561, in _next
    raise self
grpc._channel._Rendezvous: <_Rendezvous of RPC that terminated with:
	status = StatusCode.UNAVAILABLE
	details = "Socket closed"
	debug_error_string = "{"created":"@1575402124.323843227","description":"Error received from
peer ipv4:127.0.0.1:36391","file":"src/core/lib/surface/call.cc","file_line":1055,"grpc_message":"Socket
closed","grpc_status":14}"
>
Exception in thread read_grpc_client_inputs:
Traceback (most recent call last):
  File "/usr/lib/python3.5/threading.py", line 914, in _bootstrap_inner
    self.run()
  File "/usr/lib/python3.5/threading.py", line 862, in run
    self._target(*self._args, **self._kwargs)
  File "<https://builds.apache.org/job/beam_PostCommit_Python35/ws/src/sdks/python/apache_beam/runners/worker/data_plane.py",>
line 286, in <lambda>
    target=lambda: self._read_inputs(elements_iterator),
  File "<https://builds.apache.org/job/beam_PostCommit_Python35/ws/src/sdks/python/apache_beam/runners/worker/data_plane.py",>
line 272, in _read_inputs
    for elements in elements_iterator:
  File "<https://builds.apache.org/job/beam_PostCommit_Python35/ws/src/build/gradleenv/2022703439/lib/python3.5/site-packages/grpc/_channel.py",>
line 392, in __next__
    return self._next()
  File "<https://builds.apache.org/job/beam_PostCommit_Python35/ws/src/build/gradleenv/2022703439/lib/python3.5/site-packages/grpc/_channel.py",>
line 561, in _next
    raise self
grpc._channel._Rendezvous: <_Rendezvous of RPC that terminated with:
	status = StatusCode.UNAVAILABLE
	details = "Socket closed"
	debug_error_string = "{"created":"@1575402124.323843227","description":"Error received from
peer ipv4:127.0.0.1:36391","file":"src/core/lib/surface/call.cc","file_line":1055,"grpc_message":"Socket
closed","grpc_status":14}"
>

Exception in thread read_state:
Traceback (most recent call last):
  File "/usr/lib/python3.5/threading.py", line 914, in _bootstrap_inner
    self.run()
  File "/usr/lib/python3.5/threading.py", line 862, in run
    self._target(*self._args, **self._kwargs)
  File "<https://builds.apache.org/job/beam_PostCommit_Python35/ws/src/sdks/python/apache_beam/runners/worker/sdk_worker.py",>
line 530, in pull_responses
    for response in responses:
  File "<https://builds.apache.org/job/beam_PostCommit_Python35/ws/src/build/gradleenv/2022703439/lib/python3.5/site-packages/grpc/_channel.py",>
line 392, in __next__
    return self._next()
  File "<https://builds.apache.org/job/beam_PostCommit_Python35/ws/src/build/gradleenv/2022703439/lib/python3.5/site-packages/grpc/_channel.py",>
line 561, in _next
    raise self
grpc._channel._Rendezvous: <_Rendezvous of RPC that terminated with:
	status = StatusCode.UNAVAILABLE
	details = "Socket closed"
	debug_error_string = "{"created":"@1575402124.323868345","description":"Error received from
peer ipv4:127.0.0.1:33585","file":"src/core/lib/surface/call.cc","file_line":1055,"grpc_message":"Socket
closed","grpc_status":14}"
>


> Task :sdks:python:test-suites:portable:py35:postCommitPy35

> Task :sdks:python:test-suites:dataflow:py35:postCommitIT
<https://builds.apache.org/job/beam_PostCommit_Python35/ws/src/sdks/python/apache_beam/io/gcp/bigquery.py>:1220:
BeamDeprecationWarning: options is deprecated since First stable release. References to <pipeline>.options
will not be supported
Worker logs: https://console.cloud.google.com/dataflow/jobsDetail/locations/us-central1/jobs/2019-12-03_11_38_23-13581469389062185308?project=apache-beam-testing
Worker logs: https://console.cloud.google.com/dataflow/jobsDetail/locations/us-central1/jobs/2019-12-03_11_54_12-12025236198932665741?project=apache-beam-testing
  experiments = p.options.view_as(DebugOptions).experiments or []
Worker logs: https://console.cloud.google.com/dataflow/jobsDetail/locations/us-central1/jobs/2019-12-03_12_03_36-13700198411533597478?project=apache-beam-testing
Worker logs: https://console.cloud.google.com/dataflow/jobsDetail/locations/us-central1/jobs/2019-12-03_12_12_43-7018475934921419464?project=apache-beam-testing
Worker logs: https://console.cloud.google.com/dataflow/jobsDetail/locations/us-central1/jobs/2019-12-03_12_22_07-5714052790605993626?project=apache-beam-testing
Worker logs: https://console.cloud.google.com/dataflow/jobsDetail/locations/us-central1/jobs/2019-12-03_11_38_22-11214193059508750632?project=apache-beam-testing
<https://builds.apache.org/job/beam_PostCommit_Python35/ws/src/sdks/python/apache_beam/runners/dataflow/dataflow_runner.py>:731:
BeamDeprecationWarning: BigQuerySink is deprecated since 2.11.0. Use WriteToBigQuery instead.
  kms_key=transform.kms_key))
Worker logs: https://console.cloud.google.com/dataflow/jobsDetail/locations/us-central1/jobs/2019-12-03_11_58_47-10227889445782729299?project=apache-beam-testing
<https://builds.apache.org/job/beam_PostCommit_Python35/ws/src/sdks/python/apache_beam/io/gcp/bigquery.py>:1220:
BeamDeprecationWarning: options is deprecated since First stable release. References to <pipeline>.options
will not be supported
  experiments = p.options.view_as(DebugOptions).experiments or []
Worker logs: https://console.cloud.google.com/dataflow/jobsDetail/locations/us-central1/jobs/2019-12-03_12_09_56-6118359284759548003?project=apache-beam-testing
<https://builds.apache.org/job/beam_PostCommit_Python35/ws/src/sdks/python/apache_beam/io/gcp/bigquery_file_loads.py>:797:
BeamDeprecationWarning: options is deprecated since First stable release. References to <pipeline>.options
will not be supported
Worker logs: https://console.cloud.google.com/dataflow/jobsDetail/locations/us-central1/jobs/2019-12-03_12_19_09-5089091995530236544?project=apache-beam-testing
  temp_location = p.options.view_as(GoogleCloudOptions).temp_location
<https://builds.apache.org/job/beam_PostCommit_Python35/ws/src/sdks/python/apache_beam/io/fileio_test.py>:296:
FutureWarning: MatchAll is experimental.
  | 'GetPath' >> beam.Map(lambda metadata: metadata.path))
<https://builds.apache.org/job/beam_PostCommit_Python35/ws/src/sdks/python/apache_beam/io/fileio_test.py>:307:
FutureWarning: MatchAll is experimental.
  | 'Checksums' >> beam.Map(compute_hash))
<https://builds.apache.org/job/beam_PostCommit_Python35/ws/src/sdks/python/apache_beam/io/fileio_test.py>:307:
FutureWarning: ReadMatches is experimental.
  | 'Checksums' >> beam.Map(compute_hash))
Worker logs: https://console.cloud.google.com/dataflow/jobsDetail/locations/us-central1/jobs/2019-12-03_11_38_25-6663469207219057843?project=apache-beam-testing
<https://builds.apache.org/job/beam_PostCommit_Python35/ws/src/sdks/python/apache_beam/io/gcp/bigquery.py>:1220:
BeamDeprecationWarning: options is deprecated since First stable release. References to <pipeline>.options
will not be supported
Worker logs: https://console.cloud.google.com/dataflow/jobsDetail/locations/us-central1/jobs/2019-12-03_11_51_05-906624818990921345?project=apache-beam-testing
  experiments = p.options.view_as(DebugOptions).experiments or []
Worker logs: https://console.cloud.google.com/dataflow/jobsDetail/locations/us-central1/jobs/2019-12-03_12_01_58-6278432801475222596?project=apache-beam-testing
Worker logs: https://console.cloud.google.com/dataflow/jobsDetail/locations/us-central1/jobs/2019-12-03_12_11_51-14776417764985959548?project=apache-beam-testing
<https://builds.apache.org/job/beam_PostCommit_Python35/ws/src/sdks/python/apache_beam/runners/dataflow/dataflow_runner.py>:731:
BeamDeprecationWarning: BigQuerySink is deprecated since 2.11.0. Use WriteToBigQuery instead.
Worker logs: https://console.cloud.google.com/dataflow/jobsDetail/locations/us-central1/jobs/2019-12-03_11_38_20-309127218413078646?project=apache-beam-testing
  kms_key=transform.kms_key))
Worker logs: https://console.cloud.google.com/dataflow/jobsDetail/locations/us-central1/jobs/2019-12-03_11_59_12-15186832996829030153?project=apache-beam-testing
Worker logs: https://console.cloud.google.com/dataflow/jobsDetail/locations/us-central1/jobs/2019-12-03_12_08_03-16433973925826198693?project=apache-beam-testing
Worker logs: https://console.cloud.google.com/dataflow/jobsDetail/locations/us-central1/jobs/2019-12-03_12_16_12-16753998195426529680?project=apache-beam-testing
<https://builds.apache.org/job/beam_PostCommit_Python35/ws/src/sdks/python/apache_beam/runners/dataflow/dataflow_runner.py>:731:
BeamDeprecationWarning: BigQuerySink is deprecated since 2.11.0. Use WriteToBigQuery instead.
  kms_key=transform.kms_key))
<https://builds.apache.org/job/beam_PostCommit_Python35/ws/src/sdks/python/apache_beam/runners/dataflow/dataflow_runner.py>:731:
BeamDeprecationWarning: BigQuerySink is deprecated since 2.11.0. Use WriteToBigQuery instead.
  kms_key=transform.kms_key))
Worker logs: https://console.cloud.google.com/dataflow/jobsDetail/locations/us-central1/jobs/2019-12-03_11_38_20-2859784392832154146?project=apache-beam-testing
<https://builds.apache.org/job/beam_PostCommit_Python35/ws/src/sdks/python/apache_beam/runners/dataflow/dataflow_runner.py>:731:
BeamDeprecationWarning: BigQuerySink is deprecated since 2.11.0. Use WriteToBigQuery instead.
Worker logs: https://console.cloud.google.com/dataflow/jobsDetail/locations/us-central1/jobs/2019-12-03_11_48_24-4179037055485436852?project=apache-beam-testing
  kms_key=transform.kms_key))
<https://builds.apache.org/job/beam_PostCommit_Python35/ws/src/sdks/python/apache_beam/runners/dataflow/dataflow_runner.py>:731:
BeamDeprecationWarning: BigQuerySink is deprecated since 2.11.0. Use WriteToBigQuery instead.
Worker logs: https://console.cloud.google.com/dataflow/jobsDetail/locations/us-central1/jobs/2019-12-03_11_58_42-3036625403054654851?project=apache-beam-testing
  kms_key=transform.kms_key))
Worker logs: https://console.cloud.google.com/dataflow/jobsDetail/locations/us-central1/jobs/2019-12-03_12_08_00-2233142770449405237?project=apache-beam-testing
<https://builds.apache.org/job/beam_PostCommit_Python35/ws/src/sdks/python/apache_beam/runners/dataflow/dataflow_runner.py>:731:
BeamDeprecationWarning: BigQuerySink is deprecated since 2.11.0. Use WriteToBigQuery instead.
  kms_key=transform.kms_key))
<https://builds.apache.org/job/beam_PostCommit_Python35/ws/src/sdks/python/apache_beam/io/gcp/big_query_query_to_table_pipeline.py>:73:
BeamDeprecationWarning: BigQuerySink is deprecated since 2.11.0. Use WriteToBigQuery instead.
  kms_key=kms_key))
Worker logs: https://console.cloud.google.com/dataflow/jobsDetail/locations/us-central1/jobs/2019-12-03_12_16_17-18366038685796562254?project=apache-beam-testing
Worker logs: https://console.cloud.google.com/dataflow/jobsDetail/locations/us-central1/jobs/2019-12-03_11_38_20-3865550526664619483?project=apache-beam-testing
<https://builds.apache.org/job/beam_PostCommit_Python35/ws/src/sdks/python/apache_beam/runners/dataflow/dataflow_runner.py>:731:
BeamDeprecationWarning: BigQuerySink is deprecated since 2.11.0. Use WriteToBigQuery instead.
Worker logs: https://console.cloud.google.com/dataflow/jobsDetail/locations/us-central1/jobs/2019-12-03_11_47_05-6677613697501372546?project=apache-beam-testing
  kms_key=transform.kms_key))
Worker logs: https://console.cloud.google.com/dataflow/jobsDetail/locations/us-central1/jobs/2019-12-03_11_59_07-11382698145288630138?project=apache-beam-testing
Worker logs: https://console.cloud.google.com/dataflow/jobsDetail/locations/us-central1/jobs/2019-12-03_12_18_21-7356218643115069225?project=apache-beam-testing
<https://builds.apache.org/job/beam_PostCommit_Python35/ws/src/sdks/python/apache_beam/io/gcp/bigquery.py>:1217:
BeamDeprecationWarning: options is deprecated since First stable release. References to <pipeline>.options
will not be supported
  self.table_reference.projectId = pcoll.pipeline.options.view_as(
Worker logs: https://console.cloud.google.com/dataflow/jobsDetail/locations/us-central1/jobs/2019-12-03_11_38_26-16591551456651083746?project=apache-beam-testing
Worker logs: https://console.cloud.google.com/dataflow/jobsDetail/locations/us-central1/jobs/2019-12-03_11_47_40-14908211571222485018?project=apache-beam-testing
Worker logs: https://console.cloud.google.com/dataflow/jobsDetail/locations/us-central1/jobs/2019-12-03_11_57_11-6492838192447366800?project=apache-beam-testing
Worker logs: https://console.cloud.google.com/dataflow/jobsDetail/locations/us-central1/jobs/2019-12-03_12_07_04-12114384937264914282?project=apache-beam-testing
Worker logs: https://console.cloud.google.com/dataflow/jobsDetail/locations/us-central1/jobs/2019-12-03_12_15_57-6387882237048424413?project=apache-beam-testing
Worker logs: https://console.cloud.google.com/dataflow/jobsDetail/locations/us-central1/jobs/2019-12-03_12_25_08-12985854384286406740?project=apache-beam-testing
Worker logs: https://console.cloud.google.com/dataflow/jobsDetail/locations/us-central1/jobs/2019-12-03_11_38_23-12924310336432845424?project=apache-beam-testing
Worker logs: https://console.cloud.google.com/dataflow/jobsDetail/locations/us-central1/jobs/2019-12-03_11_50_11-2194473169403034642?project=apache-beam-testing
Worker logs: https://console.cloud.google.com/dataflow/jobsDetail/locations/us-central1/jobs/2019-12-03_12_01_27-13936973608622464155?project=apache-beam-testing
Worker logs: https://console.cloud.google.com/dataflow/jobsDetail/locations/us-central1/jobs/2019-12-03_12_11_26-6965312809746388216?project=apache-beam-testing
<https://builds.apache.org/job/beam_PostCommit_Python35/ws/src/sdks/python/apache_beam/io/gcp/bigquery.py>:1220:
BeamDeprecationWarning: options is deprecated since First stable release. References to <pipeline>.options
will not be supported
  experiments = p.options.view_as(DebugOptions).experiments or []
<https://builds.apache.org/job/beam_PostCommit_Python35/ws/src/sdks/python/apache_beam/io/gcp/bigquery_file_loads.py>:797:
BeamDeprecationWarning: options is deprecated since First stable release. References to <pipeline>.options
will not be supported
  temp_location = p.options.view_as(GoogleCloudOptions).temp_location
<https://builds.apache.org/job/beam_PostCommit_Python35/ws/src/sdks/python/apache_beam/io/gcp/bigquery.py>:1220:
BeamDeprecationWarning: options is deprecated since First stable release. References to <pipeline>.options
will not be supported
  experiments = p.options.view_as(DebugOptions).experiments or []
<https://builds.apache.org/job/beam_PostCommit_Python35/ws/src/sdks/python/apache_beam/io/gcp/bigquery_file_loads.py>:797:
BeamDeprecationWarning: options is deprecated since First stable release. References to <pipeline>.options
will not be supported
  temp_location = p.options.view_as(GoogleCloudOptions).temp_location
test_datastore_wordcount_it (apache_beam.examples.cookbook.datastore_wordcount_it_test.DatastoreWordCountIT)
... SKIP: This test still needs to be fixed on Python 3TODO: BEAM-4543
test_avro_it (apache_beam.examples.fastavro_it_test.FastavroIT) ... SKIP: Due to a known issue
in avro-python3 package, thistest is skipped until BEAM-6522 is addressed. 
test_bigquery_tornadoes_it (apache_beam.examples.cookbook.bigquery_tornadoes_it_test.BigqueryTornadoesIT)
... ok
test_streaming_wordcount_it (apache_beam.examples.streaming_wordcount_it_test.StreamingWordCountIT)
... ok
test_autocomplete_it (apache_beam.examples.complete.autocomplete_test.AutocompleteTest) ...
ok
test_wordcount_fnapi_it (apache_beam.examples.wordcount_it_test.WordCountIT) ... ok
test_leader_board_it (apache_beam.examples.complete.game.leader_board_it_test.LeaderBoardIT)
... ok
test_game_stats_it (apache_beam.examples.complete.game.game_stats_it_test.GameStatsIT) ...
ok
test_hourly_team_score_it (apache_beam.examples.complete.game.hourly_team_score_it_test.HourlyTeamScoreIT)
... ok
test_multiple_destinations_transform (apache_beam.io.gcp.bigquery_test.BigQueryStreamingInsertTransformIntegrationTests)
... SKIP: BEAM-8842: Disabled due to reliance on old retry behavior.
test_wordcount_it (apache_beam.examples.wordcount_it_test.WordCountIT) ... ok
test_user_score_it (apache_beam.examples.complete.game.user_score_it_test.UserScoreIT) ...
ok
test_bigquery_read_1M_python (apache_beam.io.gcp.bigquery_io_read_it_test.BigqueryIOReadIT)
... ok
test_datastore_write_limit (apache_beam.io.gcp.datastore_write_it_test.DatastoreWriteIT) ...
SKIP: This test still needs to be fixed on Python 3TODO: BEAM-4543
test_copy (apache_beam.io.gcp.gcsio_integration_test.GcsIOIntegrationTest) ... ok
test_copy_batch (apache_beam.io.gcp.gcsio_integration_test.GcsIOIntegrationTest) ... ok
test_copy_batch_kms (apache_beam.io.gcp.gcsio_integration_test.GcsIOIntegrationTest) ... ok
test_copy_batch_rewrite_token (apache_beam.io.gcp.gcsio_integration_test.GcsIOIntegrationTest)
... ok
test_copy_kms (apache_beam.io.gcp.gcsio_integration_test.GcsIOIntegrationTest) ... ok
test_copy_rewrite_token (apache_beam.io.gcp.gcsio_integration_test.GcsIOIntegrationTest) ...
ok
test_value_provider_transform (apache_beam.io.gcp.bigquery_test.BigQueryStreamingInsertTransformIntegrationTests)
... ok
test_bqfl_streaming (apache_beam.io.gcp.bigquery_file_loads_test.BigQueryFileLoadsIT) ...
SKIP: TestStream is not supported on TestDataflowRunner
test_multiple_destinations_transform (apache_beam.io.gcp.bigquery_file_loads_test.BigQueryFileLoadsIT)
... ok
test_one_job_fails_all_jobs_fail (apache_beam.io.gcp.bigquery_file_loads_test.BigQueryFileLoadsIT)
... ok
test_big_query_read (apache_beam.io.gcp.bigquery_read_it_test.BigQueryReadIntegrationTests)
... ok
test_big_query_read_new_types (apache_beam.io.gcp.bigquery_read_it_test.BigQueryReadIntegrationTests)
... ok
test_file_loads (apache_beam.io.gcp.bigquery_test.PubSubBigQueryIT) ... SKIP: https://issuetracker.google.com/issues/118375066
test_streaming_inserts (apache_beam.io.gcp.bigquery_test.PubSubBigQueryIT) ... ok
test_transform_on_gcs (apache_beam.io.fileio_test.MatchIntegrationTest) ... ok
test_streaming_data_only (apache_beam.io.gcp.pubsub_integration_test.PubSubIntegrationTest)
... ok
test_streaming_with_attributes (apache_beam.io.gcp.pubsub_integration_test.PubSubIntegrationTest)
... ok
test_parquetio_it (apache_beam.io.parquetio_it_test.TestParquetIT) ... ok
test_big_query_write (apache_beam.io.gcp.bigquery_write_it_test.BigQueryWriteIntegrationTests)
... ok
test_big_query_write_new_types (apache_beam.io.gcp.bigquery_write_it_test.BigQueryWriteIntegrationTests)
... ok
test_big_query_write_schema_autodetect (apache_beam.io.gcp.bigquery_write_it_test.BigQueryWriteIntegrationTests)
... SKIP: DataflowRunner does not support schema autodetection
test_big_query_write_without_schema (apache_beam.io.gcp.bigquery_write_it_test.BigQueryWriteIntegrationTests)
... ok
test_big_query_legacy_sql (apache_beam.io.gcp.big_query_query_to_table_it_test.BigQueryQueryToTableIT)
... ok
test_big_query_new_types (apache_beam.io.gcp.big_query_query_to_table_it_test.BigQueryQueryToTableIT)
... ok
test_big_query_standard_sql (apache_beam.io.gcp.big_query_query_to_table_it_test.BigQueryQueryToTableIT)
... ok
test_big_query_standard_sql_kms_key_native (apache_beam.io.gcp.big_query_query_to_table_it_test.BigQueryQueryToTableIT)
... ok
Runs streaming Dataflow job and verifies that user metrics are reported ... ok
test_job_python_from_python_it (apache_beam.transforms.external_test_it.ExternalTransformIT)
... ok
test_metrics_fnapi_it (apache_beam.runners.dataflow.dataflow_exercise_metrics_pipeline_test.ExerciseMetricsPipelineTest)
... ok
test_metrics_it (apache_beam.runners.dataflow.dataflow_exercise_metrics_pipeline_test.ExerciseMetricsPipelineTest)
... ok
test_datastore_write_limit (apache_beam.io.gcp.datastore.v1new.datastore_write_it_test.DatastoreWriteIT)
... ok

----------------------------------------------------------------------
XML: nosetests-postCommitIT-df-py35.xml
----------------------------------------------------------------------
XML: <https://builds.apache.org/job/beam_PostCommit_Python35/ws/src/sdks/python/nosetests.xml>
----------------------------------------------------------------------
Ran 45 tests in 3314.030s

OK (SKIP=7)

FAILURE: Build failed with an exception.

* Where:
Build file '<https://builds.apache.org/job/beam_PostCommit_Python35/ws/src/sdks/python/test-suites/direct/py35/build.gradle'>
line: 51

* What went wrong:
Execution failed for task ':sdks:python:test-suites:direct:py35:postCommitIT'.
> Process 'command 'sh'' finished with non-zero exit value 1

* Try:
Run with --stacktrace option to get the stack trace. Run with --info or --debug option to
get more log output. Run with --scan to get full insights.

* Get more help at https://help.gradle.org

Deprecated Gradle features were used in this build, making it incompatible with Gradle 6.0.
Use '--warning-mode all' to show the individual deprecation warnings.
See https://docs.gradle.org/5.2.1/userguide/command_line_interface.html#sec:command_line_warnings

BUILD FAILED in 56m 23s
83 actionable tasks: 62 executed, 21 from cache

Publishing build scan...
https://scans.gradle.com/s/x4guaaqyqk6lq

Build step 'Invoke Gradle script' changed build result to FAILURE
Build step 'Invoke Gradle script' marked build as failure

---------------------------------------------------------------------
To unsubscribe, e-mail: builds-unsubscribe@beam.apache.org
For additional commands, e-mail: builds-help@beam.apache.org


Mime
View raw message