beam-builds mailing list archives

Site index · List index
Message view « Date » · « Thread »
Top « Date » · « Thread »
From Apache Jenkins Server <jenk...@builds.apache.org>
Subject Build failed in Jenkins: beam_PostCommit_Py_ValCont #5115
Date Tue, 24 Dec 2019 06:24:17 GMT
See <https://builds.apache.org/job/beam_PostCommit_Py_ValCont/5115/display/redirect>

Changes:


------------------------------------------
[...truncated 624.47 KB...]
copying apache_beam/transforms/write_ptransform_test.py -> apache-beam-2.19.0.dev0/apache_beam/transforms
copying apache_beam/typehints/__init__.py -> apache-beam-2.19.0.dev0/apache_beam/typehints
copying apache_beam/typehints/decorators.py -> apache-beam-2.19.0.dev0/apache_beam/typehints
copying apache_beam/typehints/decorators_test.py -> apache-beam-2.19.0.dev0/apache_beam/typehints
copying apache_beam/typehints/decorators_test_py3.py -> apache-beam-2.19.0.dev0/apache_beam/typehints
copying apache_beam/typehints/native_type_compatibility.py -> apache-beam-2.19.0.dev0/apache_beam/typehints
copying apache_beam/typehints/native_type_compatibility_test.py -> apache-beam-2.19.0.dev0/apache_beam/typehints
copying apache_beam/typehints/opcodes.py -> apache-beam-2.19.0.dev0/apache_beam/typehints
copying apache_beam/typehints/schemas.py -> apache-beam-2.19.0.dev0/apache_beam/typehints
copying apache_beam/typehints/schemas_test.py -> apache-beam-2.19.0.dev0/apache_beam/typehints
copying apache_beam/typehints/trivial_inference.py -> apache-beam-2.19.0.dev0/apache_beam/typehints
copying apache_beam/typehints/trivial_inference_test.py -> apache-beam-2.19.0.dev0/apache_beam/typehints
copying apache_beam/typehints/trivial_inference_test_py3.py -> apache-beam-2.19.0.dev0/apache_beam/typehints
copying apache_beam/typehints/typecheck.py -> apache-beam-2.19.0.dev0/apache_beam/typehints
copying apache_beam/typehints/typed_pipeline_test.py -> apache-beam-2.19.0.dev0/apache_beam/typehints
copying apache_beam/typehints/typed_pipeline_test_py3.py -> apache-beam-2.19.0.dev0/apache_beam/typehints
copying apache_beam/typehints/typehints.py -> apache-beam-2.19.0.dev0/apache_beam/typehints
copying apache_beam/typehints/typehints_test.py -> apache-beam-2.19.0.dev0/apache_beam/typehints
copying apache_beam/typehints/typehints_test_py3.py -> apache-beam-2.19.0.dev0/apache_beam/typehints
copying apache_beam/utils/__init__.py -> apache-beam-2.19.0.dev0/apache_beam/utils
copying apache_beam/utils/annotations.py -> apache-beam-2.19.0.dev0/apache_beam/utils
copying apache_beam/utils/annotations_test.py -> apache-beam-2.19.0.dev0/apache_beam/utils
copying apache_beam/utils/counters.pxd -> apache-beam-2.19.0.dev0/apache_beam/utils
copying apache_beam/utils/counters.py -> apache-beam-2.19.0.dev0/apache_beam/utils
copying apache_beam/utils/counters_test.py -> apache-beam-2.19.0.dev0/apache_beam/utils
copying apache_beam/utils/interactive_utils.py -> apache-beam-2.19.0.dev0/apache_beam/utils
copying apache_beam/utils/plugin.py -> apache-beam-2.19.0.dev0/apache_beam/utils
copying apache_beam/utils/processes.py -> apache-beam-2.19.0.dev0/apache_beam/utils
copying apache_beam/utils/processes_test.py -> apache-beam-2.19.0.dev0/apache_beam/utils
copying apache_beam/utils/profiler.py -> apache-beam-2.19.0.dev0/apache_beam/utils
copying apache_beam/utils/proto_utils.py -> apache-beam-2.19.0.dev0/apache_beam/utils
copying apache_beam/utils/retry.py -> apache-beam-2.19.0.dev0/apache_beam/utils
copying apache_beam/utils/retry_test.py -> apache-beam-2.19.0.dev0/apache_beam/utils
copying apache_beam/utils/subprocess_server.py -> apache-beam-2.19.0.dev0/apache_beam/utils
copying apache_beam/utils/thread_pool_executor.py -> apache-beam-2.19.0.dev0/apache_beam/utils
copying apache_beam/utils/thread_pool_executor_test.py -> apache-beam-2.19.0.dev0/apache_beam/utils
copying apache_beam/utils/timestamp.py -> apache-beam-2.19.0.dev0/apache_beam/utils
copying apache_beam/utils/timestamp_test.py -> apache-beam-2.19.0.dev0/apache_beam/utils
copying apache_beam/utils/urns.py -> apache-beam-2.19.0.dev0/apache_beam/utils
copying apache_beam/utils/windowed_value.pxd -> apache-beam-2.19.0.dev0/apache_beam/utils
copying apache_beam/utils/windowed_value.py -> apache-beam-2.19.0.dev0/apache_beam/utils
copying apache_beam/utils/windowed_value_test.py -> apache-beam-2.19.0.dev0/apache_beam/utils
Writing apache-beam-2.19.0.dev0/setup.cfg
creating dist
Creating tar archive
removing 'apache-beam-2.19.0.dev0' (and everything under it)
SDK_LOCATION=$(find dist/apache-beam-*.tar.gz)
find dist/apache-beam-*.tar.gz

# Run ValidatesRunner tests on Google Cloud Dataflow service
echo ">>> RUNNING DATAFLOW RUNNER VALIDATESCONTAINER TEST"
>>> RUNNING DATAFLOW RUNNER VALIDATESCONTAINER TEST
python setup.py nosetests \
  --attr ValidatesContainer \
  --nologcapture \
  --processes=1 \
  --process-timeout=900 \
  --with-xunitmp \
  --xunitmp-file=$XUNIT_FILE \
  --ignore-files '.*py3\d?\.py$' \
  --test-pipeline-options=" \
    --runner=TestDataflowRunner \
    --project=$PROJECT \
    --worker_harness_container_image=$CONTAINER:$TAG \
    --staging_location=$GCS_LOCATION/staging-validatesrunner-test \
    --temp_location=$GCS_LOCATION/temp-validatesrunner-test \
    --output=$GCS_LOCATION/output \
    --sdk_location=$SDK_LOCATION \
    --num_workers=1"
setup.py:236: UserWarning: You are using Apache Beam with Python 2. New releases of Apache
Beam will soon support Python 3 only.
  'You are using Apache Beam with Python 2. '
<https://builds.apache.org/job/beam_PostCommit_Py_ValCont/ws/src/sdks/python/container/venv/python/local/lib/python2.7/site-packages/setuptools/dist.py>:476:
UserWarning: Normalizing '2.19.0.dev' to '2.19.0.dev0'
  normalized_version,
running nosetests
running egg_info
<https://builds.apache.org/job/beam_PostCommit_Py_ValCont/ws/src/sdks/python/gen_protos.py>:55:
UserWarning: Installing grpcio-tools is recommended for development.
  warnings.warn('Installing grpcio-tools is recommended for development.')
writing requirements to apache_beam.egg-info/requires.txt
writing apache_beam.egg-info/PKG-INFO
writing top-level names to apache_beam.egg-info/top_level.txt
writing dependency_links to apache_beam.egg-info/dependency_links.txt
writing entry points to apache_beam.egg-info/entry_points.txt
reading manifest file 'apache_beam.egg-info/SOURCES.txt'
reading manifest template 'MANIFEST.in'
warning: no files found matching 'README.md'
warning: no files found matching 'NOTICE'
warning: no files found matching 'LICENSE'
writing manifest file 'apache_beam.egg-info/SOURCES.txt'
<https://builds.apache.org/job/beam_PostCommit_Py_ValCont/ws/src/sdks/python/apache_beam/__init__.py>:84:
UserWarning: You are using Apache Beam with Python 2. New releases of Apache Beam will soon
support Python 3 only.
  'You are using Apache Beam with Python 2. '
No handlers could be found for logger "apache_beam.io.gcp.datastore.v1.datastoreio"
WARNING:root:python-snappy is not installed; some tests will be skipped.
WARNING:root:Tensorflow is not installed, so skipping some tests.
WARNING:apache_beam.runners.interactive.interactive_environment:Interactive Beam requires
Python 3.5.3+.
WARNING:apache_beam.runners.interactive.interactive_environment:Dependencies required for
Interactive Beam PCollection visualization are not available, please use: `pip install apache-beam[interactive]`
to install necessary dependencies to enable all data visualization features.
WARNING:apache_beam.runners.interactive.interactive_environment:You cannot use Interactive
Beam features when you are not in an interactive environment such as a Jupyter notebook or
ipython terminal.
WARNING:root:Make sure that locally built Python SDK docker image has Python 2.7 interpreter.
<https://builds.apache.org/job/beam_PostCommit_Py_ValCont/ws/src/sdks/python/apache_beam/transforms/trigger_test.py>:506:
YAMLLoadWarning: calling yaml.load_all() without Loader=... is deprecated, as the default
Loader is unsafe. Please read https://msg.pyyaml.org/load for full details.
  for spec in yaml.load_all(open(transcript_filename)):
WARNING:apache_beam.options.pipeline_options:--region not set; will default to us-central1.
Future releases of Beam will require the user to set --region explicitly, or else have a default
set via the gcloud tool. https://cloud.google.com/compute/docs/regions-zones
WARNING:apache_beam.options.pipeline_options:--region not set; will default to us-central1.
Future releases of Beam will require the user to set --region explicitly, or else have a default
set via the gcloud tool. https://cloud.google.com/compute/docs/regions-zones
test_wordcount_fnapi_it (apache_beam.examples.wordcount_it_test.WordCountIT) ... ERROR
test_metrics_fnapi_it (apache_beam.runners.dataflow.dataflow_exercise_metrics_pipeline_test.ExerciseMetricsPipelineTest)
... ERROR

======================================================================
ERROR: test_wordcount_fnapi_it (apache_beam.examples.wordcount_it_test.WordCountIT)
----------------------------------------------------------------------
Traceback (most recent call last):
  File "<https://builds.apache.org/job/beam_PostCommit_Py_ValCont/ws/src/sdks/python/container/venv/python/local/lib/python2.7/site-packages/nose/plugins/multiprocess.py",>
line 812, in run
    test(orig)
  File "<https://builds.apache.org/job/beam_PostCommit_Py_ValCont/ws/src/sdks/python/container/venv/python/local/lib/python2.7/site-packages/nose/case.py",>
line 45, in __call__
    return self.run(*arg, **kwarg)
  File "<https://builds.apache.org/job/beam_PostCommit_Py_ValCont/ws/src/sdks/python/container/venv/python/local/lib/python2.7/site-packages/nose/case.py",>
line 133, in run
    self.runTest(result)
  File "<https://builds.apache.org/job/beam_PostCommit_Py_ValCont/ws/src/sdks/python/container/venv/python/local/lib/python2.7/site-packages/nose/case.py",>
line 151, in runTest
    test(result)
  File "/usr/lib/python2.7/unittest/case.py", line 393, in __call__
    return self.run(*args, **kwds)
  File "/usr/lib/python2.7/unittest/case.py", line 329, in run
    testMethod()
  File "<https://builds.apache.org/job/beam_PostCommit_Py_ValCont/ws/src/sdks/python/apache_beam/examples/wordcount_it_test.py",>
line 52, in test_wordcount_fnapi_it
    self._run_wordcount_it(wordcount.run, experiment='beam_fn_api')
  File "<https://builds.apache.org/job/beam_PostCommit_Py_ValCont/ws/src/sdks/python/apache_beam/examples/wordcount_it_test.py",>
line 85, in _run_wordcount_it
    save_main_session=False)
  File "<https://builds.apache.org/job/beam_PostCommit_Py_ValCont/ws/src/sdks/python/apache_beam/examples/wordcount.py",>
line 117, in run
    result = p.run()
  File "<https://builds.apache.org/job/beam_PostCommit_Py_ValCont/ws/src/sdks/python/apache_beam/pipeline.py",>
line 460, in run
    self._options).run(False)
  File "<https://builds.apache.org/job/beam_PostCommit_Py_ValCont/ws/src/sdks/python/apache_beam/pipeline.py",>
line 473, in run
    return self.runner.run_pipeline(self, self._options)
  File "<https://builds.apache.org/job/beam_PostCommit_Py_ValCont/ws/src/sdks/python/apache_beam/runners/dataflow/test_dataflow_runner.py",>
line 73, in run_pipeline
    self.result.cancel()
  File "<https://builds.apache.org/job/beam_PostCommit_Py_ValCont/ws/src/sdks/python/apache_beam/runners/dataflow/dataflow_runner.py",>
line 1462, in cancel
    self.job_id(), 'JOB_STATE_CANCELLED'):
  File "<https://builds.apache.org/job/beam_PostCommit_Py_ValCont/ws/src/sdks/python/apache_beam/utils/retry.py",>
line 224, in wrapper
    return fun(*args, **kwargs)
  File "<https://builds.apache.org/job/beam_PostCommit_Py_ValCont/ws/src/sdks/python/apache_beam/runners/dataflow/internal/apiclient.py",>
line 647, in modify_job_state
    self._client.projects_locations_jobs.Update(request)
  File "<https://builds.apache.org/job/beam_PostCommit_Py_ValCont/ws/src/sdks/python/apache_beam/runners/dataflow/internal/clients/dataflow/dataflow_v1b3_client.py",>
line 758, in Update
    config, request, global_params=global_params)
  File "<https://builds.apache.org/job/beam_PostCommit_Py_ValCont/ws/src/sdks/python/container/venv/python/local/lib/python2.7/site-packages/apitools/base/py/base_api.py",>
line 729, in _RunMethod
    http, http_request, **opts)
  File "<https://builds.apache.org/job/beam_PostCommit_Py_ValCont/ws/src/sdks/python/container/venv/python/local/lib/python2.7/site-packages/apitools/base/py/http_wrapper.py",>
line 346, in MakeRequest
    check_response_func=check_response_func)
  File "<https://builds.apache.org/job/beam_PostCommit_Py_ValCont/ws/src/sdks/python/container/venv/python/local/lib/python2.7/site-packages/apitools/base/py/http_wrapper.py",>
line 396, in _MakeRequestNoRetry
    redirections=redirections, connection_type=connection_type)
  File "<https://builds.apache.org/job/beam_PostCommit_Py_ValCont/ws/src/sdks/python/container/venv/python/local/lib/python2.7/site-packages/oauth2client/transport.py",>
line 169, in new_request
    redirections, connection_type)
  File "<https://builds.apache.org/job/beam_PostCommit_Py_ValCont/ws/src/sdks/python/container/venv/python/local/lib/python2.7/site-packages/oauth2client/transport.py",>
line 169, in new_request
    redirections, connection_type)
  File "<https://builds.apache.org/job/beam_PostCommit_Py_ValCont/ws/src/sdks/python/container/venv/python/local/lib/python2.7/site-packages/httplib2/__init__.py",>
line 2133, in request
    cachekey,
  File "<https://builds.apache.org/job/beam_PostCommit_Py_ValCont/ws/src/sdks/python/container/venv/python/local/lib/python2.7/site-packages/httplib2/__init__.py",>
line 1796, in _request
    conn, request_uri, method, body, headers
  File "<https://builds.apache.org/job/beam_PostCommit_Py_ValCont/ws/src/sdks/python/container/venv/python/local/lib/python2.7/site-packages/httplib2/__init__.py",>
line 1737, in _conn_request
    response = conn.getresponse()
  File "/usr/lib/python2.7/httplib.py", line 1152, in getresponse
    response.begin()
  File "/usr/lib/python2.7/httplib.py", line 463, in begin
    version, status, reason = self._read_status()
  File "/usr/lib/python2.7/httplib.py", line 419, in _read_status
    line = self.fp.readline(_MAXLINE + 1)
  File "/usr/lib/python2.7/socket.py", line 480, in readline
    data = self._sock.recv(self._rbufsize)
  File "/usr/lib/python2.7/ssl.py", line 756, in recv
    return self.read(buflen)
  File "/usr/lib/python2.7/ssl.py", line 643, in read
    v = self._sslobj.read(len)
  File "<https://builds.apache.org/job/beam_PostCommit_Py_ValCont/ws/src/sdks/python/container/venv/python/local/lib/python2.7/site-packages/nose/plugins/multiprocess.py",>
line 276, in signalhandler
    raise TimedOutException()
TimedOutException: 'test_wordcount_fnapi_it (apache_beam.examples.wordcount_it_test.WordCountIT)'

======================================================================
ERROR: test_metrics_fnapi_it (apache_beam.runners.dataflow.dataflow_exercise_metrics_pipeline_test.ExerciseMetricsPipelineTest)
----------------------------------------------------------------------
Traceback (most recent call last):
  File "<https://builds.apache.org/job/beam_PostCommit_Py_ValCont/ws/src/sdks/python/container/venv/python/local/lib/python2.7/site-packages/nose/plugins/multiprocess.py",>
line 812, in run
    test(orig)
  File "<https://builds.apache.org/job/beam_PostCommit_Py_ValCont/ws/src/sdks/python/container/venv/python/local/lib/python2.7/site-packages/nose/case.py",>
line 45, in __call__
    return self.run(*arg, **kwarg)
  File "<https://builds.apache.org/job/beam_PostCommit_Py_ValCont/ws/src/sdks/python/container/venv/python/local/lib/python2.7/site-packages/nose/case.py",>
line 133, in run
    self.runTest(result)
  File "<https://builds.apache.org/job/beam_PostCommit_Py_ValCont/ws/src/sdks/python/container/venv/python/local/lib/python2.7/site-packages/nose/case.py",>
line 151, in runTest
    test(result)
  File "/usr/lib/python2.7/unittest/case.py", line 393, in __call__
    return self.run(*args, **kwds)
  File "/usr/lib/python2.7/unittest/case.py", line 329, in run
    testMethod()
  File "<https://builds.apache.org/job/beam_PostCommit_Py_ValCont/ws/src/sdks/python/apache_beam/runners/dataflow/dataflow_exercise_metrics_pipeline_test.py",>
line 56, in test_metrics_fnapi_it
    result = self.run_pipeline(experiment='beam_fn_api')
  File "<https://builds.apache.org/job/beam_PostCommit_Py_ValCont/ws/src/sdks/python/apache_beam/runners/dataflow/dataflow_exercise_metrics_pipeline_test.py",>
line 37, in run_pipeline
    test_pipeline = TestPipeline(is_integration_test=True)
  File "<https://builds.apache.org/job/beam_PostCommit_Py_ValCont/ws/src/sdks/python/apache_beam/testing/test_pipeline.py",>
line 103, in __init__
    self._parse_test_option_args(argv) + additional_pipeline_args)
  File "<https://builds.apache.org/job/beam_PostCommit_Py_ValCont/ws/src/sdks/python/apache_beam/testing/test_pipeline.py",>
line 155, in _parse_test_option_args
    if known.test_pipeline_options else []
  File "/usr/lib/python2.7/shlex.py", line 279, in split
    return list(lex)
  File "/usr/lib/python2.7/shlex.py", line 269, in next
    token = self.get_token()
  File "/usr/lib/python2.7/shlex.py", line 96, in get_token
    raw = self.read_token()
  File "/usr/lib/python2.7/shlex.py", line 125, in read_token
    if nextchar == '\n':
  File "<https://builds.apache.org/job/beam_PostCommit_Py_ValCont/ws/src/sdks/python/container/venv/python/local/lib/python2.7/site-packages/nose/plugins/multiprocess.py",>
line 276, in signalhandler
    raise TimedOutException()
TimedOutException: 'test_metrics_fnapi_it (apache_beam.runners.dataflow.dataflow_exercise_metrics_pipeline_test.ExerciseMetricsPipelineTest)'

----------------------------------------------------------------------
XML: nosetests-python2.7_sdk.xml
----------------------------------------------------------------------
XML: <https://builds.apache.org/job/beam_PostCommit_Py_ValCont/ws/src/sdks/python/nosetests.xml>
----------------------------------------------------------------------
Ran 2 tests in 903.818s

FAILED (errors=2)
cleanup_container
Untagged: us.gcr.io/apache-beam-testing/jenkins/python2.7_sdk:20191224-060024
Untagged: us.gcr.io/apache-beam-testing/jenkins/python2.7_sdk@sha256:480615e41a120770929c7239cd269ab450bb41f2faaf3053bc4998d425187032
Deleted: sha256:c7d79d7d4747038a610b5f20a98c08ba73783359c4ab113d9d20047466504dd4
Deleted: sha256:6c784a20301335d727e6ec83ac9ba60d1983303b94f854b80b29d9230017b62a
Deleted: sha256:238479975a0160011439a283c5c63bd689255969f9d0186342d2274a3e1a98e9
Deleted: sha256:cc9b9dba1c85ace38942e3500dc102640077b7175eb77f14042b2d5df0e9b893
Deleted: sha256:51707d2a6348ae1d5f60bc6c37ef27d519787a974b256d73dd4f0d51fe2342c0
Deleted: sha256:cf69ffbc66cb7c36d866be45024f1b071db6153dd5bb09d24480decf846e1430
Deleted: sha256:1e52a21ef12377a56e2ef1f3994387b5a154ed4415d53ab8ebdd5b9049855a7c
Deleted: sha256:665c51aa9464f95a056dffc55c7937a94fa9f97981164ea45549d38b8fb844b7
Deleted: sha256:f68a7e57e0706d92fc5597643333025af8327a89daf762cb5d17665df678d778
Deleted: sha256:bbcda49388a21e062a852e8474354e3ef5b100a957bbd336f5da5b322b2ab8f2
Deleted: sha256:f2339cbffb0d95987e90fae65092d990d65f577d3f52dea90292aea5e2416fdc
Deleted: sha256:6b6771bee4efc3caea3290a214958f072fe5591e11a5f4222cc41b1d780c238f
Deleted: sha256:eb1e9af5de81cf4e73a7bf5e8972ce67cfcdbe5b26e56f6772bc68ea89813b88
Deleted: sha256:b884791836db4b8087dcaf344448700dfe42afd06b38918a610caad7113dc14d
Deleted: sha256:17fa00dad5fde432958525e4f048252f0a26a7af59bcdcffa1d0da4e4efeced7
Deleted: sha256:b9f9e97b5068ac69482378ec43b1b4746f4501f6aedecfbadaeb1bf1143cb88d
Deleted: sha256:a8f9d71c30fa8ddd8feeba2ff0def0075c135de826dad3d6ff65e5d1cd9fc624
Deleted: sha256:056eeef0af02cc618fe495372f1422940f4997cf5436278f1fdbee6057da3624
Deleted: sha256:4a93575ed480a4fd14e9676d33d982abd607f46a72772762424c1a52f26d1dbf
Deleted: sha256:c414f8bbd4792b9744c4420940549e4ad6a8869e54194a9d633bd0ddf70dd905
Digests:
- us.gcr.io/apache-beam-testing/jenkins/python2.7_sdk@sha256:480615e41a120770929c7239cd269ab450bb41f2faaf3053bc4998d425187032
  Associated tags:
 - 20191224-060024
Tags:
- us.gcr.io/apache-beam-testing/jenkins/python2.7_sdk:20191224-060024
Deleted [us.gcr.io/apache-beam-testing/jenkins/python2.7_sdk:20191224-060024].
Deleted [us.gcr.io/apache-beam-testing/jenkins/python2.7_sdk@sha256:480615e41a120770929c7239cd269ab450bb41f2faaf3053bc4998d425187032].
Removed the container
Build step 'Execute shell' marked build as failure

---------------------------------------------------------------------
To unsubscribe, e-mail: builds-unsubscribe@beam.apache.org
For additional commands, e-mail: builds-help@beam.apache.org


Mime
View raw message