beam-builds mailing list archives

Site index · List index
Message view « Date » · « Thread »
Top « Date » · « Thread »
From Apache Jenkins Server <jenk...@builds.apache.org>
Subject Build failed in Jenkins: beam_BiqQueryIO_Streaming_Performance_Test_Java #233
Date Mon, 09 Dec 2019 12:49:35 GMT
See <https://builds.apache.org/job/beam_BiqQueryIO_Streaming_Performance_Test_Java/233/display/redirect?page=changes>

Changes:

[michal.walenia] [BEAM-8895] Add BigQuery table name sanitization to BigQueryIOIT

[michal.walenia] [BEAM-8918] Split batch BQIOIT into avro and json using tests


------------------------------------------
[...truncated 199.19 KB...]
  No history is available.
Custom actions are attached to task ':sdks:java:harness:shadowJar'.

> Task :sdks:java:core:shadowTestJar
Build cache key for task ':sdks:java:core:shadowTestJar' is e281e1fb529b1f0c09c29434ae0ce49a
Caching disabled for task ':sdks:java:core:shadowTestJar': Caching has not been enabled for
the task
Task ':sdks:java:core:shadowTestJar' is not up-to-date because:
  No history is available.
*******************
GRADLE SHADOW STATS

Total Jars: 5 (includes project)
Total Time: 1.802s [1802ms]
Average Time/Jar: 0.3604s [360.4ms]
*******************
:sdks:java:core:shadowTestJar (Thread[Execution worker for ':' Thread 10,5,main]) completed.
Took 3.502 secs.
:sdks:java:extensions:google-cloud-platform-core:compileTestJava (Thread[Execution worker
for ':' Thread 10,5,main]) started.

> Task :sdks:java:extensions:google-cloud-platform-core:compileTestJava FROM-CACHE
Build cache key for task ':sdks:java:extensions:google-cloud-platform-core:compileTestJava'
is 9fdec4b1d291a168a5f3210f81f0f3ad
Task ':sdks:java:extensions:google-cloud-platform-core:compileTestJava' is not up-to-date
because:
  No history is available.
Origin for org.gradle.api.internal.tasks.execution.ExecuteActionsTaskExecuter$TaskExecution@1541a26a:
{executionTime=5946, hostName=apache-beam-jenkins-10, operatingSystem=Linux, buildInvocationId=kusubjxzfjeqpa264jv4o45xsm,
creationTime=1575659896443, identity=:sdks:java:extensions:google-cloud-platform-core:compileTestJava,
type=org.gradle.api.internal.tasks.execution.ExecuteActionsTaskExecuter.TaskExecution, userName=jenkins,
gradleVersion=5.2.1, rootPath=/home/jenkins/jenkins-slave/workspace/beam_PostCommit_Java11_ValidatesRunner_Dataflow/src}
Unpacked trees for task ':sdks:java:extensions:google-cloud-platform-core:compileTestJava'
from cache.
:sdks:java:extensions:google-cloud-platform-core:compileTestJava (Thread[Execution worker
for ':' Thread 10,5,main]) completed. Took 0.365 secs.
:sdks:java:extensions:google-cloud-platform-core:testClasses (Thread[Execution worker for
':' Thread 10,5,main]) started.

> Task :sdks:java:extensions:google-cloud-platform-core:testClasses UP-TO-DATE
Skipping task ':sdks:java:extensions:google-cloud-platform-core:testClasses' as it has no
actions.
:sdks:java:extensions:google-cloud-platform-core:testClasses (Thread[Execution worker for
':' Thread 10,5,main]) completed. Took 0.0 secs.
:sdks:java:extensions:google-cloud-platform-core:testJar (Thread[Execution worker for ':'
Thread 10,5,main]) started.

> Task :sdks:java:extensions:google-cloud-platform-core:testJar
Build cache key for task ':sdks:java:extensions:google-cloud-platform-core:testJar' is da19b672e4cf9a1cd9e1c7f49c9b4030
Caching disabled for task ':sdks:java:extensions:google-cloud-platform-core:testJar': Caching
has not been enabled for the task
Task ':sdks:java:extensions:google-cloud-platform-core:testJar' is not up-to-date because:
  No history is available.
:sdks:java:extensions:google-cloud-platform-core:testJar (Thread[Execution worker for ':'
Thread 10,5,main]) completed. Took 0.017 secs.

> Task :sdks:java:harness:shadowJar
*******************
GRADLE SHADOW STATS

Total Jars: 53 (includes project)
Total Time: 7.42s [7420ms]
Average Time/Jar: 0.14s [140.0ms]
*******************
:sdks:java:harness:shadowJar (Thread[Execution worker for ':' Thread 8,5,main]) completed.
Took 7.974 secs.
:runners:java-fn-execution:compileJava (Thread[Execution worker for ':' Thread 8,5,main])
started.

> Task :runners:java-fn-execution:compileJava FROM-CACHE
Build cache key for task ':runners:java-fn-execution:compileJava' is 94fe7e5796c2553a8cd29fd58ff76cea
Task ':runners:java-fn-execution:compileJava' is not up-to-date because:
  No history is available.
Origin for org.gradle.api.internal.tasks.execution.ExecuteActionsTaskExecuter$TaskExecution@487d4343:
{executionTime=15398, hostName=apache-beam-jenkins-10, operatingSystem=Linux, buildInvocationId=yuka67ek55arrmxobxt45gsnx4,
creationTime=1575644222638, identity=:runners:java-fn-execution:compileJava, type=org.gradle.api.internal.tasks.execution.ExecuteActionsTaskExecuter.TaskExecution,
userName=jenkins, gradleVersion=5.2.1, rootPath=/home/jenkins/jenkins-slave/workspace/beam_PostCommit_Go/src}
Unpacked trees for task ':runners:java-fn-execution:compileJava' from cache.
:runners:java-fn-execution:compileJava (Thread[Execution worker for ':' Thread 8,5,main])
completed. Took 2.481 secs.
:runners:java-fn-execution:classes (Thread[Execution worker for ':' Thread 8,5,main]) started.

> Task :runners:java-fn-execution:classes UP-TO-DATE
Skipping task ':runners:java-fn-execution:classes' as it has no actions.
:runners:java-fn-execution:classes (Thread[Execution worker for ':' Thread 8,5,main]) completed.
Took 0.0 secs.
:runners:java-fn-execution:jar (Thread[Execution worker for ':' Thread 4,5,main]) started.

> Task :runners:java-fn-execution:jar
Build cache key for task ':runners:java-fn-execution:jar' is 0d153cfa410c484e3905c88fb6946d24
Caching disabled for task ':runners:java-fn-execution:jar': Caching has not been enabled for
the task
Task ':runners:java-fn-execution:jar' is not up-to-date because:
  No history is available.
:runners:java-fn-execution:jar (Thread[Execution worker for ':' Thread 4,5,main]) completed.
Took 0.051 secs.
:runners:direct-java:compileJava (Thread[Execution worker for ':' Thread 4,5,main]) started.
:runners:google-cloud-dataflow-java:worker:legacy-worker:compileJava (Thread[Execution worker
for ':' Thread 10,5,main]) started.

> Task :runners:direct-java:compileJava FROM-CACHE
Build cache key for task ':runners:direct-java:compileJava' is 227902d6b7b2f7f16cf9baa40b3521b2
Task ':runners:direct-java:compileJava' is not up-to-date because:
  No history is available.
Origin for org.gradle.api.internal.tasks.execution.ExecuteActionsTaskExecuter$TaskExecution@2b4a4982:
{executionTime=10992, hostName=apache-beam-jenkins-10, operatingSystem=Linux, buildInvocationId=vgfuolsrava4poqijk5yke45te,
creationTime=1575644233351, identity=:runners:direct-java:compileJava, type=org.gradle.api.internal.tasks.execution.ExecuteActionsTaskExecuter.TaskExecution,
userName=jenkins, gradleVersion=5.2.1, rootPath=/home/jenkins/jenkins-slave/workspace/beam_PostCommit_Java_ValidatesRunner_Spark/src}
Unpacked trees for task ':runners:direct-java:compileJava' from cache.
:runners:direct-java:compileJava (Thread[Execution worker for ':' Thread 4,5,main]) completed.
Took 0.082 secs.
:runners:direct-java:classes (Thread[Execution worker for ':' Thread 4,5,main]) started.

> Task :runners:direct-java:classes UP-TO-DATE
Skipping task ':runners:direct-java:classes' as it has no actions.
:runners:direct-java:classes (Thread[Execution worker for ':' Thread 4,5,main]) completed.
Took 0.0 secs.
:runners:direct-java:shadowJar (Thread[Execution worker for ':' Thread 8,5,main]) started.

> Task :runners:google-cloud-dataflow-java:worker:legacy-worker:compileJava FROM-CACHE
file or directory '<https://builds.apache.org/job/beam_BiqQueryIO_Streaming_Performance_Test_Java/ws/src/runners/google-cloud-dataflow-java/worker/legacy-worker/src/main/java',>
not found
Build cache key for task ':runners:google-cloud-dataflow-java:worker:legacy-worker:compileJava'
is b031d445155c010cf7f8c854c9ae7919
Task ':runners:google-cloud-dataflow-java:worker:legacy-worker:compileJava' is not up-to-date
because:
  No history is available.
Origin for org.gradle.api.internal.tasks.execution.ExecuteActionsTaskExecuter$TaskExecution@6b2a517b:
{executionTime=22661, hostName=apache-beam-jenkins-10, operatingSystem=Linux, buildInvocationId=mzm54k3xknauzojffqnoj2f4he,
creationTime=1575663202334, identity=:runners:google-cloud-dataflow-java:worker:legacy-worker:compileJava,
type=org.gradle.api.internal.tasks.execution.ExecuteActionsTaskExecuter.TaskExecution, userName=jenkins,
gradleVersion=5.2.1, rootPath=/home/jenkins/jenkins-slave/workspace/beam_PostCommit_Java/src}
Unpacked trees for task ':runners:google-cloud-dataflow-java:worker:legacy-worker:compileJava'
from cache.
:runners:google-cloud-dataflow-java:worker:legacy-worker:compileJava (Thread[Execution worker
for ':' Thread 10,5,main]) completed. Took 0.298 secs.
:runners:google-cloud-dataflow-java:worker:legacy-worker:classes (Thread[Execution worker
for ':' Thread 10,5,main]) started.

> Task :runners:google-cloud-dataflow-java:worker:legacy-worker:classes UP-TO-DATE
Skipping task ':runners:google-cloud-dataflow-java:worker:legacy-worker:classes' as it has
no actions.
:runners:google-cloud-dataflow-java:worker:legacy-worker:classes (Thread[Execution worker
for ':' Thread 10,5,main]) completed. Took 0.0 secs.
:runners:google-cloud-dataflow-java:worker:legacy-worker:shadowJar (Thread[Execution worker
for ':' Thread 10,5,main]) started.

> Task :runners:direct-java:shadowJar
Build cache key for task ':runners:direct-java:shadowJar' is dceaba7ea66116cde400c6b27150b630
Caching disabled for task ':runners:direct-java:shadowJar': Caching has not been enabled for
the task
Task ':runners:direct-java:shadowJar' is not up-to-date because:
  No history is available.
Custom actions are attached to task ':runners:direct-java:shadowJar'.
*******************
GRADLE SHADOW STATS

Total Jars: 6 (includes project)
Total Time: 0.632s [632ms]
Average Time/Jar: 0.1053333333333s [105.3333333333ms]
*******************
:runners:direct-java:shadowJar (Thread[Execution worker for ':' Thread 8,5,main]) completed.
Took 0.88 secs.
:sdks:java:io:google-cloud-platform:compileTestJava (Thread[Execution worker for ':' Thread
8,5,main]) started.

> Task :sdks:java:io:google-cloud-platform:compileTestJava FROM-CACHE
Build cache key for task ':sdks:java:io:google-cloud-platform:compileTestJava' is 7e851710cbfebbd8caf52b248ea3a37e
Task ':sdks:java:io:google-cloud-platform:compileTestJava' is not up-to-date because:
  No history is available.
Origin for org.gradle.api.internal.tasks.execution.ExecuteActionsTaskExecuter$TaskExecution@740a6efd:
{executionTime=9631, hostName=apache-beam-jenkins-10, operatingSystem=Linux, buildInvocationId=kusubjxzfjeqpa264jv4o45xsm,
creationTime=1575659909094, identity=:sdks:java:io:google-cloud-platform:compileTestJava,
type=org.gradle.api.internal.tasks.execution.ExecuteActionsTaskExecuter.TaskExecution, userName=jenkins,
gradleVersion=5.2.1, rootPath=/home/jenkins/jenkins-slave/workspace/beam_PostCommit_Java11_ValidatesRunner_Dataflow/src}
Unpacked trees for task ':sdks:java:io:google-cloud-platform:compileTestJava' from cache.
:sdks:java:io:google-cloud-platform:compileTestJava (Thread[Execution worker for ':' Thread
8,5,main]) completed. Took 0.355 secs.
:sdks:java:io:google-cloud-platform:testClasses (Thread[Execution worker for ':' Thread 8,5,main])
started.

> Task :sdks:java:io:google-cloud-platform:testClasses UP-TO-DATE
Skipping task ':sdks:java:io:google-cloud-platform:testClasses' as it has no actions.
:sdks:java:io:google-cloud-platform:testClasses (Thread[Execution worker for ':' Thread 8,5,main])
completed. Took 0.0 secs.
:sdks:java:io:google-cloud-platform:testJar (Thread[Execution worker for ':' Thread 8,5,main])
started.

> Task :sdks:java:io:google-cloud-platform:testJar
Build cache key for task ':sdks:java:io:google-cloud-platform:testJar' is dc10b013b2d3055a4b8af815790253a9
Caching disabled for task ':sdks:java:io:google-cloud-platform:testJar': Caching has not been
enabled for the task
Task ':sdks:java:io:google-cloud-platform:testJar' is not up-to-date because:
  No history is available.
:sdks:java:io:google-cloud-platform:testJar (Thread[Execution worker for ':' Thread 8,5,main])
completed. Took 0.056 secs.
:runners:google-cloud-dataflow-java:compileTestJava (Thread[Execution worker for ':' Thread
8,5,main]) started.
:sdks:java:io:bigquery-io-perf-tests:compileTestJava (Thread[Execution worker for ':' Thread
2,5,main]) started.

> Task :runners:google-cloud-dataflow-java:compileTestJava FROM-CACHE
Build cache key for task ':runners:google-cloud-dataflow-java:compileTestJava' is 548038e8c8dcfc04130ba21c7412ad7b
Task ':runners:google-cloud-dataflow-java:compileTestJava' is not up-to-date because:
  No history is available.
Origin for org.gradle.api.internal.tasks.execution.ExecuteActionsTaskExecuter$TaskExecution@76c612ad:
{executionTime=6216, hostName=apache-beam-jenkins-10, operatingSystem=Linux, buildInvocationId=kusubjxzfjeqpa264jv4o45xsm,
creationTime=1575659915427, identity=:runners:google-cloud-dataflow-java:compileTestJava,
type=org.gradle.api.internal.tasks.execution.ExecuteActionsTaskExecuter.TaskExecution, userName=jenkins,
gradleVersion=5.2.1, rootPath=/home/jenkins/jenkins-slave/workspace/beam_PostCommit_Java11_ValidatesRunner_Dataflow/src}
Unpacked trees for task ':runners:google-cloud-dataflow-java:compileTestJava' from cache.
:runners:google-cloud-dataflow-java:compileTestJava (Thread[Execution worker for ':' Thread
8,5,main]) completed. Took 0.242 secs.
:runners:google-cloud-dataflow-java:testClasses (Thread[Execution worker for ':' Thread 8,5,main])
started.

> Task :runners:google-cloud-dataflow-java:testClasses UP-TO-DATE
Skipping task ':runners:google-cloud-dataflow-java:testClasses' as it has no actions.
:runners:google-cloud-dataflow-java:testClasses (Thread[Execution worker for ':' Thread 8,5,main])
completed. Took 0.0 secs.
:runners:google-cloud-dataflow-java:testJar (Thread[Execution worker for ':' Thread 8,5,main])
started.

> Task :runners:google-cloud-dataflow-java:testJar
Build cache key for task ':runners:google-cloud-dataflow-java:testJar' is 3bd4f1e25615c770a7a5a128bbd65836
Caching disabled for task ':runners:google-cloud-dataflow-java:testJar': Caching has not been
enabled for the task
Task ':runners:google-cloud-dataflow-java:testJar' is not up-to-date because:
  No history is available.
:runners:google-cloud-dataflow-java:testJar (Thread[Execution worker for ':' Thread 8,5,main])
completed. Took 0.027 secs.

> Task :runners:google-cloud-dataflow-java:worker:legacy-worker:shadowJar
Build cache key for task ':runners:google-cloud-dataflow-java:worker:legacy-worker:shadowJar'
is 8afd6da254fbee9c2c1318ce7ed3c589
Caching disabled for task ':runners:google-cloud-dataflow-java:worker:legacy-worker:shadowJar':
Caching has not been enabled for the task
Task ':runners:google-cloud-dataflow-java:worker:legacy-worker:shadowJar' is not up-to-date
because:
  No history is available.
Custom actions are attached to task ':runners:google-cloud-dataflow-java:worker:legacy-worker:shadowJar'.
*******************
GRADLE SHADOW STATS

Total Jars: 16 (includes project)
Total Time: 4.121s [4121ms]
Average Time/Jar: 0.2575625s [257.5625ms]
*******************
:runners:google-cloud-dataflow-java:worker:legacy-worker:shadowJar (Thread[Execution worker
for ':' Thread 10,5,main]) completed. Took 5.026 secs.

> Task :sdks:java:io:bigquery-io-perf-tests:compileTestJava
Build cache key for task ':sdks:java:io:bigquery-io-perf-tests:compileTestJava' is 6eed03d2b06716692ac7b55fa7b88ee4
Task ':sdks:java:io:bigquery-io-perf-tests:compileTestJava' is not up-to-date because:
  No history is available.
All input files are considered out-of-date for incremental task ':sdks:java:io:bigquery-io-perf-tests:compileTestJava'.
Full recompilation is required because no incremental change information is available. This
is usually caused by clean builds or changing compiler arguments.
Compiling with error-prone compiler
Created classpath snapshot for incremental compilation in 1.823 secs. 1478 duplicate classes
found in classpath (see all with --debug).
Packing task ':sdks:java:io:bigquery-io-perf-tests:compileTestJava'
:sdks:java:io:bigquery-io-perf-tests:compileTestJava (Thread[Execution worker for ':' Thread
2,5,main]) completed. Took 7.336 secs.
:sdks:java:io:bigquery-io-perf-tests:testClasses (Thread[Execution worker for ':' Thread 2,5,main])
started.

> Task :sdks:java:io:bigquery-io-perf-tests:testClasses
Skipping task ':sdks:java:io:bigquery-io-perf-tests:testClasses' as it has no actions.
:sdks:java:io:bigquery-io-perf-tests:testClasses (Thread[Execution worker for ':' Thread 2,5,main])
completed. Took 0.0 secs.
:sdks:java:io:bigquery-io-perf-tests:integrationTest (Thread[Execution worker for ':' Thread
2,5,main]) started.
Gradle Test Executor 1 started executing tests.

> Task :sdks:java:io:bigquery-io-perf-tests:integrationTest
Build cache key for task ':sdks:java:io:bigquery-io-perf-tests:integrationTest' is ce82e3faa86eef5af06956c56916f53d
Task ':sdks:java:io:bigquery-io-perf-tests:integrationTest' is not up-to-date because:
  Task.upToDateWhen is false.
Custom actions are attached to task ':sdks:java:io:bigquery-io-perf-tests:integrationTest'.
Starting process 'Gradle Test Executor 1'. Working directory: <https://builds.apache.org/job/beam_BiqQueryIO_Streaming_Performance_Test_Java/ws/src/sdks/java/io/bigquery-io-perf-tests>
Command: /usr/lib/jvm/java-8-openjdk-amd64/bin/java -DbeamTestPipelineOptions=["--project=apache-beam-testing","--tempLocation=gs://temp-storage-for-perf-tests/loadtests","--tempRoot=gs://temp-storage-for-perf-tests/loadtests","--writeMethod=STREAMING_INSERTS","--testBigQueryDataset=beam_performance","--testBigQueryTable=bqio_write_10GB_java","--metricsBigQueryDataset=beam_performance","--metricsBigQueryTable=bqio_10GB_results_java_stream","--sourceOptions={\"numRecords\":\"10485760\",\"keySizeBytes\":\"1\",\"valueSizeBytes\":\"1024\"}","--runner=DataflowRunner","--maxNumWorkers=5","--numWorkers=5","--autoscalingAlgorithm=NONE","--workerHarnessContainerImage=","--dataflowWorkerJar=${dataflowWorkerJar}"]
-Djava.security.manager=worker.org.gradle.process.internal.worker.child.BootstrapSecurityManager
-Dorg.gradle.native=false -Xmx2g -Dfile.encoding=UTF-8 -Duser.country=US -Duser.language=en
-Duser.variant -ea -cp /home/jenkins/.gradle/caches/5.2.1/workerMain/gradle-worker.jar worker.org.gradle.process.internal.worker.GradleWorkerMain
'Gradle Test Executor 1'
Successfully started process 'Gradle Test Executor 1'

org.apache.beam.sdk.bigqueryioperftests.BigQueryIOIT STANDARD_ERROR
    SLF4J: Class path contains multiple SLF4J bindings.
    SLF4J: Found binding in [jar:<https://builds.apache.org/job/beam_BiqQueryIO_Streaming_Performance_Test_Java/ws/src/runners/google-cloud-dataflow-java/worker/legacy-worker/build/libs/beam-runners-google-cloud-dataflow-java-legacy-worker-2.19.0-SNAPSHOT.jar!/org/slf4j/impl/StaticLoggerBinder.class]>
    SLF4J: Found binding in [jar:file:/home/jenkins/.gradle/caches/modules-2/files-2.1/org.slf4j/slf4j-jdk14/1.7.25/bccda40ebc8067491b32a88f49615a747d20082d/slf4j-jdk14-1.7.25.jar!/org/slf4j/impl/StaticLoggerBinder.class]
    SLF4J: See http://www.slf4j.org/codes.html#multiple_bindings for an explanation.
    SLF4J: Actual binding is of type [org.slf4j.impl.JDK14LoggerFactory]

Gradle Test Executor 1 finished executing tests.

> Task :sdks:java:io:bigquery-io-perf-tests:integrationTest FAILED

org.apache.beam.sdk.bigqueryioperftests.BigQueryIOIT > classMethod FAILED
    java.lang.NullPointerException: Name is null
        at java.lang.Enum.valueOf(Enum.java:236)
        at org.apache.beam.sdk.bigqueryioperftests.BigQueryIOIT$WriteFormat.valueOf(BigQueryIOIT.java:261)
        at org.apache.beam.sdk.bigqueryioperftests.BigQueryIOIT.setup(BigQueryIOIT.java:106)

1 test completed, 1 failed
Finished generating test XML results (0.015 secs) into: <https://builds.apache.org/job/beam_BiqQueryIO_Streaming_Performance_Test_Java/ws/src/sdks/java/io/bigquery-io-perf-tests/build/test-results/integrationTest>
Generating HTML test report...
Finished generating test html results (0.026 secs) into: <https://builds.apache.org/job/beam_BiqQueryIO_Streaming_Performance_Test_Java/ws/src/sdks/java/io/bigquery-io-perf-tests/build/reports/tests/integrationTest>
:sdks:java:io:bigquery-io-perf-tests:integrationTest (Thread[Execution worker for ':' Thread
2,5,main]) completed. Took 4.088 secs.

FAILURE: Build failed with an exception.

* What went wrong:
Execution failed for task ':sdks:java:io:bigquery-io-perf-tests:integrationTest'.
> There were failing tests. See the report at: file://<https://builds.apache.org/job/beam_BiqQueryIO_Streaming_Performance_Test_Java/ws/src/sdks/java/io/bigquery-io-perf-tests/build/reports/tests/integrationTest/index.html>

* Try:
Run with --stacktrace option to get the stack trace. Run with --debug option to get more log
output. Run with --scan to get full insights.

* Get more help at https://help.gradle.org

Deprecated Gradle features were used in this build, making it incompatible with Gradle 6.0.
Use '--warning-mode all' to show the individual deprecation warnings.
See https://docs.gradle.org/5.2.1/userguide/command_line_interface.html#sec:command_line_warnings

BUILD FAILED in 53s
80 actionable tasks: 53 executed, 27 from cache

Publishing build scan...
https://scans.gradle.com/s/gns733i76spsq

Build step 'Invoke Gradle script' changed build result to FAILURE
Build step 'Invoke Gradle script' marked build as failure

---------------------------------------------------------------------
To unsubscribe, e-mail: builds-unsubscribe@beam.apache.org
For additional commands, e-mail: builds-help@beam.apache.org


Mime
View raw message