beam-builds mailing list archives

Site index · List index
Message view « Date » · « Thread »
Top « Date » · « Thread »
From Apache Jenkins Server <jenk...@builds.apache.org>
Subject Build failed in Jenkins: beam_PostCommit_Python2 #1089
Date Wed, 27 Nov 2019 18:17:46 GMT
See <https://builds.apache.org/job/beam_PostCommit_Python2/1089/display/redirect>

Changes:


------------------------------------------
[...truncated 733.72 KB...]
test_1      | DEBUG	Starting new HTTP connection (1): datanode:50075
datanode_1  | 19/11/27 18:15:53 INFO datanode.webhdfs: 192.168.160.4 PUT /webhdfs/v1/kinglear.txt?op=CREATE&user.name=root&namenoderpcaddress=namenode:8020&createflag=&createparent=true&overwrite=true&user.name=root
201
namenode_1  | 19/11/27 18:15:53 INFO hdfs.StateChange: BLOCK* allocate blk_1073741825_1001,
replicas=192.168.160.3:50010 for /kinglear.txt
datanode_1  | 19/11/27 18:15:53 INFO datanode.DataNode: Receiving BP-78798608-192.168.160.2-1574878503515:blk_1073741825_1001
src: /192.168.160.3:40382 dest: /192.168.160.3:50010
datanode_1  | 19/11/27 18:15:53 INFO DataNode.clienttrace: src: /192.168.160.3:40382, dest:
/192.168.160.3:50010, bytes: 157283, op: HDFS_WRITE, cliID: DFSClient_NONMAPREDUCE_-328139826_67,
offset: 0, srvID: 74704b06-2cb0-4c37-8984-8dd3d83b905b, blockid: BP-78798608-192.168.160.2-1574878503515:blk_1073741825_1001,
duration: 16274153
datanode_1  | 19/11/27 18:15:53 INFO datanode.DataNode: PacketResponder: BP-78798608-192.168.160.2-1574878503515:blk_1073741825_1001,
type=LAST_IN_PIPELINE terminating
namenode_1  | 19/11/27 18:15:53 INFO namenode.FSNamesystem: BLOCK* blk_1073741825_1001 is
COMMITTED but not COMPLETE(numNodes= 0 <  minimum = 1) in file /kinglear.txt
namenode_1  | 19/11/27 18:15:53 INFO namenode.EditLogFileOutputStream: Nothing to flush
namenode_1  | 19/11/27 18:15:53 INFO hdfs.StateChange: DIR* completeFile: /kinglear.txt is
closed by DFSClient_NONMAPREDUCE_-328139826_67
test_1      | DEBUG	Upload of 'kinglear.txt' to '/kinglear.txt' complete.
test_1      | /usr/local/lib/python2.7/site-packages/apache_beam/__init__.py:84: UserWarning:
You are using Apache Beam with Python 2. New releases of Apache Beam will soon support Python
3 only.
test_1      |   'You are using Apache Beam with Python 2. '
test_1      | INFO:root:Missing pipeline option (runner). Executing pipeline using the default
runner: DirectRunner.
test_1      | INFO:apache_beam.runners.portability.fn_api_runner_transforms:====================
<function annotate_downstream_side_inputs at 0x7f3782915550> ====================
test_1      | INFO:apache_beam.runners.portability.fn_api_runner_transforms:====================
<function fix_side_input_pcoll_coders at 0x7f3782915650> ====================
test_1      | INFO:apache_beam.runners.portability.fn_api_runner_transforms:====================
<function lift_combiners at 0x7f37829156d0> ====================
test_1      | INFO:apache_beam.runners.portability.fn_api_runner_transforms:====================
<function expand_sdf at 0x7f3782915750> ====================
test_1      | INFO:apache_beam.runners.portability.fn_api_runner_transforms:====================
<function expand_gbk at 0x7f37829157d0> ====================
test_1      | INFO:apache_beam.runners.portability.fn_api_runner_transforms:====================
<function sink_flattens at 0x7f37829158d0> ====================
test_1      | INFO:apache_beam.runners.portability.fn_api_runner_transforms:====================
<function greedily_fuse at 0x7f3782915950> ====================
test_1      | INFO:apache_beam.runners.portability.fn_api_runner_transforms:====================
<function read_to_impulse at 0x7f37829159d0> ====================
test_1      | INFO:apache_beam.runners.portability.fn_api_runner_transforms:====================
<function impulse_to_input at 0x7f3782915a50> ====================
test_1      | INFO:apache_beam.runners.portability.fn_api_runner_transforms:====================
<function inject_timer_pcollections at 0x7f3782915bd0> ====================
test_1      | INFO:apache_beam.runners.portability.fn_api_runner_transforms:====================
<function sort_stages at 0x7f3782915c50> ====================
test_1      | INFO:apache_beam.runners.portability.fn_api_runner_transforms:====================
<function window_pcollection_coders at 0x7f3782915cd0> ====================
test_1      | INFO:apache_beam.runners.worker.statecache:Creating state cache with size 100
test_1      | INFO:apache_beam.runners.portability.fn_api_runner:Created Worker handler <apache_beam.runners.portability.fn_api_runner.EmbeddedWorkerHandler
object at 0x7f3782842590> for environment urn: "beam:env:embedded_python:v1"
test_1      | 
test_1      | INFO:apache_beam.runners.portability.fn_api_runner:Running (((ref_AppliedPTransform_write/Write/WriteImpl/DoOnce/Read_16)+(ref_AppliedPTransform_write/Write/WriteImpl/InitializeWrite_17))+(ref_PCollection_PCollection_9/Write))+(ref_PCollection_PCollection_10/Write)
test_1      | INFO:apache_beam.runners.portability.fn_api_runner:Running (ref_AppliedPTransform_read/Read_3)+((ref_AppliedPTransform_split_4)+((ref_AppliedPTransform_pair_with_one_5)+(group/Write)))
datanode_1  | 19/11/27 18:15:56 INFO datanode.webhdfs: 192.168.160.4 GET /webhdfs/v1/kinglear.txt?op=OPEN&user.name=root&namenoderpcaddress=namenode:8020&length=157284&offset=0
200
test_1      | INFO:apache_beam.runners.portability.fn_api_runner:Running (((group/Read)+((ref_AppliedPTransform_count_10)+(ref_AppliedPTransform_format_11)))+(ref_AppliedPTransform_write/Write/WriteImpl/WriteBundles_18))+((ref_AppliedPTransform_write/Write/WriteImpl/Pair_19)+((ref_AppliedPTransform_write/Write/WriteImpl/WindowInto(WindowIntoFn)_20)+(write/Write/WriteImpl/GroupByKey/Write)))
test_1      | WARNING:apache_beam.io.hadoopfilesystem:Mime types are not supported. Got non-default
mime_type: text/plain
datanode_1  | 19/11/27 18:15:59 INFO datanode.webhdfs: 192.168.160.4 PUT /webhdfs/v1/beam-temp-py-wordcount-integration-f4915536114111eaa04b0242c0a8a004/941336de-2270-4724-821a-1ecaf0cd1c1c.py-wordcount-integration?op=CREATE&user.name=root&namenoderpcaddress=namenode:8020&createflag=&createparent=true&overwrite=false&user.name=root
201
namenode_1  | 19/11/27 18:15:59 INFO hdfs.StateChange: BLOCK* allocate blk_1073741826_1002,
replicas=192.168.160.3:50010 for /beam-temp-py-wordcount-integration-f4915536114111eaa04b0242c0a8a004/941336de-2270-4724-821a-1ecaf0cd1c1c.py-wordcount-integration
datanode_1  | 19/11/27 18:15:59 INFO datanode.DataNode: Receiving BP-78798608-192.168.160.2-1574878503515:blk_1073741826_1002
src: /192.168.160.3:40408 dest: /192.168.160.3:50010
datanode_1  | 19/11/27 18:15:59 INFO DataNode.clienttrace: src: /192.168.160.3:40408, dest:
/192.168.160.3:50010, bytes: 48944, op: HDFS_WRITE, cliID: DFSClient_NONMAPREDUCE_-1845469451_69,
offset: 0, srvID: 74704b06-2cb0-4c37-8984-8dd3d83b905b, blockid: BP-78798608-192.168.160.2-1574878503515:blk_1073741826_1002,
duration: 3981435
datanode_1  | 19/11/27 18:15:59 INFO datanode.DataNode: PacketResponder: BP-78798608-192.168.160.2-1574878503515:blk_1073741826_1002,
type=LAST_IN_PIPELINE terminating
namenode_1  | 19/11/27 18:15:59 INFO hdfs.StateChange: DIR* completeFile: /beam-temp-py-wordcount-integration-f4915536114111eaa04b0242c0a8a004/941336de-2270-4724-821a-1ecaf0cd1c1c.py-wordcount-integration
is closed by DFSClient_NONMAPREDUCE_-1845469451_69
test_1      | INFO:apache_beam.runners.portability.fn_api_runner:Running (write/Write/WriteImpl/GroupByKey/Read)+((ref_AppliedPTransform_write/Write/WriteImpl/Extract_25)+(ref_PCollection_PCollection_17/Write))
test_1      | INFO:apache_beam.runners.portability.fn_api_runner:Running ((ref_PCollection_PCollection_9/Read)+(ref_AppliedPTransform_write/Write/WriteImpl/PreFinalize_26))+(ref_PCollection_PCollection_18/Write)
test_1      | INFO:apache_beam.runners.portability.fn_api_runner:Running (ref_PCollection_PCollection_9/Read)+(ref_AppliedPTransform_write/Write/WriteImpl/FinalizeWrite_27)
test_1      | INFO:apache_beam.io.filebasedsink:Starting finalize_write threads with num_shards:
1 (skipped: 0), batches: 1, num_threads: 1
test_1      | INFO:apache_beam.io.filebasedsink:Renamed 1 shards in 0.14 seconds.
test_1      | INFO:root:number of empty lines: 1663
test_1      | INFO:root:average word length: 4
hdfs_it-jenkins-beam_postcommit_python2-1089_test_1 exited with code 0
Stopping hdfs_it-jenkins-beam_postcommit_python2-1089_datanode_1 ... 
Stopping hdfs_it-jenkins-beam_postcommit_python2-1089_namenode_1 ... 
Stopping hdfs_it-jenkins-beam_postcommit_python2-1089_datanode_1 ... done
Stopping hdfs_it-jenkins-beam_postcommit_python2-1089_namenode_1 ... done
Aborting on container exit...

real	1m36.231s
user	0m1.147s
sys	0m0.183s
+ finally
+ docker-compose -p hdfs_IT-jenkins-beam_PostCommit_Python2-1089 --no-ansi down
Removing hdfs_it-jenkins-beam_postcommit_python2-1089_test_1     ... 
Removing hdfs_it-jenkins-beam_postcommit_python2-1089_datanode_1 ... 
Removing hdfs_it-jenkins-beam_postcommit_python2-1089_namenode_1 ... 
Removing hdfs_it-jenkins-beam_postcommit_python2-1089_datanode_1 ... done
Removing hdfs_it-jenkins-beam_postcommit_python2-1089_namenode_1 ... done
Removing hdfs_it-jenkins-beam_postcommit_python2-1089_test_1     ... done
Removing network hdfs_it-jenkins-beam_postcommit_python2-1089_test_net

real	0m0.800s
user	0m0.593s
sys	0m0.114s

> Task :sdks:python:test-suites:direct:py2:mongodbioIT
Using default tag: latest
latest: Pulling from library/mongo
Digest: sha256:1a9478d8188d6be31dd2e8de076d402edf20446e54933aad7ff49f5b457d486c
Status: Image is up to date for mongo:latest
3dc052ba6b182d8e3d830035f71729618682fa7227198feeb36971180b4675e7
DEPRECATION: Python 2.7 will reach the end of its life on January 1st, 2020. Please upgrade
your Python as Python 2.7 won't be maintained after that date. A future version of pip will
drop support for Python 2.7. More details about Python 2 support in pip, can be found at https://pip.pypa.io/en/latest/development/release-process/#python-2-support
Obtaining file://<https://builds.apache.org/job/beam_PostCommit_Python2/ws/src/sdks/python>
Requirement already satisfied: crcmod<2.0,>=1.7 in <https://builds.apache.org/job/beam_PostCommit_Python2/ws/src/build/gradleenv/45127155/lib/python2.7/site-packages>
(from apache-beam==2.18.0.dev0) (1.7)
Requirement already satisfied: dill<0.3.2,>=0.3.1.1 in <https://builds.apache.org/job/beam_PostCommit_Python2/ws/src/build/gradleenv/45127155/lib/python2.7/site-packages>
(from apache-beam==2.18.0.dev0) (0.3.1.1)
Requirement already satisfied: fastavro<0.22,>=0.21.4 in <https://builds.apache.org/job/beam_PostCommit_Python2/ws/src/build/gradleenv/45127155/lib/python2.7/site-packages>
(from apache-beam==2.18.0.dev0) (0.21.24)
Requirement already satisfied: future<1.0.0,>=0.16.0 in <https://builds.apache.org/job/beam_PostCommit_Python2/ws/src/build/gradleenv/45127155/lib/python2.7/site-packages>
(from apache-beam==2.18.0.dev0) (0.16.0)
Requirement already satisfied: grpcio<2,>=1.12.1 in <https://builds.apache.org/job/beam_PostCommit_Python2/ws/src/build/gradleenv/45127155/lib/python2.7/site-packages>
(from apache-beam==2.18.0.dev0) (1.25.0)
Requirement already satisfied: hdfs<3.0.0,>=2.1.0 in <https://builds.apache.org/job/beam_PostCommit_Python2/ws/src/build/gradleenv/45127155/lib/python2.7/site-packages>
(from apache-beam==2.18.0.dev0) (2.5.8)
Requirement already satisfied: httplib2<=0.12.0,>=0.8 in <https://builds.apache.org/job/beam_PostCommit_Python2/ws/src/build/gradleenv/45127155/lib/python2.7/site-packages>
(from apache-beam==2.18.0.dev0) (0.12.0)
Requirement already satisfied: mock<3.0.0,>=1.0.1 in <https://builds.apache.org/job/beam_PostCommit_Python2/ws/src/build/gradleenv/45127155/lib/python2.7/site-packages>
(from apache-beam==2.18.0.dev0) (2.0.0)
Requirement already satisfied: numpy<2,>=1.14.3 in <https://builds.apache.org/job/beam_PostCommit_Python2/ws/src/build/gradleenv/45127155/lib/python2.7/site-packages>
(from apache-beam==2.18.0.dev0) (1.16.5)
Requirement already satisfied: pymongo<4.0.0,>=3.8.0 in <https://builds.apache.org/job/beam_PostCommit_Python2/ws/src/build/gradleenv/45127155/lib/python2.7/site-packages>
(from apache-beam==2.18.0.dev0) (3.9.0)
Requirement already satisfied: oauth2client<4,>=2.0.1 in <https://builds.apache.org/job/beam_PostCommit_Python2/ws/src/build/gradleenv/45127155/lib/python2.7/site-packages>
(from apache-beam==2.18.0.dev0) (3.0.0)
Requirement already satisfied: protobuf<4,>=3.5.0.post1 in <https://builds.apache.org/job/beam_PostCommit_Python2/ws/src/build/gradleenv/45127155/lib/python2.7/site-packages>
(from apache-beam==2.18.0.dev0) (3.11.0)
Requirement already satisfied: pydot<2,>=1.2.0 in <https://builds.apache.org/job/beam_PostCommit_Python2/ws/src/build/gradleenv/45127155/lib/python2.7/site-packages>
(from apache-beam==2.18.0.dev0) (1.4.1)
Requirement already satisfied: python-dateutil<3,>=2.8.0 in <https://builds.apache.org/job/beam_PostCommit_Python2/ws/src/build/gradleenv/45127155/lib/python2.7/site-packages>
(from apache-beam==2.18.0.dev0) (2.8.1)
Requirement already satisfied: pytz>=2018.3 in <https://builds.apache.org/job/beam_PostCommit_Python2/ws/src/build/gradleenv/45127155/lib/python2.7/site-packages>
(from apache-beam==2.18.0.dev0) (2019.3)
Requirement already satisfied: avro<2.0.0,>=1.8.1 in <https://builds.apache.org/job/beam_PostCommit_Python2/ws/src/build/gradleenv/45127155/lib/python2.7/site-packages>
(from apache-beam==2.18.0.dev0) (1.9.1)
Requirement already satisfied: funcsigs<2,>=1.0.2 in <https://builds.apache.org/job/beam_PostCommit_Python2/ws/src/build/gradleenv/45127155/lib/python2.7/site-packages>
(from apache-beam==2.18.0.dev0) (1.0.2)
Requirement already satisfied: futures<4.0.0,>=3.2.0 in <https://builds.apache.org/job/beam_PostCommit_Python2/ws/src/build/gradleenv/45127155/lib/python2.7/site-packages>
(from apache-beam==2.18.0.dev0) (3.3.0)
Requirement already satisfied: pyvcf<0.7.0,>=0.6.8 in <https://builds.apache.org/job/beam_PostCommit_Python2/ws/src/build/gradleenv/45127155/lib/python2.7/site-packages>
(from apache-beam==2.18.0.dev0) (0.6.8)
Requirement already satisfied: typing<3.7.0,>=3.6.0 in <https://builds.apache.org/job/beam_PostCommit_Python2/ws/src/build/gradleenv/45127155/lib/python2.7/site-packages>
(from apache-beam==2.18.0.dev0) (3.6.6)
Requirement already satisfied: pyarrow<0.16.0,>=0.15.1 in <https://builds.apache.org/job/beam_PostCommit_Python2/ws/src/build/gradleenv/45127155/lib/python2.7/site-packages>
(from apache-beam==2.18.0.dev0) (0.15.1)
Requirement already satisfied: nose>=1.3.7 in <https://builds.apache.org/job/beam_PostCommit_Python2/ws/src/build/gradleenv/45127155/lib/python2.7/site-packages>
(from apache-beam==2.18.0.dev0) (1.3.7)
Requirement already satisfied: nose_xunitmp>=0.4.1 in <https://builds.apache.org/job/beam_PostCommit_Python2/ws/src/build/gradleenv/45127155/lib/python2.7/site-packages>
(from apache-beam==2.18.0.dev0) (0.4.1)
Requirement already satisfied: pandas<0.25,>=0.23.4 in <https://builds.apache.org/job/beam_PostCommit_Python2/ws/src/build/gradleenv/45127155/lib/python2.7/site-packages>
(from apache-beam==2.18.0.dev0) (0.24.2)
Requirement already satisfied: parameterized<0.7.0,>=0.6.0 in <https://builds.apache.org/job/beam_PostCommit_Python2/ws/src/build/gradleenv/45127155/lib/python2.7/site-packages>
(from apache-beam==2.18.0.dev0) (0.6.3)
Requirement already satisfied: pyhamcrest<2.0,>=1.9 in <https://builds.apache.org/job/beam_PostCommit_Python2/ws/src/build/gradleenv/45127155/lib/python2.7/site-packages>
(from apache-beam==2.18.0.dev0) (1.9.0)
Requirement already satisfied: pyyaml<6.0.0,>=3.12 in <https://builds.apache.org/job/beam_PostCommit_Python2/ws/src/build/gradleenv/45127155/lib/python2.7/site-packages>
(from apache-beam==2.18.0.dev0) (5.1.2)
Requirement already satisfied: requests_mock<2.0,>=1.7 in <https://builds.apache.org/job/beam_PostCommit_Python2/ws/src/build/gradleenv/45127155/lib/python2.7/site-packages>
(from apache-beam==2.18.0.dev0) (1.7.0)
Requirement already satisfied: tenacity<6.0,>=5.0.2 in <https://builds.apache.org/job/beam_PostCommit_Python2/ws/src/build/gradleenv/45127155/lib/python2.7/site-packages>
(from apache-beam==2.18.0.dev0) (5.1.5)
Requirement already satisfied: pytest<5.0,>=4.4.0 in <https://builds.apache.org/job/beam_PostCommit_Python2/ws/src/build/gradleenv/45127155/lib/python2.7/site-packages>
(from apache-beam==2.18.0.dev0) (4.6.6)
Requirement already satisfied: pytest-xdist<2,>=1.29.0 in <https://builds.apache.org/job/beam_PostCommit_Python2/ws/src/build/gradleenv/45127155/lib/python2.7/site-packages>
(from apache-beam==2.18.0.dev0) (1.30.0)
Requirement already satisfied: six>=1.5.2 in <https://builds.apache.org/job/beam_PostCommit_Python2/ws/src/build/gradleenv/45127155/lib/python2.7/site-packages>
(from grpcio<2,>=1.12.1->apache-beam==2.18.0.dev0) (1.13.0)
Requirement already satisfied: enum34>=1.0.4; python_version < "3.4" in <https://builds.apache.org/job/beam_PostCommit_Python2/ws/src/build/gradleenv/45127155/lib/python2.7/site-packages>
(from grpcio<2,>=1.12.1->apache-beam==2.18.0.dev0) (1.1.6)
Requirement already satisfied: docopt in <https://builds.apache.org/job/beam_PostCommit_Python2/ws/src/build/gradleenv/45127155/lib/python2.7/site-packages>
(from hdfs<3.0.0,>=2.1.0->apache-beam==2.18.0.dev0) (0.6.2)
Requirement already satisfied: requests>=2.7.0 in <https://builds.apache.org/job/beam_PostCommit_Python2/ws/src/build/gradleenv/45127155/lib/python2.7/site-packages>
(from hdfs<3.0.0,>=2.1.0->apache-beam==2.18.0.dev0) (2.22.0)
Requirement already satisfied: pbr>=0.11 in <https://builds.apache.org/job/beam_PostCommit_Python2/ws/src/build/gradleenv/45127155/lib/python2.7/site-packages>
(from mock<3.0.0,>=1.0.1->apache-beam==2.18.0.dev0) (5.4.4)
Requirement already satisfied: pyasn1>=0.1.7 in <https://builds.apache.org/job/beam_PostCommit_Python2/ws/src/build/gradleenv/45127155/lib/python2.7/site-packages>
(from oauth2client<4,>=2.0.1->apache-beam==2.18.0.dev0) (0.4.8)
Requirement already satisfied: pyasn1-modules>=0.0.5 in <https://builds.apache.org/job/beam_PostCommit_Python2/ws/src/build/gradleenv/45127155/lib/python2.7/site-packages>
(from oauth2client<4,>=2.0.1->apache-beam==2.18.0.dev0) (0.2.7)
Requirement already satisfied: rsa>=3.1.4 in <https://builds.apache.org/job/beam_PostCommit_Python2/ws/src/build/gradleenv/45127155/lib/python2.7/site-packages>
(from oauth2client<4,>=2.0.1->apache-beam==2.18.0.dev0) (4.0)
Requirement already satisfied: setuptools in <https://builds.apache.org/job/beam_PostCommit_Python2/ws/src/build/gradleenv/45127155/lib/python2.7/site-packages>
(from protobuf<4,>=3.5.0.post1->apache-beam==2.18.0.dev0) (42.0.1)
Requirement already satisfied: pyparsing>=2.1.4 in <https://builds.apache.org/job/beam_PostCommit_Python2/ws/src/build/gradleenv/45127155/lib/python2.7/site-packages>
(from pydot<2,>=1.2.0->apache-beam==2.18.0.dev0) (2.4.5)
Requirement already satisfied: monotonic>=0.6; python_version == "2.7" in <https://builds.apache.org/job/beam_PostCommit_Python2/ws/src/build/gradleenv/45127155/lib/python2.7/site-packages>
(from tenacity<6.0,>=5.0.2->apache-beam==2.18.0.dev0) (1.5)
Requirement already satisfied: atomicwrites>=1.0 in <https://builds.apache.org/job/beam_PostCommit_Python2/ws/src/build/gradleenv/45127155/lib/python2.7/site-packages>
(from pytest<5.0,>=4.4.0->apache-beam==2.18.0.dev0) (1.3.0)
Requirement already satisfied: packaging in <https://builds.apache.org/job/beam_PostCommit_Python2/ws/src/build/gradleenv/45127155/lib/python2.7/site-packages>
(from pytest<5.0,>=4.4.0->apache-beam==2.18.0.dev0) (19.2)
Requirement already satisfied: wcwidth in <https://builds.apache.org/job/beam_PostCommit_Python2/ws/src/build/gradleenv/45127155/lib/python2.7/site-packages>
(from pytest<5.0,>=4.4.0->apache-beam==2.18.0.dev0) (0.1.7)
Requirement already satisfied: importlib-metadata>=0.12; python_version < "3.8" in <https://builds.apache.org/job/beam_PostCommit_Python2/ws/src/build/gradleenv/45127155/lib/python2.7/site-packages>
(from pytest<5.0,>=4.4.0->apache-beam==2.18.0.dev0) (0.23)
Requirement already satisfied: py>=1.5.0 in <https://builds.apache.org/job/beam_PostCommit_Python2/ws/src/build/gradleenv/45127155/lib/python2.7/site-packages>
(from pytest<5.0,>=4.4.0->apache-beam==2.18.0.dev0) (1.8.0)
Requirement already satisfied: pathlib2>=2.2.0; python_version < "3.6" in <https://builds.apache.org/job/beam_PostCommit_Python2/ws/src/build/gradleenv/45127155/lib/python2.7/site-packages>
(from pytest<5.0,>=4.4.0->apache-beam==2.18.0.dev0) (2.3.5)
Requirement already satisfied: pluggy<1.0,>=0.12 in <https://builds.apache.org/job/beam_PostCommit_Python2/ws/src/build/gradleenv/45127155/lib/python2.7/site-packages>
(from pytest<5.0,>=4.4.0->apache-beam==2.18.0.dev0) (0.13.1)
Requirement already satisfied: attrs>=17.4.0 in <https://builds.apache.org/job/beam_PostCommit_Python2/ws/src/build/gradleenv/45127155/lib/python2.7/site-packages>
(from pytest<5.0,>=4.4.0->apache-beam==2.18.0.dev0) (19.3.0)
Requirement already satisfied: more-itertools<6.0.0,>=4.0.0; python_version <= "2.7"
in <https://builds.apache.org/job/beam_PostCommit_Python2/ws/src/build/gradleenv/45127155/lib/python2.7/site-packages>
(from pytest<5.0,>=4.4.0->apache-beam==2.18.0.dev0) (5.0.0)
Requirement already satisfied: pytest-forked in <https://builds.apache.org/job/beam_PostCommit_Python2/ws/src/build/gradleenv/45127155/lib/python2.7/site-packages>
(from pytest-xdist<2,>=1.29.0->apache-beam==2.18.0.dev0) (1.1.3)
Requirement already satisfied: execnet>=1.1 in <https://builds.apache.org/job/beam_PostCommit_Python2/ws/src/build/gradleenv/45127155/lib/python2.7/site-packages>
(from pytest-xdist<2,>=1.29.0->apache-beam==2.18.0.dev0) (1.7.1)
Requirement already satisfied: urllib3!=1.25.0,!=1.25.1,<1.26,>=1.21.1 in <https://builds.apache.org/job/beam_PostCommit_Python2/ws/src/build/gradleenv/45127155/lib/python2.7/site-packages>
(from requests>=2.7.0->hdfs<3.0.0,>=2.1.0->apache-beam==2.18.0.dev0) (1.25.7)
Requirement already satisfied: certifi>=2017.4.17 in <https://builds.apache.org/job/beam_PostCommit_Python2/ws/src/build/gradleenv/45127155/lib/python2.7/site-packages>
(from requests>=2.7.0->hdfs<3.0.0,>=2.1.0->apache-beam==2.18.0.dev0) (2019.9.11)
Requirement already satisfied: chardet<3.1.0,>=3.0.2 in <https://builds.apache.org/job/beam_PostCommit_Python2/ws/src/build/gradleenv/45127155/lib/python2.7/site-packages>
(from requests>=2.7.0->hdfs<3.0.0,>=2.1.0->apache-beam==2.18.0.dev0) (3.0.4)
Requirement already satisfied: idna<2.9,>=2.5 in <https://builds.apache.org/job/beam_PostCommit_Python2/ws/src/build/gradleenv/45127155/lib/python2.7/site-packages>
(from requests>=2.7.0->hdfs<3.0.0,>=2.1.0->apache-beam==2.18.0.dev0) (2.8)
Requirement already satisfied: contextlib2; python_version < "3" in <https://builds.apache.org/job/beam_PostCommit_Python2/ws/src/build/gradleenv/45127155/lib/python2.7/site-packages>
(from importlib-metadata>=0.12; python_version < "3.8"->pytest<5.0,>=4.4.0->apache-beam==2.18.0.dev0)
(0.6.0.post1)
Requirement already satisfied: zipp>=0.5 in <https://builds.apache.org/job/beam_PostCommit_Python2/ws/src/build/gradleenv/45127155/lib/python2.7/site-packages>
(from importlib-metadata>=0.12; python_version < "3.8"->pytest<5.0,>=4.4.0->apache-beam==2.18.0.dev0)
(0.6.0)
Requirement already satisfied: configparser>=3.5; python_version < "3" in <https://builds.apache.org/job/beam_PostCommit_Python2/ws/src/build/gradleenv/45127155/lib/python2.7/site-packages>
(from importlib-metadata>=0.12; python_version < "3.8"->pytest<5.0,>=4.4.0->apache-beam==2.18.0.dev0)
(4.0.2)
Requirement already satisfied: scandir; python_version < "3.5" in <https://builds.apache.org/job/beam_PostCommit_Python2/ws/src/build/gradleenv/45127155/lib/python2.7/site-packages>
(from pathlib2>=2.2.0; python_version < "3.6"->pytest<5.0,>=4.4.0->apache-beam==2.18.0.dev0)
(1.10.0)
Requirement already satisfied: apipkg>=1.4 in <https://builds.apache.org/job/beam_PostCommit_Python2/ws/src/build/gradleenv/45127155/lib/python2.7/site-packages>
(from execnet>=1.1->pytest-xdist<2,>=1.29.0->apache-beam==2.18.0.dev0) (1.5)
Installing collected packages: apache-beam
  Found existing installation: apache-beam 2.18.0.dev0
    Not uninstalling apache-beam at <https://builds.apache.org/job/beam_PostCommit_Python2/ws/src/sdks/python,>
outside environment <https://builds.apache.org/job/beam_PostCommit_Python2/ws/src/build/gradleenv/45127155>
    Can't uninstall 'apache-beam'. No files were found to uninstall.
  Running setup.py develop for apache-beam
Successfully installed apache-beam
<https://builds.apache.org/job/beam_PostCommit_Python2/ws/src/sdks/python/apache_beam/__init__.py>:84:
UserWarning: You are using Apache Beam with Python 2. New releases of Apache Beam will soon
support Python 3 only.
  'You are using Apache Beam with Python 2. '
INFO:root:Missing pipeline option (runner). Executing pipeline using the default runner: DirectRunner.
INFO:__main__:Writing 100000 documents to mongodb
<https://builds.apache.org/job/beam_PostCommit_Python2/ws/src/sdks/python/apache_beam/io/mongodbio_it_test.py>:70:
FutureWarning: WriteToMongoDB is experimental.
  known_args.batch_size)
INFO:apache_beam.runners.portability.fn_api_runner_transforms:==================== <function
annotate_downstream_side_inputs at 0x7fbb44266848> ====================
INFO:apache_beam.runners.portability.fn_api_runner_transforms:==================== <function
fix_side_input_pcoll_coders at 0x7fbb44266938> ====================
INFO:apache_beam.runners.portability.fn_api_runner_transforms:==================== <function
lift_combiners at 0x7fbb442669b0> ====================
INFO:apache_beam.runners.portability.fn_api_runner_transforms:==================== <function
expand_sdf at 0x7fbb44266a28> ====================
INFO:apache_beam.runners.portability.fn_api_runner_transforms:==================== <function
expand_gbk at 0x7fbb44266aa0> ====================
INFO:apache_beam.runners.portability.fn_api_runner_transforms:==================== <function
sink_flattens at 0x7fbb44266b90> ====================
INFO:apache_beam.runners.portability.fn_api_runner_transforms:==================== <function
greedily_fuse at 0x7fbb44266c08> ====================
INFO:apache_beam.runners.portability.fn_api_runner_transforms:==================== <function
read_to_impulse at 0x7fbb44266c80> ====================
INFO:apache_beam.runners.portability.fn_api_runner_transforms:==================== <function
impulse_to_input at 0x7fbb44266cf8> ====================
INFO:apache_beam.runners.portability.fn_api_runner_transforms:==================== <function
inject_timer_pcollections at 0x7fbb44266e60> ====================
INFO:apache_beam.runners.portability.fn_api_runner_transforms:==================== <function
sort_stages at 0x7fbb44266ed8> ====================
INFO:apache_beam.runners.portability.fn_api_runner_transforms:==================== <function
window_pcollection_coders at 0x7fbb44266f50> ====================
INFO:apache_beam.runners.worker.statecache:Creating state cache with size 100
INFO:apache_beam.runners.portability.fn_api_runner:Created Worker handler <apache_beam.runners.portability.fn_api_runner.EmbeddedWorkerHandler
object at 0x7fbb44690b10> for environment urn: "beam:env:embedded_python:v1"

INFO:apache_beam.runners.portability.fn_api_runner:Running (ref_AppliedPTransform_Create documents/Read_3)+((ref_AppliedPTransform_WriteToMongoDB/ParDo(_GenerateObjectIdFn)_5)+((ref_AppliedPTransform_WriteToMongoDB/Reshuffle/AddRandomKeys_7)+((ref_AppliedPTransform_WriteToMongoDB/Reshuffle/ReshufflePerKey/Map(reify_timestamps)_9)+(WriteToMongoDB/Reshuffle/ReshufflePerKey/GroupByKey/Write))))
INFO:apache_beam.runners.portability.fn_api_runner:Running ((WriteToMongoDB/Reshuffle/ReshufflePerKey/GroupByKey/Read)+(ref_AppliedPTransform_WriteToMongoDB/Reshuffle/ReshufflePerKey/FlatMap(restore_timestamps)_14))+((ref_AppliedPTransform_WriteToMongoDB/Reshuffle/RemoveRandomKeys_15)+(ref_AppliedPTransform_WriteToMongoDB/ParDo(_WriteMongoFn)_16))
INFO:__main__:Writing 100000 documents to mongodb finished in 51.981 seconds
INFO:root:Missing pipeline option (runner). Executing pipeline using the default runner: DirectRunner.
INFO:__main__:Reading from mongodb beam_mongodbio_it_db:integration_test_1574878586
<https://builds.apache.org/job/beam_PostCommit_Python2/ws/src/sdks/python/apache_beam/io/mongodbio_it_test.py>:85:
FutureWarning: ReadFromMongoDB is experimental.
  | 'Map' >> beam.Map(lambda doc: doc['number'])
INFO:apache_beam.runners.portability.fn_api_runner_transforms:==================== <function
annotate_downstream_side_inputs at 0x7fbb44266848> ====================
INFO:apache_beam.runners.portability.fn_api_runner_transforms:==================== <function
fix_side_input_pcoll_coders at 0x7fbb44266938> ====================
INFO:apache_beam.runners.portability.fn_api_runner_transforms:==================== <function
lift_combiners at 0x7fbb442669b0> ====================
INFO:apache_beam.runners.portability.fn_api_runner_transforms:==================== <function
expand_sdf at 0x7fbb44266a28> ====================
INFO:apache_beam.runners.portability.fn_api_runner_transforms:==================== <function
expand_gbk at 0x7fbb44266aa0> ====================
INFO:apache_beam.runners.portability.fn_api_runner_transforms:==================== <function
sink_flattens at 0x7fbb44266b90> ====================
INFO:apache_beam.runners.portability.fn_api_runner_transforms:==================== <function
greedily_fuse at 0x7fbb44266c08> ====================
INFO:apache_beam.runners.portability.fn_api_runner_transforms:==================== <function
read_to_impulse at 0x7fbb44266c80> ====================
INFO:apache_beam.runners.portability.fn_api_runner_transforms:==================== <function
impulse_to_input at 0x7fbb44266cf8> ====================
INFO:apache_beam.runners.portability.fn_api_runner_transforms:==================== <function
inject_timer_pcollections at 0x7fbb44266e60> ====================
INFO:apache_beam.runners.portability.fn_api_runner_transforms:==================== <function
sort_stages at 0x7fbb44266ed8> ====================
INFO:apache_beam.runners.portability.fn_api_runner_transforms:==================== <function
window_pcollection_coders at 0x7fbb44266f50> ====================
INFO:apache_beam.runners.worker.statecache:Creating state cache with size 100
INFO:apache_beam.runners.portability.fn_api_runner:Created Worker handler <apache_beam.runners.portability.fn_api_runner.EmbeddedWorkerHandler
object at 0x7fbb44eedf10> for environment urn: "beam:env:embedded_python:v1"

INFO:apache_beam.runners.portability.fn_api_runner:Running ((ref_AppliedPTransform_ReadFromMongoDB/Read_3)+((ref_AppliedPTransform_Map_4)+((ref_AppliedPTransform_assert_that/WindowInto(WindowIntoFn)_8)+((ref_AppliedPTransform_assert_that/ToVoidKey_9)+((ref_AppliedPTransform_assert_that/Group/pair_with_1_12)+(assert_that/Group/Flatten/Transcode/1))))))+(assert_that/Group/Flatten/Write/1)
INFO:apache_beam.runners.portability.fn_api_runner:Running ((ref_AppliedPTransform_assert_that/Create/Read_7)+((ref_AppliedPTransform_assert_that/Group/pair_with_0_11)+(assert_that/Group/Flatten/Transcode/0)))+(assert_that/Group/Flatten/Write/0)
INFO:apache_beam.runners.portability.fn_api_runner:Running (assert_that/Group/Flatten/Read)+(assert_that/Group/GroupByKey/Write)
INFO:apache_beam.runners.portability.fn_api_runner:Running (assert_that/Group/GroupByKey/Read)+((ref_AppliedPTransform_assert_that/Group/Map(_merge_tagged_vals_under_key)_18)+((ref_AppliedPTransform_assert_that/Unkey_19)+(ref_AppliedPTransform_assert_that/Match_20)))
INFO:__main__:Read 100000 documents from mongodb finished in 23.570 seconds
mongoioit27152
mongoioit27152

FAILURE: Build completed with 3 failures.

1: Task failed with an exception.
-----------
* Where:
Build file '<https://builds.apache.org/job/beam_PostCommit_Python2/ws/src/sdks/python/build.gradle'>
line: 46

* What went wrong:
Execution failed for task ':sdks:python:sdist'.
> Process 'command 'sh'' finished with non-zero exit value 1

* Try:
Run with --stacktrace option to get the stack trace. Run with --info or --debug option to
get more log output. Run with --scan to get full insights.
==============================================================================

2: Task failed with an exception.
-----------
* What went wrong:
Execution failed for task ':sdks:python:test-suites:portable:py2:installGcpTest'.
> Process 'command 'sh'' finished with non-zero exit value 1

* Try:
Run with --stacktrace option to get the stack trace. Run with --info or --debug option to
get more log output. Run with --scan to get full insights.
==============================================================================

3: Task failed with an exception.
-----------
* Where:
Build file '<https://builds.apache.org/job/beam_PostCommit_Python2/ws/src/sdks/python/test-suites/direct/py2/build.gradle'>
line: 70

* What went wrong:
Execution failed for task ':sdks:python:test-suites:direct:py2:directRunnerIT'.
> Process 'command 'sh'' finished with non-zero exit value 1

* Try:
Run with --stacktrace option to get the stack trace. Run with --info or --debug option to
get more log output. Run with --scan to get full insights.
==============================================================================

* Get more help at https://help.gradle.org

Deprecated Gradle features were used in this build, making it incompatible with Gradle 6.0.
Use '--warning-mode all' to show the individual deprecation warnings.
See https://docs.gradle.org/5.2.1/userguide/command_line_interface.html#sec:command_line_warnings

BUILD FAILED in 11m 45s
111 actionable tasks: 85 executed, 23 from cache, 3 up-to-date

Publishing build scan...
https://gradle.com/s/2c4vq6ta3gh3k

Build step 'Invoke Gradle script' changed build result to FAILURE
Build step 'Invoke Gradle script' marked build as failure

---------------------------------------------------------------------
To unsubscribe, e-mail: builds-unsubscribe@beam.apache.org
For additional commands, e-mail: builds-help@beam.apache.org


Mime
View raw message