beam-builds mailing list archives

Site index · List index
Message view « Date » · « Thread »
Top « Date » · « Thread »
From Apache Jenkins Server <jenk...@builds.apache.org>
Subject Build failed in Jenkins: beam_PostCommit_Python36 #1096
Date Wed, 27 Nov 2019 22:33:48 GMT
See <https://builds.apache.org/job/beam_PostCommit_Python36/1096/display/redirect?page=changes>

Changes:

[amyrvold] [BEAM-8832] Allow GCS staging upload chunk size to be increased >1M when


------------------------------------------
[...truncated 516.03 KB...]
	details = "Socket closed"
	debug_error_string = "{"created":"@1574888583.143233496","description":"Error received from
peer ipv4:127.0.0.1:35487","file":"src/core/lib/surface/call.cc","file_line":1055,"grpc_message":"Socket
closed","grpc_status":14}"
>


> Task :sdks:python:test-suites:portable:py36:postCommitPy36

> Task :sdks:python:test-suites:dataflow:py36:postCommitIT
Worker logs: https://console.cloud.google.com/dataflow/jobsDetail/locations/us-central1/jobs/2019-11-27_13_00_38-15142173468031970973?project=apache-beam-testing
<https://builds.apache.org/job/beam_PostCommit_Python36/ws/src/sdks/python/apache_beam/runners/dataflow/dataflow_runner.py>:726:
BeamDeprecationWarning: BigQuerySink is deprecated since 2.11.0. Use WriteToBigQuery instead.
Worker logs: https://console.cloud.google.com/dataflow/jobsDetail/locations/us-central1/jobs/2019-11-27_13_09_10-9401012794724112707?project=apache-beam-testing
  kms_key=transform.kms_key))
Worker logs: https://console.cloud.google.com/dataflow/jobsDetail/locations/us-central1/jobs/2019-11-27_13_19_14-4416538210196419043?project=apache-beam-testing
<https://builds.apache.org/job/beam_PostCommit_Python36/ws/src/sdks/python/apache_beam/io/gcp/bigquery_test.py>:651:
BeamDeprecationWarning: options is deprecated since First stable release. References to <pipeline>.options
will not be supported
  streaming = self.test_pipeline.options.view_as(StandardOptions).streaming
<https://builds.apache.org/job/beam_PostCommit_Python36/ws/src/sdks/python/apache_beam/io/gcp/bigquery.py>:1220:
BeamDeprecationWarning: options is deprecated since First stable release. References to <pipeline>.options
will not be supported
  experiments = p.options.view_as(DebugOptions).experiments or []
test_datastore_wordcount_it (apache_beam.examples.cookbook.datastore_wordcount_it_test.DatastoreWordCountIT)
... SKIP: This test still needs to be fixed on Python 3TODO: BEAM-4543
test_avro_it (apache_beam.examples.fastavro_it_test.FastavroIT) ... SKIP: Due to a known issue
in avro-python3 package, thistest is skipped until BEAM-6522 is addressed. 
test_bigquery_tornadoes_it (apache_beam.examples.cookbook.bigquery_tornadoes_it_test.BigqueryTornadoesIT)
... ok
test_autocomplete_it (apache_beam.examples.complete.autocomplete_test.AutocompleteTest) ...
ok
test_wordcount_fnapi_it (apache_beam.examples.wordcount_it_test.WordCountIT) ... ok
test_streaming_wordcount_it (apache_beam.examples.streaming_wordcount_it_test.StreamingWordCountIT)
... ok
test_leader_board_it (apache_beam.examples.complete.game.leader_board_it_test.LeaderBoardIT)
... ok
test_game_stats_it (apache_beam.examples.complete.game.game_stats_it_test.GameStatsIT) ...
ok
test_wordcount_it (apache_beam.examples.wordcount_it_test.WordCountIT) ... ok
test_user_score_it (apache_beam.examples.complete.game.user_score_it_test.UserScoreIT) ...
ok
test_bigquery_read_1M_python (apache_beam.io.gcp.bigquery_io_read_it_test.BigqueryIOReadIT)
... ok
test_hourly_team_score_it (apache_beam.examples.complete.game.hourly_team_score_it_test.HourlyTeamScoreIT)
... ok
test_bqfl_streaming (apache_beam.io.gcp.bigquery_file_loads_test.BigQueryFileLoadsIT) ...
SKIP: TestStream is not supported on TestDataflowRunner
test_multiple_destinations_transform (apache_beam.io.gcp.bigquery_file_loads_test.BigQueryFileLoadsIT)
... ok
test_one_job_fails_all_jobs_fail (apache_beam.io.gcp.bigquery_file_loads_test.BigQueryFileLoadsIT)
... ok
test_datastore_write_limit (apache_beam.io.gcp.datastore_write_it_test.DatastoreWriteIT) ...
SKIP: This test still needs to be fixed on Python 3TODO: BEAM-4543
test_value_provider_transform (apache_beam.io.gcp.bigquery_test.BigQueryStreamingInsertTransformIntegrationTests)
... ok
test_copy (apache_beam.io.gcp.gcsio_integration_test.GcsIOIntegrationTest) ... ok
test_copy_batch (apache_beam.io.gcp.gcsio_integration_test.GcsIOIntegrationTest) ... ok
test_copy_batch_kms (apache_beam.io.gcp.gcsio_integration_test.GcsIOIntegrationTest) ... ok
test_copy_batch_rewrite_token (apache_beam.io.gcp.gcsio_integration_test.GcsIOIntegrationTest)
... ok
test_copy_kms (apache_beam.io.gcp.gcsio_integration_test.GcsIOIntegrationTest) ... ok
test_copy_rewrite_token (apache_beam.io.gcp.gcsio_integration_test.GcsIOIntegrationTest) ...
ok
test_big_query_read (apache_beam.io.gcp.bigquery_read_it_test.BigQueryReadIntegrationTests)
... ok
test_big_query_read_new_types (apache_beam.io.gcp.bigquery_read_it_test.BigQueryReadIntegrationTests)
... ok
test_file_loads (apache_beam.io.gcp.bigquery_test.PubSubBigQueryIT) ... SKIP: https://issuetracker.google.com/issues/118375066
test_streaming_inserts (apache_beam.io.gcp.bigquery_test.PubSubBigQueryIT) ... ok
test_transform_on_gcs (apache_beam.io.fileio_test.MatchIntegrationTest) ... ok
test_parquetio_it (apache_beam.io.parquetio_it_test.TestParquetIT) ... ok
test_big_query_legacy_sql (apache_beam.io.gcp.big_query_query_to_table_it_test.BigQueryQueryToTableIT)
... ok
test_big_query_new_types (apache_beam.io.gcp.big_query_query_to_table_it_test.BigQueryQueryToTableIT)
... ok
test_big_query_standard_sql (apache_beam.io.gcp.big_query_query_to_table_it_test.BigQueryQueryToTableIT)
... ok
test_big_query_standard_sql_kms_key_native (apache_beam.io.gcp.big_query_query_to_table_it_test.BigQueryQueryToTableIT)
... ok
test_streaming_data_only (apache_beam.io.gcp.pubsub_integration_test.PubSubIntegrationTest)
... ok
test_streaming_with_attributes (apache_beam.io.gcp.pubsub_integration_test.PubSubIntegrationTest)
... ok
Runs streaming Dataflow job and verifies that user metrics are reported ... ok
test_job_python_from_python_it (apache_beam.transforms.external_test_it.ExternalTransformIT)
... ok
test_big_query_write (apache_beam.io.gcp.bigquery_write_it_test.BigQueryWriteIntegrationTests)
... ok
test_big_query_write_new_types (apache_beam.io.gcp.bigquery_write_it_test.BigQueryWriteIntegrationTests)
... ok
test_big_query_write_schema_autodetect (apache_beam.io.gcp.bigquery_write_it_test.BigQueryWriteIntegrationTests)
... SKIP: DataflowRunner does not support schema autodetection
test_big_query_write_without_schema (apache_beam.io.gcp.bigquery_write_it_test.BigQueryWriteIntegrationTests)
... ok
test_datastore_write_limit (apache_beam.io.gcp.datastore.v1new.datastore_write_it_test.DatastoreWriteIT)
... ok
test_metrics_fnapi_it (apache_beam.runners.dataflow.dataflow_exercise_metrics_pipeline_test.ExerciseMetricsPipelineTest)
... ok
test_metrics_it (apache_beam.runners.dataflow.dataflow_exercise_metrics_pipeline_test.ExerciseMetricsPipelineTest)
... ok
test_multiple_destinations_transform (apache_beam.io.gcp.bigquery_test.BigQueryStreamingInsertTransformIntegrationTests)
... ERROR

======================================================================
ERROR: test_multiple_destinations_transform (apache_beam.io.gcp.bigquery_test.BigQueryStreamingInsertTransformIntegrationTests)
----------------------------------------------------------------------
Traceback (most recent call last):
  File "<https://builds.apache.org/job/beam_PostCommit_Python36/ws/src/build/gradleenv/-1734967053/lib/python3.6/site-packages/nose/plugins/multiprocess.py",>
line 812, in run
    test(orig)
  File "<https://builds.apache.org/job/beam_PostCommit_Python36/ws/src/build/gradleenv/-1734967053/lib/python3.6/site-packages/nose/case.py",>
line 46, in __call__
    return self.run(*arg, **kwarg)
  File "<https://builds.apache.org/job/beam_PostCommit_Python36/ws/src/build/gradleenv/-1734967053/lib/python3.6/site-packages/nose/case.py",>
line 134, in run
    self.runTest(result)
  File "<https://builds.apache.org/job/beam_PostCommit_Python36/ws/src/build/gradleenv/-1734967053/lib/python3.6/site-packages/nose/case.py",>
line 152, in runTest
    test(result)
  File "/usr/lib/python3.6/unittest/case.py", line 653, in __call__
    return self.run(*args, **kwds)
  File "/usr/lib/python3.6/unittest/case.py", line 605, in run
    testMethod()
  File "<https://builds.apache.org/job/beam_PostCommit_Python36/ws/src/sdks/python/apache_beam/io/gcp/bigquery_test.py",>
line 740, in test_multiple_destinations_transform
    equal_to([(full_output_table_1, bad_record)]))
  File "<https://builds.apache.org/job/beam_PostCommit_Python36/ws/src/sdks/python/apache_beam/pipeline.py",>
line 436, in __exit__
    self.run().wait_until_finish()
  File "<https://builds.apache.org/job/beam_PostCommit_Python36/ws/src/sdks/python/apache_beam/pipeline.py",>
line 416, in run
    self._options).run(False)
  File "<https://builds.apache.org/job/beam_PostCommit_Python36/ws/src/sdks/python/apache_beam/pipeline.py",>
line 429, in run
    return self.runner.run_pipeline(self, self._options)
  File "<https://builds.apache.org/job/beam_PostCommit_Python36/ws/src/sdks/python/apache_beam/runners/dataflow/test_dataflow_runner.py",>
line 73, in run_pipeline
    self.result.cancel()
  File "<https://builds.apache.org/job/beam_PostCommit_Python36/ws/src/sdks/python/apache_beam/runners/dataflow/dataflow_runner.py",>
line 1464, in cancel
    return self.state
  File "<https://builds.apache.org/job/beam_PostCommit_Python36/ws/src/sdks/python/apache_beam/runners/dataflow/dataflow_runner.py",>
line 1404, in state
    self._update_job()
  File "<https://builds.apache.org/job/beam_PostCommit_Python36/ws/src/sdks/python/apache_beam/runners/dataflow/dataflow_runner.py",>
line 1360, in _update_job
    self._job = self._runner.dataflow_client.get_job(self.job_id())
  File "<https://builds.apache.org/job/beam_PostCommit_Python36/ws/src/sdks/python/apache_beam/utils/retry.py",>
line 209, in wrapper
    return fun(*args, **kwargs)
  File "<https://builds.apache.org/job/beam_PostCommit_Python36/ws/src/sdks/python/apache_beam/runners/dataflow/internal/apiclient.py",>
line 673, in get_job
    response = self._client.projects_locations_jobs.Get(request)
  File "<https://builds.apache.org/job/beam_PostCommit_Python36/ws/src/sdks/python/apache_beam/runners/dataflow/internal/clients/dataflow/dataflow_v1b3_client.py",>
line 661, in Get
    config, request, global_params=global_params)
  File "<https://builds.apache.org/job/beam_PostCommit_Python36/ws/src/build/gradleenv/-1734967053/lib/python3.6/site-packages/apitools/base/py/base_api.py",>
line 729, in _RunMethod
    http, http_request, **opts)
  File "<https://builds.apache.org/job/beam_PostCommit_Python36/ws/src/build/gradleenv/-1734967053/lib/python3.6/site-packages/apitools/base/py/http_wrapper.py",>
line 346, in MakeRequest
    check_response_func=check_response_func)
  File "<https://builds.apache.org/job/beam_PostCommit_Python36/ws/src/build/gradleenv/-1734967053/lib/python3.6/site-packages/apitools/base/py/http_wrapper.py",>
line 396, in _MakeRequestNoRetry
    redirections=redirections, connection_type=connection_type)
  File "<https://builds.apache.org/job/beam_PostCommit_Python36/ws/src/build/gradleenv/-1734967053/lib/python3.6/site-packages/oauth2client/transport.py",>
line 169, in new_request
    redirections, connection_type)
  File "<https://builds.apache.org/job/beam_PostCommit_Python36/ws/src/build/gradleenv/-1734967053/lib/python3.6/site-packages/oauth2client/transport.py",>
line 169, in new_request
    redirections, connection_type)
  File "<https://builds.apache.org/job/beam_PostCommit_Python36/ws/src/build/gradleenv/-1734967053/lib/python3.6/site-packages/httplib2/__init__.py",>
line 1924, in request
    cachekey,
  File "<https://builds.apache.org/job/beam_PostCommit_Python36/ws/src/build/gradleenv/-1734967053/lib/python3.6/site-packages/httplib2/__init__.py",>
line 1595, in _request
    conn, request_uri, method, body, headers
  File "<https://builds.apache.org/job/beam_PostCommit_Python36/ws/src/build/gradleenv/-1734967053/lib/python3.6/site-packages/httplib2/__init__.py",>
line 1565, in _conn_request
    content = _decompressContent(response, content)
  File "<https://builds.apache.org/job/beam_PostCommit_Python36/ws/src/build/gradleenv/-1734967053/lib/python3.6/site-packages/httplib2/__init__.py",>
line 440, in _decompressContent
    content = gzip.GzipFile(fileobj=io.BytesIO(new_content)).read()
  File "/usr/lib/python3.6/gzip.py", line 165, in __init__
    filename = getattr(fileobj, 'name', '')
  File "<https://builds.apache.org/job/beam_PostCommit_Python36/ws/src/build/gradleenv/-1734967053/lib/python3.6/site-packages/nose/plugins/multiprocess.py",>
line 276, in signalhandler
    raise TimedOutException()
nose.plugins.multiprocess.TimedOutException: 'test_multiple_destinations_transform (apache_beam.io.gcp.bigquery_test.BigQueryStreamingInsertTransformIntegrationTests)'
Worker logs: https://console.cloud.google.com/dataflow/jobsDetail/locations/us-central1/jobs/2019-11-27_13_00_40-9015722262998834607?project=apache-beam-testing
<https://builds.apache.org/job/beam_PostCommit_Python36/ws/src/sdks/python/apache_beam/io/gcp/bigquery.py>:1220:
BeamDeprecationWarning: options is deprecated since First stable release. References to <pipeline>.options
will not be supported
Worker logs: https://console.cloud.google.com/dataflow/jobsDetail/locations/us-central1/jobs/2019-11-27_13_15_16-1332625208265863898?project=apache-beam-testing
  experiments = p.options.view_as(DebugOptions).experiments or []
Worker logs: https://console.cloud.google.com/dataflow/jobsDetail/locations/us-central1/jobs/2019-11-27_13_23_22-10879291395167282004?project=apache-beam-testing
Worker logs: https://console.cloud.google.com/dataflow/jobsDetail/locations/us-central1/jobs/2019-11-27_13_31_37-1840990042707738437?project=apache-beam-testing
Worker logs: https://console.cloud.google.com/dataflow/jobsDetail/locations/us-central1/jobs/2019-11-27_13_41_18-17631102730734595088?project=apache-beam-testing
Worker logs: https://console.cloud.google.com/dataflow/jobsDetail/locations/us-central1/jobs/2019-11-27_13_00_38-7916951235248851673?project=apache-beam-testing
<https://builds.apache.org/job/beam_PostCommit_Python36/ws/src/sdks/python/apache_beam/runners/dataflow/dataflow_runner.py>:726:
BeamDeprecationWarning: BigQuerySink is deprecated since 2.11.0. Use WriteToBigQuery instead.
  kms_key=transform.kms_key))
Worker logs: https://console.cloud.google.com/dataflow/jobsDetail/locations/us-central1/jobs/2019-11-27_13_24_25-12610876801577605981?project=apache-beam-testing
<https://builds.apache.org/job/beam_PostCommit_Python36/ws/src/sdks/python/apache_beam/runners/dataflow/dataflow_runner.py>:726:
BeamDeprecationWarning: BigQuerySink is deprecated since 2.11.0. Use WriteToBigQuery instead.
Worker logs: https://console.cloud.google.com/dataflow/jobsDetail/locations/us-central1/jobs/2019-11-27_13_34_07-10909048003946864808?project=apache-beam-testing
  kms_key=transform.kms_key))
Worker logs: https://console.cloud.google.com/dataflow/jobsDetail/locations/us-central1/jobs/2019-11-27_13_42_13-4293801891651580908?project=apache-beam-testing
<https://builds.apache.org/job/beam_PostCommit_Python36/ws/src/sdks/python/apache_beam/runners/dataflow/dataflow_runner.py>:726:
BeamDeprecationWarning: BigQuerySink is deprecated since 2.11.0. Use WriteToBigQuery instead.
  kms_key=transform.kms_key))
<https://builds.apache.org/job/beam_PostCommit_Python36/ws/src/sdks/python/apache_beam/runners/dataflow/dataflow_runner.py>:726:
BeamDeprecationWarning: BigQuerySink is deprecated since 2.11.0. Use WriteToBigQuery instead.
  kms_key=transform.kms_key))
Worker logs: https://console.cloud.google.com/dataflow/jobsDetail/locations/us-central1/jobs/2019-11-27_13_00_39-10829273803289224888?project=apache-beam-testing
<https://builds.apache.org/job/beam_PostCommit_Python36/ws/src/sdks/python/apache_beam/io/gcp/bigquery.py>:1220:
BeamDeprecationWarning: options is deprecated since First stable release. References to <pipeline>.options
will not be supported
Worker logs: https://console.cloud.google.com/dataflow/jobsDetail/locations/us-central1/jobs/2019-11-27_13_13_23-15516054966404235017?project=apache-beam-testing
Worker logs: https://console.cloud.google.com/dataflow/jobsDetail/locations/us-central1/jobs/2019-11-27_13_21_48-4857578734131838012?project=apache-beam-testing
  experiments = p.options.view_as(DebugOptions).experiments or []
Worker logs: https://console.cloud.google.com/dataflow/jobsDetail/locations/us-central1/jobs/2019-11-27_13_39_11-6365842788549813613?project=apache-beam-testing
<https://builds.apache.org/job/beam_PostCommit_Python36/ws/src/sdks/python/apache_beam/io/gcp/bigquery.py>:1217:
BeamDeprecationWarning: options is deprecated since First stable release. References to <pipeline>.options
will not be supported
Worker logs: https://console.cloud.google.com/dataflow/jobsDetail/locations/us-central1/jobs/2019-11-27_13_48_22-11223057521403703921?project=apache-beam-testing
  self.table_reference.projectId = pcoll.pipeline.options.view_as(
Worker logs: https://console.cloud.google.com/dataflow/jobsDetail/locations/us-central1/jobs/2019-11-27_13_00_38-11781300110384227485?project=apache-beam-testing
Worker logs: https://console.cloud.google.com/dataflow/jobsDetail/locations/us-central1/jobs/2019-11-27_13_21_25-14855798781700949304?project=apache-beam-testing
Worker logs: https://console.cloud.google.com/dataflow/jobsDetail/locations/us-central1/jobs/2019-11-27_13_30_17-9807916448260744307?project=apache-beam-testing
Worker logs: https://console.cloud.google.com/dataflow/jobsDetail/locations/us-central1/jobs/2019-11-27_13_38_52-14372577118618373905?project=apache-beam-testing
<https://builds.apache.org/job/beam_PostCommit_Python36/ws/src/sdks/python/apache_beam/io/gcp/bigquery.py>:1220:
BeamDeprecationWarning: options is deprecated since First stable release. References to <pipeline>.options
will not be supported
  experiments = p.options.view_as(DebugOptions).experiments or []
<https://builds.apache.org/job/beam_PostCommit_Python36/ws/src/sdks/python/apache_beam/io/gcp/bigquery_file_loads.py>:797:
BeamDeprecationWarning: options is deprecated since First stable release. References to <pipeline>.options
will not be supported
  temp_location = p.options.view_as(GoogleCloudOptions).temp_location
Worker logs: https://console.cloud.google.com/dataflow/jobsDetail/locations/us-central1/jobs/2019-11-27_13_00_38-10890773580514589394?project=apache-beam-testing
Worker logs: https://console.cloud.google.com/dataflow/jobsDetail/locations/us-central1/jobs/2019-11-27_13_09_38-5518844798005475603?project=apache-beam-testing
Worker logs: https://console.cloud.google.com/dataflow/jobsDetail/locations/us-central1/jobs/2019-11-27_13_17_53-4490513982739821562?project=apache-beam-testing
Worker logs: https://console.cloud.google.com/dataflow/jobsDetail/locations/us-central1/jobs/2019-11-27_13_27_08-15944341299872859819?project=apache-beam-testing
Worker logs: https://console.cloud.google.com/dataflow/jobsDetail/locations/us-central1/jobs/2019-11-27_13_37_27-6801996391083214052?project=apache-beam-testing
Worker logs: https://console.cloud.google.com/dataflow/jobsDetail/locations/us-central1/jobs/2019-11-27_13_45_01-11047473775889556384?project=apache-beam-testing
Worker logs: https://console.cloud.google.com/dataflow/jobsDetail/locations/us-central1/jobs/2019-11-27_13_00_38-12010206863932592362?project=apache-beam-testing
Worker logs: https://console.cloud.google.com/dataflow/jobsDetail/locations/us-central1/jobs/2019-11-27_13_09_50-16275681387258562937?project=apache-beam-testing
Worker logs: https://console.cloud.google.com/dataflow/jobsDetail/locations/us-central1/jobs/2019-11-27_13_19_04-9030688109889749407?project=apache-beam-testing
Worker logs: https://console.cloud.google.com/dataflow/jobsDetail/locations/us-central1/jobs/2019-11-27_13_27_17-4027113606709831042?project=apache-beam-testing
Worker logs: https://console.cloud.google.com/dataflow/jobsDetail/locations/us-central1/jobs/2019-11-27_13_35_58-17897136939825706228?project=apache-beam-testing
<https://builds.apache.org/job/beam_PostCommit_Python36/ws/src/sdks/python/apache_beam/runners/dataflow/dataflow_runner.py>:726:
BeamDeprecationWarning: BigQuerySink is deprecated since 2.11.0. Use WriteToBigQuery instead.
  kms_key=transform.kms_key))
<https://builds.apache.org/job/beam_PostCommit_Python36/ws/src/sdks/python/apache_beam/runners/dataflow/dataflow_runner.py>:726:
BeamDeprecationWarning: BigQuerySink is deprecated since 2.11.0. Use WriteToBigQuery instead.
  kms_key=transform.kms_key))
<https://builds.apache.org/job/beam_PostCommit_Python36/ws/src/sdks/python/apache_beam/runners/dataflow/dataflow_runner.py>:726:
BeamDeprecationWarning: BigQuerySink is deprecated since 2.11.0. Use WriteToBigQuery instead.
  kms_key=transform.kms_key))
<https://builds.apache.org/job/beam_PostCommit_Python36/ws/src/sdks/python/apache_beam/io/gcp/big_query_query_to_table_pipeline.py>:73:
BeamDeprecationWarning: BigQuerySink is deprecated since 2.11.0. Use WriteToBigQuery instead.
  kms_key=kms_key))
Worker logs: https://console.cloud.google.com/dataflow/jobsDetail/locations/us-central1/jobs/2019-11-27_13_00_39-5724779913808112471?project=apache-beam-testing
Worker logs: https://console.cloud.google.com/dataflow/jobsDetail/locations/us-central1/jobs/2019-11-27_13_10_11-2816030253916902720?project=apache-beam-testing
Worker logs: https://console.cloud.google.com/dataflow/jobsDetail/locations/us-central1/jobs/2019-11-27_13_20_38-16028241658175178163?project=apache-beam-testing
Worker logs: https://console.cloud.google.com/dataflow/jobsDetail/locations/us-central1/jobs/2019-11-27_13_31_01-16511684766575859898?project=apache-beam-testing
Worker logs: https://console.cloud.google.com/dataflow/jobsDetail/locations/us-central1/jobs/2019-11-27_13_39_34-17320639079611697978?project=apache-beam-testing
<https://builds.apache.org/job/beam_PostCommit_Python36/ws/src/sdks/python/apache_beam/io/gcp/bigquery.py>:1220:
BeamDeprecationWarning: options is deprecated since First stable release. References to <pipeline>.options
will not be supported
  experiments = p.options.view_as(DebugOptions).experiments or []
<https://builds.apache.org/job/beam_PostCommit_Python36/ws/src/sdks/python/apache_beam/io/gcp/bigquery_file_loads.py>:797:
BeamDeprecationWarning: options is deprecated since First stable release. References to <pipeline>.options
will not be supported
  temp_location = p.options.view_as(GoogleCloudOptions).temp_location
<https://builds.apache.org/job/beam_PostCommit_Python36/ws/src/sdks/python/apache_beam/io/gcp/bigquery.py>:1220:
BeamDeprecationWarning: options is deprecated since First stable release. References to <pipeline>.options
will not be supported
  experiments = p.options.view_as(DebugOptions).experiments or []
<https://builds.apache.org/job/beam_PostCommit_Python36/ws/src/sdks/python/apache_beam/io/gcp/bigquery_file_loads.py>:797:
BeamDeprecationWarning: options is deprecated since First stable release. References to <pipeline>.options
will not be supported
  temp_location = p.options.view_as(GoogleCloudOptions).temp_location
<https://builds.apache.org/job/beam_PostCommit_Python36/ws/src/sdks/python/apache_beam/io/fileio_test.py>:296:
FutureWarning: MatchAll is experimental.
  | 'GetPath' >> beam.Map(lambda metadata: metadata.path))
<https://builds.apache.org/job/beam_PostCommit_Python36/ws/src/sdks/python/apache_beam/io/fileio_test.py>:307:
FutureWarning: MatchAll is experimental.
  | 'Checksums' >> beam.Map(compute_hash))
<https://builds.apache.org/job/beam_PostCommit_Python36/ws/src/sdks/python/apache_beam/io/fileio_test.py>:307:
FutureWarning: ReadMatches is experimental.
  | 'Checksums' >> beam.Map(compute_hash))

----------------------------------------------------------------------
XML: nosetests-postCommitIT-df-py36.xml
----------------------------------------------------------------------
XML: <https://builds.apache.org/job/beam_PostCommit_Python36/ws/src/sdks/python/nosetests.xml>
----------------------------------------------------------------------
Ran 45 tests in 5610.681s

FAILED (SKIP=6, errors=1)

> Task :sdks:python:test-suites:dataflow:py36:postCommitIT FAILED

FAILURE: Build completed with 2 failures.

1: Task failed with an exception.
-----------
* What went wrong:
Execution failed for task ':sdks:python:test-suites:direct:py36:installGcpTest'.
> Process 'command 'sh'' finished with non-zero exit value 1

* Try:
Run with --stacktrace option to get the stack trace. Run with --info or --debug option to
get more log output. Run with --scan to get full insights.
==============================================================================

2: Task failed with an exception.
-----------
* Where:
Build file '<https://builds.apache.org/job/beam_PostCommit_Python36/ws/src/sdks/python/test-suites/dataflow/py36/build.gradle'>
line: 56

* What went wrong:
Execution failed for task ':sdks:python:test-suites:dataflow:py36:postCommitIT'.
> Process 'command 'sh'' finished with non-zero exit value 1

* Try:
Run with --stacktrace option to get the stack trace. Run with --info or --debug option to
get more log output. Run with --scan to get full insights.
==============================================================================

* Get more help at https://help.gradle.org

Deprecated Gradle features were used in this build, making it incompatible with Gradle 6.0.
Use '--warning-mode all' to show the individual deprecation warnings.
See https://docs.gradle.org/5.2.1/userguide/command_line_interface.html#sec:command_line_warnings

BUILD FAILED in 1h 34m 41s
82 actionable tasks: 61 executed, 21 from cache

Publishing build scan...
https://gradle.com/s/ndupciomax4ro

Build step 'Invoke Gradle script' changed build result to FAILURE
Build step 'Invoke Gradle script' marked build as failure

---------------------------------------------------------------------
To unsubscribe, e-mail: builds-unsubscribe@beam.apache.org
For additional commands, e-mail: builds-help@beam.apache.org


Mime
View raw message