beam-builds mailing list archives

Site index · List index
Message view « Date » · « Thread »
Top « Date » · « Thread »
From Apache Jenkins Server <jenk...@builds.apache.org>
Subject Build failed in Jenkins: beam_PostCommit_Java_Nexmark_Flink #4209
Date Tue, 05 Nov 2019 01:13:50 GMT
See <https://builds.apache.org/job/beam_PostCommit_Java_Nexmark_Flink/4209/display/redirect?page=changes>

Changes:

[kcweaver] [BEAM-8254] add workerRegion and workerZone options to Java SDK


------------------------------------------
[...truncated 10.42 KB...]
> Task :sdks:java:extensions:join-library:processResources NO-SOURCE
> Task :model:job-management:extractProto
> Task :sdks:java:core:generateAvroJava NO-SOURCE
> Task :sdks:java:io:kafka:processResources NO-SOURCE
> Task :sdks:java:testing:test-utils:processResources NO-SOURCE
> Task :sdks:java:io:parquet:processResources NO-SOURCE
> Task :sdks:java:extensions:protobuf:extractProto
> Task :sdks:java:io:google-cloud-platform:processResources NO-SOURCE
> Task :runners:flink:1.9:copySourceOverrides
> Task :model:job-management:processResources
> Task :sdks:java:extensions:protobuf:processResources NO-SOURCE
> Task :sdks:java:testing:nexmark:processResources
> Task :runners:flink:1.9:copyTestResourcesOverrides NO-SOURCE
> Task :model:fn-execution:processResources
> Task :runners:flink:1.9:processResources
> Task :sdks:java:core:generateGrammarSource FROM-CACHE
> Task :sdks:java:build-tools:compileJava FROM-CACHE
> Task :sdks:java:build-tools:processResources
> Task :sdks:java:build-tools:classes
> Task :sdks:java:core:processResources
> Task :sdks:java:build-tools:jar
> Task :model:pipeline:extractIncludeProto
> Task :model:pipeline:extractProto
> Task :sdks:java:extensions:sql:copyFmppTemplatesFromCalciteCore
> Task :sdks:java:extensions:sql:copyFmppTemplatesFromSrc
> Task :model:pipeline:generateProto
> Task :model:pipeline:compileJava FROM-CACHE
> Task :model:pipeline:processResources
> Task :model:pipeline:classes
> Task :model:pipeline:jar
> Task :sdks:java:extensions:sql:generateFmppSources
> Task :model:fn-execution:extractIncludeProto
> Task :model:job-management:extractIncludeProto
> Task :model:job-management:generateProto
> Task :model:fn-execution:generateProto
> Task :model:job-management:compileJava FROM-CACHE
> Task :model:job-management:classes
> Task :model:fn-execution:compileJava FROM-CACHE
> Task :model:fn-execution:classes

> Task :sdks:java:extensions:sql:compileJavacc
Java Compiler Compiler Version 4.0 (Parser Generator)
(type "javacc" with no arguments for help)
Reading from file <https://builds.apache.org/job/beam_PostCommit_Java_Nexmark_Flink/ws/src/sdks/java/extensions/sql/build/generated/fmpp/javacc/Parser.jj>
. . .
Note: UNICODE_INPUT option is specified. Please make sure you create the parser/lexer using
a Reader with the correct character encoding.
Warning: Lookahead adequacy checking not being performed since option LOOKAHEAD is more than
1.  Set option FORCE_LA_CHECK to true to force checking.
File "TokenMgrError.java" does not exist.  Will create one.
File "ParseException.java" does not exist.  Will create one.
File "Token.java" does not exist.  Will create one.
File "SimpleCharStream.java" does not exist.  Will create one.
Parser generated with 0 errors and 1 warnings.

> Task :sdks:java:extensions:sql:processResources
> Task :model:pipeline:shadowJar
> Task :model:job-management:shadowJar
> Task :model:fn-execution:shadowJar
> Task :sdks:java:core:compileJava FROM-CACHE
> Task :sdks:java:core:classes
> Task :sdks:java:core:shadowJar
> Task :sdks:java:extensions:protobuf:extractIncludeProto
> Task :sdks:java:extensions:protobuf:generateProto NO-SOURCE
> Task :sdks:java:extensions:join-library:compileJava FROM-CACHE
> Task :sdks:java:extensions:join-library:classes UP-TO-DATE
> Task :sdks:java:extensions:join-library:jar
> Task :vendor:sdks-java-extensions-protobuf:compileJava FROM-CACHE
> Task :vendor:sdks-java-extensions-protobuf:classes UP-TO-DATE
> Task :runners:local-java:compileJava FROM-CACHE
> Task :runners:local-java:classes UP-TO-DATE
> Task :runners:local-java:jar
> Task :sdks:java:io:kafka:compileJava FROM-CACHE
> Task :sdks:java:io:kafka:classes UP-TO-DATE
> Task :runners:core-construction-java:compileJava FROM-CACHE
> Task :runners:core-construction-java:classes UP-TO-DATE
> Task :vendor:sdks-java-extensions-protobuf:shadowJar
> Task :sdks:java:core:jar
> Task :sdks:java:io:kafka:jar
> Task :sdks:java:fn-execution:compileJava FROM-CACHE
> Task :sdks:java:fn-execution:classes UP-TO-DATE
> Task :sdks:java:fn-execution:jar
> Task :runners:core-construction-java:jar
> Task :runners:core-java:compileJava FROM-CACHE
> Task :runners:core-java:classes UP-TO-DATE
> Task :sdks:java:io:parquet:compileJava FROM-CACHE
> Task :sdks:java:io:parquet:classes UP-TO-DATE
> Task :sdks:java:io:parquet:jar
> Task :sdks:java:extensions:google-cloud-platform-core:compileJava FROM-CACHE
> Task :sdks:java:extensions:google-cloud-platform-core:classes UP-TO-DATE
> Task :runners:core-java:jar
> Task :sdks:java:extensions:google-cloud-platform-core:jar
> Task :sdks:java:extensions:protobuf:compileJava FROM-CACHE
> Task :sdks:java:extensions:protobuf:classes UP-TO-DATE
> Task :sdks:java:extensions:protobuf:jar
> Task :sdks:java:testing:test-utils:compileJava FROM-CACHE
> Task :sdks:java:testing:test-utils:classes UP-TO-DATE
> Task :sdks:java:testing:test-utils:jar
> Task :sdks:java:harness:compileJava FROM-CACHE
> Task :sdks:java:harness:classes UP-TO-DATE
> Task :sdks:java:harness:jar
> Task :sdks:java:io:google-cloud-platform:compileJava FROM-CACHE
> Task :sdks:java:io:google-cloud-platform:classes UP-TO-DATE
> Task :sdks:java:io:google-cloud-platform:jar
> Task :sdks:java:harness:shadowJar
> Task :runners:java-fn-execution:compileJava FROM-CACHE
> Task :runners:java-fn-execution:classes UP-TO-DATE
> Task :runners:java-fn-execution:jar
> Task :runners:direct-java:compileJava FROM-CACHE
> Task :runners:direct-java:classes UP-TO-DATE
> Task :runners:direct-java:jar
> Task :runners:direct-java:shadowJar
> Task :sdks:java:extensions:sql:compileJava FROM-CACHE
> Task :sdks:java:extensions:sql:classes
> Task :sdks:java:extensions:sql:jar
> Task :sdks:java:testing:nexmark:compileJava FROM-CACHE
> Task :sdks:java:testing:nexmark:classes
> Task :sdks:java:testing:nexmark:jar

> Task :runners:flink:1.9:compileJava
Note: Some input files use or override a deprecated API.
Note: Recompile with -Xlint:deprecation for details.
Note: Some input files use unchecked or unsafe operations.
Note: Recompile with -Xlint:unchecked for details.

> Task :runners:flink:1.9:classes
> Task :runners:flink:1.9:jar

> Task :sdks:java:testing:nexmark:run
SLF4J: Failed to load class "org.slf4j.impl.StaticLoggerBinder".
SLF4J: Defaulting to no-operation (NOP) logger implementation
SLF4J: See http://www.slf4j.org/codes.html#StaticLoggerBinder for further details.
2019-11-05T01:13:47.167Z Running query:PASSTHROUGH; exportSummaryToBigQuery:true; streamTimeout:60
2019-11-05T01:13:47.362Z Running query:CURRENCY_CONVERSION; exportSummaryToBigQuery:true;
streamTimeout:60
2019-11-05T01:13:47.366Z Running query:SELECTION; exportSummaryToBigQuery:true; streamTimeout:60
2019-11-05T01:13:47.369Z Running query:LOCAL_ITEM_SUGGESTION; exportSummaryToBigQuery:true;
streamTimeout:60
2019-11-05T01:13:47.373Z Running query:AVERAGE_PRICE_FOR_CATEGORY; exportSummaryToBigQuery:true;
numEvents:10000; streamTimeout:60
2019-11-05T01:13:47.376Z Running query:HOT_ITEMS; exportSummaryToBigQuery:true; streamTimeout:60
2019-11-05T01:13:47.380Z Running query:AVERAGE_SELLING_PRICE_BY_SELLER; exportSummaryToBigQuery:true;
numEvents:10000; streamTimeout:60
2019-11-05T01:13:47.383Z Running query:HIGHEST_BID; exportSummaryToBigQuery:true; streamTimeout:60
2019-11-05T01:13:47.385Z Running query:MONITOR_NEW_USERS; exportSummaryToBigQuery:true; streamTimeout:60
2019-11-05T01:13:47.389Z Running query:WINNING_BIDS; exportSummaryToBigQuery:true; numEvents:10000;
streamTimeout:60
2019-11-05T01:13:47.392Z Running query:LOG_TO_SHARDED_FILES; exportSummaryToBigQuery:true;
streamTimeout:60
2019-11-05T01:13:47.395Z Running query:USER_SESSIONS; exportSummaryToBigQuery:true; streamTimeout:60
2019-11-05T01:13:47.398Z Running query:PROCESSING_TIME_WINDOWS; exportSummaryToBigQuery:true;
streamTimeout:60
2019-11-05T01:13:47.402Z Running query:BOUNDED_SIDE_INPUT_JOIN; exportSummaryToBigQuery:true;
streamTimeout:60
2019-11-05T01:13:47.405Z Running query:SESSION_SIDE_INPUT_JOIN; exportSummaryToBigQuery:true;
streamTimeout:60

==========================================================================================
Run started 2019-11-05T01:13:46.931Z and ran for PT0.432S

Default configuration:
Exception in thread "main" {"debug":true,"query":null,"sourceType":"DIRECT","sinkType":"DEVNULL","exportSummaryToBigQuery":false,"pubSubMode":"COMBINED","sideInputType":"DIRECT","sideInputRowCount":500,"sideInputNumShards":3,"sideInputUrl":null,"sessionGap":{"standardDays":0,"standardHours":0,"standardMinutes":10,"standardSeconds":600,"millis":600000},"numEvents":100000,"numEventGenerators":100,"rateShape":"SINE","firstEventRate":10000,"nextEventRate":10000,"rateUnit":"PER_SECOND","ratePeriodSec":600,"preloadSeconds":0,"streamTimeout":240,"isRateLimited":false,"useWallclockEventTime":false,"avgPersonByteSize":200,"avgAuctionByteSize":500,"avgBidByteSize":100,"hotAuctionRatio":2,"hotSellersRatio":4,"hotBiddersRatio":4,"windowSizeSec":10,"windowPeriodSec":5,"watermarkHoldbackSec":0,"numInFlightAuctions":100,"numActivePeople":1000,"coderStrategy":"HAND","cpuDelayMs":0,"diskBusyBytes":0,"auctionSkip":123,"fanout":5,"maxAuctionsWaitingTime":600,"occasionalDelaySec":3,"probDelayedEvent":0.1,"maxLogEvents":100000,"usePubsubPublishTime":false,"outOfOrderGroupSize":1}

Configurations:
  Conf  Description
  0000  query:PASSTHROUGH; exportSummaryToBigQuery:true; streamTimeout:60
  0001  query:CURRENCY_CONVERSION; exportSummaryToBigQuery:true; streamTimeout:60
  0002  query:SELECTION; exportSummaryToBigQuery:true; streamTimeout:60
  0003  query:LOCAL_ITEM_SUGGESTION; exportSummaryToBigQuery:true; streamTimeout:60
  0004  query:AVERAGE_PRICE_FOR_CATEGORY; exportSummaryToBigQuery:true; numEvents:10000; streamTimeout:60
  0005  query:HOT_ITEMS; exportSummaryToBigQuery:true; streamTimeout:60
  0006  query:AVERAGE_SELLING_PRICE_BY_SELLER; exportSummaryToBigQuery:true; numEvents:10000;
streamTimeout:60
  0007  query:HIGHEST_BID; exportSummaryToBigQuery:true; streamTimeout:60
  0008  query:MONITOR_NEW_USERS; exportSummaryToBigQuery:true; streamTimeout:60
  0009  query:WINNING_BIDS; exportSummaryToBigQuery:true; numEvents:10000; streamTimeout:60
java.lang.RuntimeException: java.lang.RuntimeException: Failed to construct instance from
factory method DirectRunner#fromOptions(interface org.apache.beam.sdk.options.PipelineOptions)
  0010  query:LOG_TO_SHARDED_FILES; exportSummaryToBigQuery:true; streamTimeout:60
	at org.apache.beam.sdk.nexmark.Main.runAll(Main.java:128)
  0011  query:USER_SESSIONS; exportSummaryToBigQuery:true; streamTimeout:60
  0012  query:PROCESSING_TIME_WINDOWS; exportSummaryToBigQuery:true; streamTimeout:60
	at org.apache.beam.sdk.nexmark.Main.main(Main.java:415)
  0013  query:BOUNDED_SIDE_INPUT_JOIN; exportSummaryToBigQuery:true; streamTimeout:60
  0014  query:SESSION_SIDE_INPUT_JOIN; exportSummaryToBigQuery:true; streamTimeout:60

Performance:
  Conf  Runtime(sec)    (Baseline)  Events(/sec)    (Baseline)       Results    (Baseline)
  0000  *** not run ***
  0001  *** not run ***
  0002  *** not run ***
  0003  *** not run ***
  0004  *** not run ***
  0005  *** not run ***
  0006  *** not run ***
Caused by: java.lang.RuntimeException: Failed to construct instance from factory method DirectRunner#fromOptions(interface
org.apache.beam.sdk.options.PipelineOptions)
  0007  *** not run ***
  0008  *** not run ***
  0009  *** not run ***
  0010  *** not run ***
  0011  *** not run ***
  0012  *** not run ***
  0013  *** not run ***
  0014  *** not run ***
	at org.apache.beam.sdk.util.InstanceBuilder.buildFromMethod(InstanceBuilder.java:224)
	at org.apache.beam.sdk.util.InstanceBuilder.build(InstanceBuilder.java:155)
	at org.apache.beam.sdk.PipelineRunner.fromOptions(PipelineRunner.java:55)
	at org.apache.beam.sdk.Pipeline.create(Pipeline.java:147)
	at org.apache.beam.sdk.nexmark.NexmarkLauncher.run(NexmarkLauncher.java:1125)
	at org.apache.beam.sdk.nexmark.Main$Run.call(Main.java:90)
	at org.apache.beam.sdk.nexmark.Main$Run.call(Main.java:79)
	at java.util.concurrent.FutureTask.run(FutureTask.java:266)
	at java.util.concurrent.Executors$RunnableAdapter.call(Executors.java:511)
	at java.util.concurrent.FutureTask.run(FutureTask.java:266)
==========================================================================================

	at java.util.concurrent.ThreadPoolExecutor.runWorker(ThreadPoolExecutor.java:1149)
	at java.util.concurrent.ThreadPoolExecutor$Worker.run(ThreadPoolExecutor.java:624)
	at java.lang.Thread.run(Thread.java:748)
Caused by: java.lang.reflect.InvocationTargetException
	at sun.reflect.NativeMethodAccessorImpl.invoke0(Native Method)
	at sun.reflect.NativeMethodAccessorImpl.invoke(NativeMethodAccessorImpl.java:62)
	at sun.reflect.DelegatingMethodAccessorImpl.invoke(DelegatingMethodAccessorImpl.java:43)
	at java.lang.reflect.Method.invoke(Method.java:498)
	at org.apache.beam.sdk.util.InstanceBuilder.buildFromMethod(InstanceBuilder.java:214)
	... 12 more
Caused by: java.lang.ExceptionInInitializerError
	at org.apache.beam.runners.core.construction.PTransformTranslation.loadKnownTranslators(PTransformTranslation.java:130)
	at org.apache.beam.runners.core.construction.PTransformTranslation.<clinit>(PTransformTranslation.java:125)
	at org.apache.beam.runners.direct.DirectRunner$Enforcement.<clinit>(DirectRunner.java:87)
	at org.apache.beam.runners.direct.DirectRunner.<init>(DirectRunner.java:147)
	at org.apache.beam.runners.direct.DirectRunner.fromOptions(DirectRunner.java:142)
	... 17 more
Caused by: java.lang.IllegalArgumentException: Classes already registered: class org.apache.beam.runners.core.SplittableParDoViaKeyedWorkItems$ProcessElements
	at org.apache.beam.runners.core.construction.PTransformTranslation$KnownTransformPayloadTranslator.loadTransformPayloadTranslators(PTransformTranslation.java:311)
	at org.apache.beam.runners.core.construction.PTransformTranslation$KnownTransformPayloadTranslator.<clinit>(PTransformTranslation.java:293)
	... 22 more

> Task :sdks:java:testing:nexmark:run FAILED

FAILURE: Build failed with an exception.

* What went wrong:
Execution failed for task ':sdks:java:testing:nexmark:run'.
> Process 'command '/usr/lib/jvm/java-8-openjdk-amd64/bin/java'' finished with non-zero
exit value 1

* Try:
Run with --stacktrace option to get the stack trace. Run with --info or --debug option to
get more log output. Run with --scan to get full insights.

* Get more help at https://help.gradle.org

Deprecated Gradle features were used in this build, making it incompatible with Gradle 6.0.
Use '--warning-mode all' to show the individual deprecation warnings.
See https://docs.gradle.org/5.2.1/userguide/command_line_interface.html#sec:command_line_warnings

BUILD FAILED in 47s
76 actionable tasks: 53 executed, 23 from cache

Publishing build scan...
https://gradle.com/s/kfnsewcfzazlq

Build step 'Invoke Gradle script' changed build result to FAILURE
Build step 'Invoke Gradle script' marked build as failure

---------------------------------------------------------------------
To unsubscribe, e-mail: builds-unsubscribe@beam.apache.org
For additional commands, e-mail: builds-help@beam.apache.org


Mime
View raw message