beam-builds mailing list archives

Site index · List index
Message view « Date » · « Thread »
Top « Date » · « Thread »
From Apache Jenkins Server <jenk...@builds.apache.org>
Subject Build failed in Jenkins: beam_PreCommit_Portable_Python_Cron #1349
Date Tue, 05 Nov 2019 00:21:58 GMT
See <https://builds.apache.org/job/beam_PreCommit_Portable_Python_Cron/1349/display/redirect?page=changes>

Changes:

[kcweaver] [BEAM-8516] only consider current version in sdist build

[kamil.wasilewski] [BEAM-8526] Turn on metrics publishing in load testsĀ on Flink

[robertwb] [BEAM-8544] Use ccache for compiling the Beam Python SDK.

[robertwb] Align base image requirements with Beam's setup.py.

[robertwb] Additional logging.

[robertwb] [BEAM-8532] Output timestamp should be the inclusive, not exclusive, end

[yoshiki.obata] update trigger phrase for beam_PreCommit_Website_Stage_GCS in README

[github] [BEAM-8368] [BEAM-8392] Update pyarrow to the latest version 0.15.1


------------------------------------------
[...truncated 54.76 KB...]
Resolving github.com/cpuguy83/go-md2man: commit='dc9f53734905c233adfc09fd4f063dce63ce3daf',
urls=[https://github.com/cpuguy83/go-md2man.git, git@github.com:cpuguy83/go-md2man.git]
Resolving cached github.com/cpuguy83/go-md2man: commit='dc9f53734905c233adfc09fd4f063dce63ce3daf',
urls=[https://github.com/cpuguy83/go-md2man.git, git@github.com:cpuguy83/go-md2man.git]
Resolving cached github.com/coreos/etcd: commit='11214aa33bf5a47d3d9d8dafe0f6b97237dfe921',
urls=[https://github.com/coreos/etcd.git, git@github.com:coreos/etcd.git]
Resolving cached github.com/coreos/etcd: commit='11214aa33bf5a47d3d9d8dafe0f6b97237dfe921',
urls=[https://github.com/coreos/etcd.git, git@github.com:coreos/etcd.git]
Resolving github.com/spf13/afero: commit='bb8f1927f2a9d3ab41c9340aa034f6b803f4359c', urls=[https://github.com/spf13/afero.git,
git@github.com:spf13/afero.git]
Resolving github.com/spf13/cast: commit='acbeb36b902d72a7a4c18e8f3241075e7ab763e4', urls=[https://github.com/spf13/cast.git,
git@github.com:spf13/cast.git]
Resolving github.com/spf13/cobra: commit='93959269ad99e80983c9ba742a7e01203a4c0e4f', urls=[https://github.com/spf13/cobra.git,
git@github.com:spf13/cobra.git]
Resolving github.com/spf13/jwalterweatherman: commit='7c0cea34c8ece3fbeb2b27ab9b59511d360fb394',
urls=[https://github.com/spf13/jwalterweatherman.git, git@github.com:spf13/jwalterweatherman.git]
Resolving cached github.com/coreos/etcd: commit='11214aa33bf5a47d3d9d8dafe0f6b97237dfe921',
urls=[https://github.com/coreos/etcd.git, git@github.com:coreos/etcd.git]
Resolving github.com/spf13/viper: commit='aafc9e6bc7b7bb53ddaa75a5ef49a17d6e654be5', urls=[https://github.com/spf13/viper.git,
git@github.com:spf13/viper.git]
Resolving github.com/stathat/go: commit='74669b9f388d9d788c97399a0824adbfee78400e', urls=[https://github.com/stathat/go.git,
git@github.com:stathat/go.git]
Resolving cached github.com/coreos/etcd: commit='11214aa33bf5a47d3d9d8dafe0f6b97237dfe921',
urls=[https://github.com/coreos/etcd.git, git@github.com:coreos/etcd.git]
Resolving cached github.com/coreos/etcd: commit='11214aa33bf5a47d3d9d8dafe0f6b97237dfe921',
urls=[https://github.com/coreos/etcd.git, git@github.com:coreos/etcd.git]
Resolving cached github.com/coreos/etcd: commit='11214aa33bf5a47d3d9d8dafe0f6b97237dfe921',
urls=[https://github.com/coreos/etcd.git, git@github.com:coreos/etcd.git]
Resolving cached github.com/coreos/etcd: commit='11214aa33bf5a47d3d9d8dafe0f6b97237dfe921',
urls=[https://github.com/coreos/etcd.git, git@github.com:coreos/etcd.git]
Resolving github.com/xordataexchange/crypt: commit='b2862e3d0a775f18c7cfe02273500ae307b61218',
urls=[https://github.com/xordataexchange/crypt.git, git@github.com:xordataexchange/crypt.git]
Resolving go.opencensus.io: commit='aa2b39d1618ef56ba156f27cfcdae9042f68f0bc', urls=[https://github.com/census-instrumentation/opencensus-go]

> Task :sdks:python:test-suites:portable:py2:installGcpTest FAILED
DEPRECATION: Python 2.7 will reach the end of its life on January 1st, 2020. Please upgrade
your Python as Python 2.7 won't be maintained after that date. A future version of pip will
drop support for Python 2.7. More details about Python 2 support in pip, can be found at https://pip.pypa.io/en/latest/development/release-process/#python-2-support
Obtaining file://<https://builds.apache.org/job/beam_PreCommit_Portable_Python_Cron/ws/src/sdks/python>
    ERROR: Command errored out with exit status 1:
     command: <https://builds.apache.org/job/beam_PreCommit_Portable_Python_Cron/ws/src/build/gradleenv/1866363813/bin/python2.7>
-c 'import sys, setuptools, tokenize; sys.argv[0] = '"'"'<https://builds.apache.org/job/beam_PreCommit_Portable_Python_Cron/ws/src/sdks/python/setup.py'"'"';>
__file__='"'"'<https://builds.apache.org/job/beam_PreCommit_Portable_Python_Cron/ws/src/sdks/python/setup.py'"'"';f=getattr(tokenize,>
'"'"'open'"'"', open)(__file__);code=f.read().replace('"'"'\r\n'"'"', '"'"'\n'"'"');f.close();exec(compile(code,
__file__, '"'"'exec'"'"'))' egg_info
         cwd: <https://builds.apache.org/job/beam_PreCommit_Portable_Python_Cron/ws/src/sdks/python/>
    Complete output (39 lines):
    <https://builds.apache.org/job/beam_PreCommit_Portable_Python_Cron/ws/src/sdks/python/setup.py>:197:
UserWarning: You are using Apache Beam with Python 2. New releases of Apache Beam will soon
support Python 3 only.
      'You are using Apache Beam with Python 2. '
    Traceback (most recent call last):
      File "<string>", line 1, in <module>
      File "<https://builds.apache.org/job/beam_PreCommit_Portable_Python_Cron/ws/src/sdks/python/setup.py",>
line 259, in <module>
        'test': generate_protos_first(test),
      File "<https://builds.apache.org/job/beam_PreCommit_Portable_Python_Cron/ws/src/build/gradleenv/1866363813/local/lib/python2.7/site-packages/setuptools/__init__.py",>
line 144, in setup
        _install_setup_requires(attrs)
      File "<https://builds.apache.org/job/beam_PreCommit_Portable_Python_Cron/ws/src/build/gradleenv/1866363813/local/lib/python2.7/site-packages/setuptools/__init__.py",>
line 139, in _install_setup_requires
        dist.fetch_build_eggs(dist.setup_requires)
      File "<https://builds.apache.org/job/beam_PreCommit_Portable_Python_Cron/ws/src/build/gradleenv/1866363813/local/lib/python2.7/site-packages/setuptools/dist.py",>
line 720, in fetch_build_eggs
        replace_conflicting=True,
      File "<https://builds.apache.org/job/beam_PreCommit_Portable_Python_Cron/ws/src/build/gradleenv/1866363813/local/lib/python2.7/site-packages/pkg_resources/__init__.py",>
line 782, in resolve
        replace_conflicting=replace_conflicting
      File "<https://builds.apache.org/job/beam_PreCommit_Portable_Python_Cron/ws/src/build/gradleenv/1866363813/local/lib/python2.7/site-packages/pkg_resources/__init__.py",>
line 1065, in best_match
        return self.obtain(req, installer)
      File "<https://builds.apache.org/job/beam_PreCommit_Portable_Python_Cron/ws/src/build/gradleenv/1866363813/local/lib/python2.7/site-packages/pkg_resources/__init__.py",>
line 1077, in obtain
        return installer(requirement)
      File "<https://builds.apache.org/job/beam_PreCommit_Portable_Python_Cron/ws/src/build/gradleenv/1866363813/local/lib/python2.7/site-packages/setuptools/dist.py",>
line 787, in fetch_build_egg
        return cmd.easy_install(req)
      File "<https://builds.apache.org/job/beam_PreCommit_Portable_Python_Cron/ws/src/build/gradleenv/1866363813/local/lib/python2.7/site-packages/setuptools/command/easy_install.py",>
line 679, in easy_install
        return self.install_item(spec, dist.location, tmpdir, deps)
      File "<https://builds.apache.org/job/beam_PreCommit_Portable_Python_Cron/ws/src/build/gradleenv/1866363813/local/lib/python2.7/site-packages/setuptools/command/easy_install.py",>
line 705, in install_item
        dists = self.install_eggs(spec, download, tmpdir)
      File "<https://builds.apache.org/job/beam_PreCommit_Portable_Python_Cron/ws/src/build/gradleenv/1866363813/local/lib/python2.7/site-packages/setuptools/command/easy_install.py",>
line 855, in install_eggs
        return [self.install_wheel(dist_filename, tmpdir)]
      File "<https://builds.apache.org/job/beam_PreCommit_Portable_Python_Cron/ws/src/build/gradleenv/1866363813/local/lib/python2.7/site-packages/setuptools/command/easy_install.py",>
line 1073, in install_wheel
        os.path.dirname(destination)
      File "/usr/lib/python2.7/distutils/cmd.py", line 349, in execute
        util.execute(func, args, msg, dry_run=self.dry_run)
      File "/usr/lib/python2.7/distutils/util.py", line 309, in execute
        func(*args)
      File "<https://builds.apache.org/job/beam_PreCommit_Portable_Python_Cron/ws/src/build/gradleenv/1866363813/local/lib/python2.7/site-packages/setuptools/wheel.py",>
line 101, in install_as_egg
        self._install_as_egg(destination_eggdir, zf)
      File "<https://builds.apache.org/job/beam_PreCommit_Portable_Python_Cron/ws/src/build/gradleenv/1866363813/local/lib/python2.7/site-packages/setuptools/wheel.py",>
line 109, in _install_as_egg
        self._convert_metadata(zf, destination_eggdir, dist_info, egg_info)
      File "<https://builds.apache.org/job/beam_PreCommit_Portable_Python_Cron/ws/src/build/gradleenv/1866363813/local/lib/python2.7/site-packages/setuptools/wheel.py",>
line 130, in _convert_metadata
        os.mkdir(destination_eggdir)
    OSError: [Errno 17] File exists: '<https://builds.apache.org/job/beam_PreCommit_Portable_Python_Cron/ws/src/sdks/python/.eggs/pytest_runner-5.2-py2.7.egg'>
    ----------------------------------------
ERROR: Command errored out with exit status 1: python setup.py egg_info Check the logs for
full command output.

> Task :sdks:python:sdist
setup.py:197: UserWarning: You are using Apache Beam with Python 2. New releases of Apache
Beam will soon support Python 3 only.
  'You are using Apache Beam with Python 2. '
<https://builds.apache.org/job/beam_PreCommit_Portable_Python_Cron/ws/src/build/gradleenv/1922375555/local/lib/python2.7/site-packages/setuptools/dist.py>:475:
UserWarning: Normalizing '2.18.0.dev' to '2.18.0.dev0'
  normalized_version,
beam_fn_api.proto: warning: Import google/protobuf/descriptor.proto but not used.
beam_fn_api.proto: warning: Import google/protobuf/wrappers.proto but not used.
DEPRECATION: Python 2.7 will reach the end of its life on January 1st, 2020. Please upgrade
your Python as Python 2.7 won't be maintained after that date. A future version of pip will
drop support for Python 2.7. More details about Python 2 support in pip, can be found at https://pip.pypa.io/en/latest/development/release-process/#python-2-support
Processing /home/jenkins/.cache/pip/wheels/bf/c9/a3/c538d90ef17cf7823fa51fc701a7a7a910a80f6a405bf15b1a/future-0.16.0-cp27-none-any.whl
Installing collected packages: future
Successfully installed future-0.16.0
root: Generating grammar tables from /usr/lib/python2.7/lib2to3/PatternGrammar.txt
root: Generating grammar tables from /usr/lib/python2.7/lib2to3/PatternGrammar.txt
root: Generating grammar tables from /usr/lib/python2.7/lib2to3/PatternGrammar.txt
root: Generating grammar tables from /usr/lib/python2.7/lib2to3/PatternGrammar.txt
root: Generating grammar tables from /usr/lib/python2.7/lib2to3/PatternGrammar.txt
root: Generating grammar tables from /usr/lib/python2.7/lib2to3/PatternGrammar.txt
root: Generating grammar tables from /usr/lib/python2.7/lib2to3/PatternGrammar.txt
root: Generating grammar tables from /usr/lib/python2.7/lib2to3/PatternGrammar.txt
root: Generating grammar tables from /usr/lib/python2.7/lib2to3/PatternGrammar.txt
root: Generating grammar tables from /usr/lib/python2.7/lib2to3/PatternGrammar.txt
root: Generating grammar tables from /usr/lib/python2.7/lib2to3/PatternGrammar.txt
root: Generating grammar tables from /usr/lib/python2.7/lib2to3/PatternGrammar.txt
RefactoringTool: Skipping optional fixer: idioms
root: Generating grammar tables from /usr/lib/python2.7/lib2to3/PatternGrammar.txt
root: Generating grammar tables from /usr/lib/python2.7/lib2to3/PatternGrammar.txt
root: Generating grammar tables from /usr/lib/python2.7/lib2to3/PatternGrammar.txt
root: Generating grammar tables from /usr/lib/python2.7/lib2to3/PatternGrammar.txt
root: Generating grammar tables from /usr/lib/python2.7/lib2to3/PatternGrammar.txt
root: Generating grammar tables from /usr/lib/python2.7/lib2to3/PatternGrammar.txt
root: Generating grammar tables from /usr/lib/python2.7/lib2to3/PatternGrammar.txt
root: Generating grammar tables from /usr/lib/python2.7/lib2to3/PatternGrammar.txt
root: Generating grammar tables from /usr/lib/python2.7/lib2to3/PatternGrammar.txt
root: Generating grammar tables from /usr/lib/python2.7/lib2to3/PatternGrammar.txt
root: Generating grammar tables from /usr/lib/python2.7/lib2to3/PatternGrammar.txt
root: Generating grammar tables from /usr/lib/python2.7/lib2to3/PatternGrammar.txt
root: Generating grammar tables from /usr/lib/python2.7/lib2to3/PatternGrammar.txt
root: Generating grammar tables from /usr/lib/python2.7/lib2to3/PatternGrammar.txt
root: Generating grammar tables from /usr/lib/python2.7/lib2to3/PatternGrammar.txt
root: Generating grammar tables from /usr/lib/python2.7/lib2to3/PatternGrammar.txt
root: Generating grammar tables from /usr/lib/python2.7/lib2to3/PatternGrammar.txt
root: Generating grammar tables from /usr/lib/python2.7/lib2to3/PatternGrammar.txt
root: Generating grammar tables from /usr/lib/python2.7/lib2to3/PatternGrammar.txt
root: Generating grammar tables from /usr/lib/python2.7/lib2to3/PatternGrammar.txt
root: Generating grammar tables from /usr/lib/python2.7/lib2to3/PatternGrammar.txt
root: Generating grammar tables from /usr/lib/python2.7/lib2to3/PatternGrammar.txt
root: Generating grammar tables from /usr/lib/python2.7/lib2to3/PatternGrammar.txt
RefactoringTool: Skipping optional fixer: ws_comma
root: Generating grammar tables from /usr/lib/python2.7/lib2to3/PatternGrammar.txt
root: Generating grammar tables from /usr/lib/python2.7/lib2to3/PatternGrammar.txt
root: Generating grammar tables from /usr/lib/python2.7/lib2to3/PatternGrammar.txt
root: Generating grammar tables from /usr/lib/python2.7/lib2to3/PatternGrammar.txt
root: Generating grammar tables from /usr/lib/python2.7/lib2to3/PatternGrammar.txt
root: Generating grammar tables from /usr/lib/python2.7/lib2to3/PatternGrammar.txt
root: Generating grammar tables from /usr/lib/python2.7/lib2to3/PatternGrammar.txt
root: Generating grammar tables from /usr/lib/python2.7/lib2to3/PatternGrammar.txt
root: Generating grammar tables from /usr/lib/python2.7/lib2to3/PatternGrammar.txt
root: Generating grammar tables from /usr/lib/python2.7/lib2to3/PatternGrammar.txt
root: Generating grammar tables from /usr/lib/python2.7/lib2to3/PatternGrammar.txt
root: Generating grammar tables from /usr/lib/python2.7/lib2to3/PatternGrammar.txt
root: Generating grammar tables from /usr/lib/python2.7/lib2to3/PatternGrammar.txt
root: Generating grammar tables from /usr/lib/python2.7/lib2to3/PatternGrammar.txt
root: Generating grammar tables from /usr/lib/python2.7/lib2to3/PatternGrammar.txt
root: Generating grammar tables from /usr/lib/python2.7/lib2to3/PatternGrammar.txt
root: Generating grammar tables from /usr/lib/python2.7/lib2to3/PatternGrammar.txt
root: Generating grammar tables from /usr/lib/python2.7/lib2to3/PatternGrammar.txt
root: Generating grammar tables from /usr/lib/python2.7/lib2to3/PatternGrammar.txt
root: Generating grammar tables from /usr/lib/python2.7/lib2to3/PatternGrammar.txt
root: Generating grammar tables from /usr/lib/python2.7/lib2to3/PatternGrammar.txt
RefactoringTool: No changes to <https://builds.apache.org/job/beam_PreCommit_Portable_Python_Cron/ws/src/sdks/python/apache_beam/portability/api/beam_artifact_api_pb2.py>
RefactoringTool: Refactored <https://builds.apache.org/job/beam_PreCommit_Portable_Python_Cron/ws/src/sdks/python/apache_beam/portability/api/beam_artifact_api_pb2_grpc.py>
RefactoringTool: Refactored <https://builds.apache.org/job/beam_PreCommit_Portable_Python_Cron/ws/src/sdks/python/apache_beam/portability/api/beam_expansion_api_pb2.py>
RefactoringTool: Refactored <https://builds.apache.org/job/beam_PreCommit_Portable_Python_Cron/ws/src/sdks/python/apache_beam/portability/api/beam_expansion_api_pb2_grpc.py>
RefactoringTool: Refactored <https://builds.apache.org/job/beam_PreCommit_Portable_Python_Cron/ws/src/sdks/python/apache_beam/portability/api/beam_fn_api_pb2.py>
RefactoringTool: Refactored <https://builds.apache.org/job/beam_PreCommit_Portable_Python_Cron/ws/src/sdks/python/apache_beam/portability/api/beam_fn_api_pb2_grpc.py>
RefactoringTool: Refactored <https://builds.apache.org/job/beam_PreCommit_Portable_Python_Cron/ws/src/sdks/python/apache_beam/portability/api/beam_job_api_pb2.py>
RefactoringTool: Refactored <https://builds.apache.org/job/beam_PreCommit_Portable_Python_Cron/ws/src/sdks/python/apache_beam/portability/api/beam_job_api_pb2_grpc.py>
RefactoringTool: No changes to <https://builds.apache.org/job/beam_PreCommit_Portable_Python_Cron/ws/src/sdks/python/apache_beam/portability/api/beam_provision_api_pb2.py>
RefactoringTool: Refactored <https://builds.apache.org/job/beam_PreCommit_Portable_Python_Cron/ws/src/sdks/python/apache_beam/portability/api/beam_provision_api_pb2_grpc.py>
RefactoringTool: Refactored <https://builds.apache.org/job/beam_PreCommit_Portable_Python_Cron/ws/src/sdks/python/apache_beam/portability/api/beam_runner_api_pb2.py>
RefactoringTool: No changes to <https://builds.apache.org/job/beam_PreCommit_Portable_Python_Cron/ws/src/sdks/python/apache_beam/portability/api/endpoints_pb2.py>
RefactoringTool: Refactored <https://builds.apache.org/job/beam_PreCommit_Portable_Python_Cron/ws/src/sdks/python/apache_beam/portability/api/external_transforms_pb2.py>
RefactoringTool: Refactored <https://builds.apache.org/job/beam_PreCommit_Portable_Python_Cron/ws/src/sdks/python/apache_beam/portability/api/metrics_pb2.py>
RefactoringTool: No changes to <https://builds.apache.org/job/beam_PreCommit_Portable_Python_Cron/ws/src/sdks/python/apache_beam/portability/api/schema_pb2.py>
RefactoringTool: Refactored <https://builds.apache.org/job/beam_PreCommit_Portable_Python_Cron/ws/src/sdks/python/apache_beam/portability/api/standard_window_fns_pb2.py>
RefactoringTool: Files that were modified:
RefactoringTool: <https://builds.apache.org/job/beam_PreCommit_Portable_Python_Cron/ws/src/sdks/python/apache_beam/portability/api/beam_artifact_api_pb2.py>
RefactoringTool: <https://builds.apache.org/job/beam_PreCommit_Portable_Python_Cron/ws/src/sdks/python/apache_beam/portability/api/beam_artifact_api_pb2_grpc.py>
RefactoringTool: <https://builds.apache.org/job/beam_PreCommit_Portable_Python_Cron/ws/src/sdks/python/apache_beam/portability/api/beam_expansion_api_pb2.py>
RefactoringTool: <https://builds.apache.org/job/beam_PreCommit_Portable_Python_Cron/ws/src/sdks/python/apache_beam/portability/api/beam_expansion_api_pb2_grpc.py>
RefactoringTool: <https://builds.apache.org/job/beam_PreCommit_Portable_Python_Cron/ws/src/sdks/python/apache_beam/portability/api/beam_fn_api_pb2.py>
RefactoringTool: <https://builds.apache.org/job/beam_PreCommit_Portable_Python_Cron/ws/src/sdks/python/apache_beam/portability/api/beam_fn_api_pb2_grpc.py>
RefactoringTool: <https://builds.apache.org/job/beam_PreCommit_Portable_Python_Cron/ws/src/sdks/python/apache_beam/portability/api/beam_job_api_pb2.py>
RefactoringTool: <https://builds.apache.org/job/beam_PreCommit_Portable_Python_Cron/ws/src/sdks/python/apache_beam/portability/api/beam_job_api_pb2_grpc.py>
RefactoringTool: <https://builds.apache.org/job/beam_PreCommit_Portable_Python_Cron/ws/src/sdks/python/apache_beam/portability/api/beam_provision_api_pb2.py>
RefactoringTool: <https://builds.apache.org/job/beam_PreCommit_Portable_Python_Cron/ws/src/sdks/python/apache_beam/portability/api/beam_provision_api_pb2_grpc.py>
RefactoringTool: <https://builds.apache.org/job/beam_PreCommit_Portable_Python_Cron/ws/src/sdks/python/apache_beam/portability/api/beam_runner_api_pb2.py>
RefactoringTool: <https://builds.apache.org/job/beam_PreCommit_Portable_Python_Cron/ws/src/sdks/python/apache_beam/portability/api/endpoints_pb2.py>
RefactoringTool: <https://builds.apache.org/job/beam_PreCommit_Portable_Python_Cron/ws/src/sdks/python/apache_beam/portability/api/external_transforms_pb2.py>
RefactoringTool: <https://builds.apache.org/job/beam_PreCommit_Portable_Python_Cron/ws/src/sdks/python/apache_beam/portability/api/metrics_pb2.py>
RefactoringTool: <https://builds.apache.org/job/beam_PreCommit_Portable_Python_Cron/ws/src/sdks/python/apache_beam/portability/api/schema_pb2.py>
RefactoringTool: <https://builds.apache.org/job/beam_PreCommit_Portable_Python_Cron/ws/src/sdks/python/apache_beam/portability/api/standard_window_fns_pb2.py>
warning: no files found matching 'README.md'
warning: no files found matching 'NOTICE'
warning: no files found matching 'LICENSE'
warning: sdist: standard file not found: should have one of README, README.rst, README.txt,
README.md


> Task :sdks:java:harness:shadowJar

> Task :sdks:go:resolveBuildDependencies
Resolving golang.org/x/crypto: commit='d9133f5469342136e669e85192a26056b587f503', urls=[https://go.googlesource.com/crypto]
Resolving golang.org/x/debug: commit='95515998a8a4bd7448134b2cb5971dbeb12e0b77', urls=[https://go.googlesource.com/debug]
Resolving golang.org/x/net: commit='2fb46b16b8dda405028c50f7c7f0f9dd1fa6bfb1', urls=[https://go.googlesource.com/net]
Resolving golang.org/x/oauth2: commit='a032972e28060ca4f5644acffae3dfc268cc09db', urls=[https://go.googlesource.com/oauth2]
Resolving golang.org/x/sync: commit='fd80eb99c8f653c847d294a001bdf2a3a6f768f5', urls=[https://go.googlesource.com/sync]

> Task :sdks:python:container:py2:copyDockerfileDependencies

> Task :sdks:go:resolveBuildDependencies
Resolving golang.org/x/sys: commit='37707fdb30a5b38865cfb95e5aab41707daec7fd', urls=[https://go.googlesource.com/sys]
Resolving cached github.com/coreos/etcd: commit='11214aa33bf5a47d3d9d8dafe0f6b97237dfe921',
urls=[https://github.com/coreos/etcd.git, git@github.com:coreos/etcd.git]
Resolving cached github.com/coreos/etcd: commit='11214aa33bf5a47d3d9d8dafe0f6b97237dfe921',
urls=[https://github.com/coreos/etcd.git, git@github.com:coreos/etcd.git]

> Task :runners:java-fn-execution:compileJava FROM-CACHE
> Task :runners:java-fn-execution:classes UP-TO-DATE
> Task :runners:java-fn-execution:jar
> Task :runners:flink:1.9:compileJava FROM-CACHE
> Task :runners:flink:1.9:classes
> Task :runners:flink:1.9:jar
> Task :runners:flink:1.9:job-server:compileJava NO-SOURCE
> Task :runners:flink:1.9:job-server:classes UP-TO-DATE
> Task :runners:flink:1.9:job-server:shadowJar
> Task :runners:flink:1.9:job-server-container:copyDockerfileDependencies
> Task :runners:flink:1.9:job-server-container:dockerPrepare
> Task :runners:flink:1.9:job-server-container:docker

> Task :sdks:go:resolveBuildDependencies
Resolving google.golang.org/api: commit='386d4e5f4f92f86e6aec85985761bba4b938a2d5', urls=[https://code.googlesource.com/google-api-go-client]
Resolving google.golang.org/genproto: commit='2b5a72b8730b0b16380010cfe5286c42108d88e7', urls=[https://github.com/google/go-genproto]
Resolving google.golang.org/grpc: commit='7646b5360d049a7ca31e9133315db43456f39e2e', urls=[https://github.com/grpc/grpc-go]
Resolving cached github.com/coreos/etcd: commit='11214aa33bf5a47d3d9d8dafe0f6b97237dfe921',
urls=[https://github.com/coreos/etcd.git, git@github.com:coreos/etcd.git]
Resolving cached github.com/coreos/etcd: commit='11214aa33bf5a47d3d9d8dafe0f6b97237dfe921',
urls=[https://github.com/coreos/etcd.git, git@github.com:coreos/etcd.git]

> Task :sdks:go:installDependencies
> Task :sdks:go:buildLinuxAmd64
> Task :sdks:go:goBuild

> Task :sdks:python:container:resolveBuildDependencies
Resolving ./github.com/apache/beam/sdks/go@<https://builds.apache.org/job/beam_PreCommit_Portable_Python_Cron/ws/src/sdks/go>

> Task :sdks:python:container:installDependencies
> Task :sdks:python:container:buildDarwinAmd64
> Task :sdks:python:container:buildLinuxAmd64
> Task :sdks:python:container:goBuild
> Task :sdks:python:container:py2:copyLauncherDependencies
> Task :sdks:python:container:py2:dockerPrepare
> Task :sdks:python:container:py2:docker

FAILURE: Build failed with an exception.

* What went wrong:
Execution failed for task ':sdks:python:test-suites:portable:py2:installGcpTest'.
> Process 'command 'sh'' finished with non-zero exit value 1

* Try:
Run with --stacktrace option to get the stack trace. Run with --info or --debug option to
get more log output. Run with --scan to get full insights.

* Get more help at https://help.gradle.org

Deprecated Gradle features were used in this build, making it incompatible with Gradle 6.0.
Use '--warning-mode all' to show the individual deprecation warnings.
See https://docs.gradle.org/5.2.1/userguide/command_line_interface.html#sec:command_line_warnings

BUILD FAILED in 6m 10s
78 actionable tasks: 59 executed, 17 from cache, 2 up-to-date

Publishing build scan...
https://gradle.com/s/xuagha2dcsu3s

Build step 'Invoke Gradle script' changed build result to FAILURE
Build step 'Invoke Gradle script' marked build as failure

---------------------------------------------------------------------
To unsubscribe, e-mail: builds-unsubscribe@beam.apache.org
For additional commands, e-mail: builds-help@beam.apache.org


Mime
View raw message