beam-builds mailing list archives

Site index · List index
Message view « Date » · « Thread »
Top « Date » · « Thread »
From Apache Jenkins Server <jenk...@builds.apache.org>
Subject Build failed in Jenkins: beam_PostCommit_Go_VR_Flink #1492
Date Mon, 04 Nov 2019 12:02:28 GMT
See <https://builds.apache.org/job/beam_PostCommit_Go_VR_Flink/1492/display/redirect>

Changes:


------------------------------------------
[...truncated 38.79 KB...]
Resolving cached github.com/coreos/etcd: commit='11214aa33bf5a47d3d9d8dafe0f6b97237dfe921',
urls=[https://github.com/coreos/etcd.git, git@github.com:coreos/etcd.git]
Resolving github.com/xordataexchange/crypt: commit='b2862e3d0a775f18c7cfe02273500ae307b61218',
urls=[https://github.com/xordataexchange/crypt.git, git@github.com:xordataexchange/crypt.git]
Resolving go.opencensus.io: commit='aa2b39d1618ef56ba156f27cfcdae9042f68f0bc', urls=[https://github.com/census-instrumentation/opencensus-go]
Resolving golang.org/x/crypto: commit='d9133f5469342136e669e85192a26056b587f503', urls=[https://go.googlesource.com/crypto]
Resolving golang.org/x/debug: commit='95515998a8a4bd7448134b2cb5971dbeb12e0b77', urls=[https://go.googlesource.com/debug]
Resolving golang.org/x/net: commit='2fb46b16b8dda405028c50f7c7f0f9dd1fa6bfb1', urls=[https://go.googlesource.com/net]
Resolving golang.org/x/oauth2: commit='a032972e28060ca4f5644acffae3dfc268cc09db', urls=[https://go.googlesource.com/oauth2]
Resolving golang.org/x/sync: commit='fd80eb99c8f653c847d294a001bdf2a3a6f768f5', urls=[https://go.googlesource.com/sync]
Resolving golang.org/x/sys: commit='37707fdb30a5b38865cfb95e5aab41707daec7fd', urls=[https://go.googlesource.com/sys]
Resolving cached github.com/coreos/etcd: commit='11214aa33bf5a47d3d9d8dafe0f6b97237dfe921',
urls=[https://github.com/coreos/etcd.git, git@github.com:coreos/etcd.git]
Resolving cached github.com/coreos/etcd: commit='11214aa33bf5a47d3d9d8dafe0f6b97237dfe921',
urls=[https://github.com/coreos/etcd.git, git@github.com:coreos/etcd.git]

> Task :sdks:java:harness:shadowJar
> Task :runners:java-fn-execution:compileJava FROM-CACHE
> Task :runners:java-fn-execution:classes UP-TO-DATE
> Task :runners:java-fn-execution:jar
> Task :runners:flink:1.9:compileJava FROM-CACHE
> Task :runners:flink:1.9:classes
> Task :runners:flink:1.9:jar
> Task :runners:flink:1.9:job-server:compileJava NO-SOURCE
> Task :runners:flink:1.9:job-server:classes UP-TO-DATE
> Task :runners:flink:1.9:job-server:shadowJar

> Task :sdks:go:resolveBuildDependencies
Resolving google.golang.org/api: commit='386d4e5f4f92f86e6aec85985761bba4b938a2d5', urls=[https://code.googlesource.com/google-api-go-client]
Resolving google.golang.org/genproto: commit='2b5a72b8730b0b16380010cfe5286c42108d88e7', urls=[https://github.com/google/go-genproto]
Resolving google.golang.org/grpc: commit='7646b5360d049a7ca31e9133315db43456f39e2e', urls=[https://github.com/grpc/grpc-go]
Resolving cached github.com/coreos/etcd: commit='11214aa33bf5a47d3d9d8dafe0f6b97237dfe921',
urls=[https://github.com/coreos/etcd.git, git@github.com:coreos/etcd.git]
Resolving cached github.com/coreos/etcd: commit='11214aa33bf5a47d3d9d8dafe0f6b97237dfe921',
urls=[https://github.com/coreos/etcd.git, git@github.com:coreos/etcd.git]

> Task :sdks:go:installDependencies
> Task :sdks:go:buildLinuxAmd64
> Task :sdks:go:goBuild

> Task :sdks:go:test:resolveBuildDependencies
Resolving ./github.com/apache/beam/sdks/go@<https://builds.apache.org/job/beam_PostCommit_Go_VR_Flink/ws/src/sdks/go>

> Task :sdks:go:test:installDependencies
> Task :sdks:go:test:buildLinuxAmd64
> Task :sdks:go:test:goBuild

> Task :sdks:go:test:flinkValidatesRunner

RUNNER=dataflow

# Where to store integration test outputs.
GCS_LOCATION=gs://temp-storage-for-end-to-end-tests

# Project for the container and integration test
PROJECT=apache-beam-testing
DATAFLOW_PROJECT=apache-beam-testing

# Number of tests to run in parallel
PARALLEL=10

while [[ $# -gt 0 ]]
do
key="$1"
case $key in
    --runner)
        RUNNER="$2"
        shift # past argument
        shift # past value
        ;;
    --project)
        PROJECT="$2"
        shift # past argument
        shift # past value
        ;;
    --dataflow_project)
        DATAFLOW_PROJECT="$2"
        shift # past argument
        shift # past value
        ;;
/usr/bin/docker
    --gcs_location)
/usr/bin/gcloud
        GCS_LOCATION="$2"
        shift # past argument
        shift # past value
        ;;
    --dataflow_worker_jar)
        DATAFLOW_WORKER_JAR="$2"
        shift # past argument
        shift # past value
        ;;
    --flink_job_server_jar)
        FLINK_JOB_SERVER_JAR="$2"
        shift # past argument
        shift # past value
        ;;
    --spark_job_server_jar)
        SPARK_JOB_SERVER_JAR="$2"
        shift # past argument
        shift # past value
        ;;
    --endpoint)
        ENDPOINT="$2"
        shift # past argument
        shift # past value
        ;;
    --parallel)
        PARALLEL="$2"
        shift # past argument
        shift # past value
        ;;
    *)    # unknown option
        echo "Unknown option: $1"
        exit 1
        ;;
esac
done

# Go to the root of the repository
cd $(git rev-parse --show-toplevel)
git rev-parse --show-toplevel

# Verify in the root of the repository
test -d sdks/go/test

# Verify docker and gcloud commands exist
command -v docker
command -v gcloud
docker -v
Docker version 18.09.4, build d14af54
gcloud -v
Google Cloud SDK 212.0.0
alpha 2018.08.13
beta 2018.08.13
bq 2.0.34
core 2018.08.13
gsutil 4.33

# ensure gcloud is version 186 or above
TMPDIR=$(mktemp -d)
mktemp -d
gcloud_ver=$(gcloud -v | head -1 | awk '{print $4}')
gcloud -v | head -1 | awk '{print $4}'
if [[ "$gcloud_ver" < "186" ]]
then
  pushd $TMPDIR
  curl https://dl.google.com/dl/cloudsdk/channels/rapid/downloads/google-cloud-sdk-186.0.0-linux-x86_64.tar.gz
--output gcloud.tar.gz
  tar xf gcloud.tar.gz
  ./google-cloud-sdk/install.sh --quiet
  . ./google-cloud-sdk/path.bash.inc
  popd
  gcloud components update --quiet || echo 'gcloud components update failed'
  gcloud -v
fi

# Build the container
TAG=$(date +%Y%m%d-%H%M%S)
date +%Y%m%d-%H%M%S
CONTAINER=us.gcr.io/$PROJECT/$USER/go_sdk
Using container us.gcr.io/apache-beam-testing/jenkins/go_sdk
echo "Using container $CONTAINER"
./gradlew :sdks:go:container:docker -Pdocker-repository-root=us.gcr.io/$PROJECT/$USER -Pdocker-tag=$TAG
> Task :buildSrc:compileJava NO-SOURCE
> Task :buildSrc:compileGroovy UP-TO-DATE
> Task :buildSrc:pluginDescriptors UP-TO-DATE
> Task :buildSrc:processResources UP-TO-DATE
> Task :buildSrc:classes UP-TO-DATE
> Task :buildSrc:jar UP-TO-DATE
> Task :buildSrc:assemble UP-TO-DATE
> Task :buildSrc:spotlessGroovy UP-TO-DATE
> Task :buildSrc:spotlessGroovyCheck UP-TO-DATE
> Task :buildSrc:spotlessGroovyGradle UP-TO-DATE
> Task :buildSrc:spotlessGroovyGradleCheck UP-TO-DATE
> Task :buildSrc:spotlessCheck UP-TO-DATE
> Task :buildSrc:pluginUnderTestMetadata UP-TO-DATE
> Task :buildSrc:compileTestJava NO-SOURCE
> Task :buildSrc:compileTestGroovy NO-SOURCE
> Task :buildSrc:processTestResources NO-SOURCE
> Task :buildSrc:testClasses UP-TO-DATE
> Task :buildSrc:test NO-SOURCE
> Task :buildSrc:validateTaskProperties UP-TO-DATE
> Task :buildSrc:check UP-TO-DATE
> Task :buildSrc:build UP-TO-DATE
Configuration on demand is an incubating feature.
The message received from the daemon indicates that the daemon has disappeared.
Build request sent: Build{id=2babcb89-87ea-4a03-8d4b-bada6405e20f, currentDir=<https://builds.apache.org/job/beam_PostCommit_Go_VR_Flink/ws/src}>
Attempting to read last messages from the daemon log...
Daemon pid: 24351
  log file: /home/jenkins/.gradle/daemon/5.2.1/daemon-24351.out.log
----- Last  20 lines from daemon log file - daemon-24351.out.log -----
12:02:23.343 [DEBUG] [org.gradle.launcher.daemon.server.DefaultIncomingConnectionHandler]
Starting executing command: Build{id=2babcb89-87ea-4a03-8d4b-bada6405e20f, currentDir=<https://builds.apache.org/job/beam_PostCommit_Go_VR_Flink/ws/src}>
with connection: socket connection from /0:0:0:0:0:0:0:1:44731 to /0:0:0:0:0:0:0:1:39720.
12:02:23.343 [ERROR] [org.gradle.launcher.daemon.server.DaemonStateCoordinator] Command execution:
started DaemonCommandExecution[command = Build{id=2babcb89-87ea-4a03-8d4b-bada6405e20f, currentDir=<https://builds.apache.org/job/beam_PostCommit_Go_VR_Flink/ws/src},>
connection = DefaultDaemonConnection: socket connection from /0:0:0:0:0:0:0:1:44731 to /0:0:0:0:0:0:0:1:39720]
after 1.0 minutes of idle
12:02:23.343 [INFO] [org.gradle.launcher.daemon.server.DaemonRegistryUpdater] Marking the
daemon as busy, address: [871af5cd-b26f-432c-9ae7-44dfb21cb83f port:44731, addresses:[/0:0:0:0:0:0:0:1%lo,
/127.0.0.1]]
12:02:23.343 [DEBUG] [org.gradle.launcher.daemon.registry.PersistentDaemonRegistry] Marking
busy by address: [871af5cd-b26f-432c-9ae7-44dfb21cb83f port:44731, addresses:[/0:0:0:0:0:0:0:1%lo,
/127.0.0.1]]
12:02:23.344 [DEBUG] [org.gradle.cache.internal.DefaultFileLockManager] Waiting to acquire
exclusive lock on daemon addresses registry.
12:02:23.344 [DEBUG] [org.gradle.cache.internal.DefaultFileLockManager] Lock acquired on daemon
addresses registry.
12:02:23.345 [DEBUG] [org.gradle.cache.internal.DefaultFileLockManager] Releasing lock on
daemon addresses registry.
12:02:23.345 [DEBUG] [org.gradle.launcher.daemon.server.DaemonStateCoordinator] resetting
idle timer
12:02:23.345 [DEBUG] [org.gradle.launcher.daemon.server.DaemonStateCoordinator] daemon is
running. Sleeping until state changes.
12:02:23.345 [INFO] [org.gradle.launcher.daemon.server.exec.StartBuildOrRespondWithBusy] Daemon
is about to start building Build{id=2babcb89-87ea-4a03-8d4b-bada6405e20f, currentDir=<https://builds.apache.org/job/beam_PostCommit_Go_VR_Flink/ws/src}.>
Dispatching build started information...
12:02:23.345 [DEBUG] [org.gradle.launcher.daemon.server.SynchronizedDispatchConnection] thread
108: dispatching class org.gradle.launcher.daemon.protocol.BuildStarted
12:02:23.346 [DEBUG] [org.gradle.launcher.daemon.server.exec.EstablishBuildEnvironment] Configuring
env variables: {PATH=/home/jenkins/tools/java/latest1.8/bin:/usr/local/sbin:/usr/local/bin:/usr/sbin:/usr/bin:/sbin:/bin:/usr/games:/usr/local/games,
RUN_DISPLAY_URL=https://builds.apache.org/job/beam_PostCommit_Go_VR_Flink/1492/display/redirect,
HUDSON_HOME=/x1/jenkins/jenkins-home, RUN_CHANGES_DISPLAY_URL=https://builds.apache.org/job/beam_PostCommit_Go_VR_Flink/1492/display/redirect?page=changes,
JOB_URL=https://builds.apache.org/job/beam_PostCommit_Go_VR_Flink/, HUDSON_COOKIE=59209b79-d658-45c8-8849-b3e951292898,
NIX_LABEL=ubuntu, SLACK_WEBHOOK_URL=****, SUDO_USER=yifanzou, MAIL=/var/mail/jenkins, WIN_LABEL=Windows,
JENKINS_SERVER_COOKIE=f4ebd1e6b0d976e8, USERNAME=root, LOGNAME=jenkins, PWD=<https://builds.apache.org/job/beam_PostCommit_Go_VR_Flink/ws/src,>
JENKINS_URL=https://builds.apache.org/, SHELL=/bin/bash, BUILD_TAG=jenkins-beam_PostCommit_Go_VR_Flink-1492,
GIT_AUTHOR_EMAIL=builds@apache.org, LESSOPEN=| /usr/bin/lesspipe %s, ROOT_BUILD_CAUSE=TIMERTRIGGER,
BUILD_CAUSE_TIMERTRIGGER=true, GIT_AUTHOR_NAME=jenkins, OLDPWD=<https://builds.apache.org/job/beam_PostCommit_Go_VR_Flink/ws/src,>
JENKINS_HOME=/x1/jenkins/jenkins-home, sha1=master, NODE_NAME=apache-beam-jenkins-6, BUILD_DISPLAY_NAME=#1492,
JOB_DISPLAY_URL=https://builds.apache.org/job/beam_PostCommit_Go_VR_Flink/display/redirect,
GIT_BRANCH=origin/master, LS_COLORS=rs=0:di=01;34:ln=01;36:mh=00:pi=40;33:so=01;35:do=01;35:bd=40;33;01:cd=40;33;01:or=40;31;01:mi=00:su=37;41:sg=30;43:ca=30;41:tw=30;42:ow=34;42:st=37;44:ex=01;32:*.tar=01;31:*.tgz=01;31:*.arc=01;31:*.arj=01;31:*.taz=01;31:*.lha=01;31:*.lz4=01;31:*.lzh=01;31:*.lzma=01;31:*.tlz=01;31:*.txz=01;31:*.tzo=01;31:*.t7z=01;31:*.zip=01;31:*.z=01;31:*.Z=01;31:*.dz=01;31:*.gz=01;31:*.lrz=01;31:*.lz=01;31:*.lzo=01;31:*.xz=01;31:*.bz2=01;31:*.bz=01;31:*.tbz=01;31:*.tbz2=01;31:*.tz=01;31:*.deb=01;31:*.rpm=01;31:*.jar=01;31:*.war=01;31:*.ear=01;31:*.sar=01;31:*.rar=01;31:*.alz=01;31:*.ace=01;31:*.zoo=01;31:*.cpio=01;31:*.7z=01;31:*.rz=01;31:*.cab=01;31:*.jpg=01;35:*.jpeg=01;35:*.gif=01;35:*.bmp=01;35:*.pbm=01;35:*.pgm=01;35:*.ppm=01;35:*.tga=01;35:*.xbm=01;35:*.xpm=01;35:*.tif=01;35:*.tiff=01;35:*.png=01;35:*.svg=01;35:*.svgz=01;35:*.mng=01;35:*.pcx=01;35:*.mov=01;35:*.mpg=01;35:*.mpeg=01;35:*.m2v=01;35:*.mkv=01;35:*.webm=01;35:*.ogm=01;35:*.mp4=01;35:*.m4v=01;35:*.mp4v=01;35:*.vob=01;35:*.qt=01;35:*.nuv=01;35:*.wmv=01;35:*.asf=01;35:*.rm=01;35:*.rmvb=01;35:*.flc=01;35:*.avi=01;35:*.fli=01;35:*.flv=01;35:*.gl=01;35:*.dl=01;35:*.xcf=01;35:*.xwd=01;35:*.yuv=01;35:*.cgm=01;35:*.emf=01;35:*.ogv=01;35:*.ogx=01;35:*.aac=00;36:*.au=00;36:*.flac=00;36:*.m4a=00;36:*.mid=00;36:*.midi=00;36:*.mka=00;36:*.mp3=00;36:*.mpc=00;36:*.ogg=00;36:*.ra=00;36:*.wav=00;36:*.oga=00;36:*.opus=00;36:*.spx=00;36:*.xspf=00;36:,
SHLVL=2, GIT_PREVIOUS_COMMIT=1664ce2f84f6c4c0898c04ffe5e2be41c951ef85, LESSCLOSE=/usr/bin/lesspipe
%s %s, JAVA_HOME=/home/jenkins/tools/java/latest1.8, TERM=xterm-256color, BUILD_ID=1492, LANG=en_US.UTF-8,
JOB_NAME=beam_PostCommit_Go_VR_Flink, SPARK_LOCAL_IP=127.0.0.1, BUILD_CAUSE=TIMERTRIGGER,
SUDO_GID=1014, GIT_PREVIOUS_SUCCESSFUL_COMMIT=1664ce2f84f6c4c0898c04ffe5e2be41c951ef85, NODE_LABELS=apache-beam-jenkins-6
beam, HUDSON_URL=https://builds.apache.org/, WORKSPACE=<https://builds.apache.org/job/beam_PostCommit_Go_VR_Flink/ws/,>
ROOT_BUILD_CAUSE_TIMERTRIGGER=true, SUDO_UID=1013, _=./gradlew, GIT_COMMIT=1664ce2f84f6c4c0898c04ffe5e2be41c951ef85,
COVERALLS_REPO_TOKEN=****, EXECUTOR_NUMBER=1, HUDSON_SERVER_COOKIE=f4ebd1e6b0d976e8, GIT_COMMITTER_NAME=jenkins,
JOB_BASE_NAME=beam_PostCommit_Go_VR_Flink, USER=jenkins, SUDO_COMMAND=/bin/su jenkins, BUILD_NUMBER=1492,
BUILD_URL=https://builds.apache.org/job/beam_PostCommit_Go_VR_Flink/1492/, GIT_COMMITTER_EMAIL=builds@apache.org,
GIT_URL=https://github.com/apache/beam.git, HOME=/home/jenkins}
12:02:23.347 [DEBUG] [org.gradle.launcher.daemon.server.exec.LogToClient] About to start relaying
all logs to the client via the connection.
12:02:23.347 [INFO] [org.gradle.launcher.daemon.server.exec.LogToClient] The client will now
receive all logging from the daemon (pid: 24351). The daemon log file: /home/jenkins/.gradle/daemon/5.2.1/daemon-24351.out.log
12:02:23.348 [INFO] [org.gradle.launcher.daemon.server.exec.LogAndCheckHealth] Starting 2nd
build in daemon [uptime: 2 mins 1.439 secs, performance: 97%]
12:02:23.348 [DEBUG] [org.gradle.launcher.daemon.server.exec.ExecuteBuild] The daemon has
started executing the build.
12:02:23.349 [DEBUG] [org.gradle.launcher.daemon.server.exec.ExecuteBuild] Executing build
with daemon context: DefaultDaemonContext[uid=0504ea41-ea4b-4a4b-817f-28d942b6c848,javaHome=/usr/lib/jvm/java-8-openjdk-amd64,daemonRegistryDir=/home/jenkins/.gradle/daemon,pid=24351,idleTimeout=10800000,priority=NORMAL,daemonOpts=-Xss10240k,-Dfile.encoding=UTF-8,-Duser.country=US,-Duser.language=en,-Duser.variant]
Configuration on demand is an incubating feature.
Found go 1.12 in /usr/bin/go, use it.
Daemon vm is shutting down... The daemon has exited normally or was terminated in response
to a user interrupt.
----- End of the daemon log -----


FAILURE: Build failed with an exception.

* What went wrong:
Gradle build daemon disappeared unexpectedly (it may have been killed or may have crashed)

* Try:
Run with --stacktrace option to get the stack trace. Run with --info or --debug option to
get more log output. Run with --scan to get full insights.

* Get more help at https://help.gradle.org

> Configure project :sdks:go:container
Found go 1.12 in /usr/bin/go, use it.

> Task :sdks:go:test:flinkValidatesRunner FAILED

FAILURE: Build failed with an exception.

* Where:
Build file '<https://builds.apache.org/job/beam_PostCommit_Go_VR_Flink/ws/src/sdks/go/test/build.gradle'>
line: 59

* What went wrong:
Execution failed for task ':sdks:go:test:flinkValidatesRunner'.
> Process 'command 'sh'' finished with non-zero exit value 1

* Try:
Run with --stacktrace option to get the stack trace. Run with --info or --debug option to
get more log output. Run with --scan to get full insights.

* Get more help at https://help.gradle.org

Deprecated Gradle features were used in this build, making it incompatible with Gradle 6.0.
Use '--warning-mode all' to show the individual deprecation warnings.
See https://docs.gradle.org/5.2.1/userguide/command_line_interface.html#sec:command_line_warnings

BUILD FAILED in 2m 5s
65 actionable tasks: 48 executed, 17 from cache

Publishing build scan...
https://gradle.com/s/jwjgb35be2r4a

Build step 'Invoke Gradle script' changed build result to FAILURE
Build step 'Invoke Gradle script' marked build as failure

---------------------------------------------------------------------
To unsubscribe, e-mail: builds-unsubscribe@beam.apache.org
For additional commands, e-mail: builds-help@beam.apache.org


Mime
View raw message