beam-builds mailing list archives

Site index · List index
Message view « Date » · « Thread »
Top « Date » · « Thread »
From Apache Jenkins Server <jenk...@builds.apache.org>
Subject Build failed in Jenkins: beam_PostCommit_Java_ValidatesRunner_SparkStructuredStreaming #69
Date Wed, 27 Nov 2019 21:10:44 GMT
See <https://builds.apache.org/job/beam_PostCommit_Java_ValidatesRunner_SparkStructuredStreaming/69/display/redirect?page=changes>

Changes:

[amyrvold] [BEAM-8832] Allow GCS staging upload chunk size to be increased >1M when


------------------------------------------
[...truncated 18.46 KB...]
> Task :model:pipeline:jar
> Task :model:fn-execution:extractIncludeProto
> Task :model:job-management:extractIncludeProto
> Task :model:job-management:generateProto
> Task :model:fn-execution:generateProto
> Task :model:job-management:compileJava FROM-CACHE
> Task :model:job-management:classes
> Task :model:fn-execution:compileJava FROM-CACHE
> Task :model:fn-execution:classes
> Task :model:pipeline:shadowJar
> Task :model:job-management:shadowJar
> Task :model:fn-execution:shadowJar
> Task :sdks:java:core:compileJava FROM-CACHE
> Task :sdks:java:core:classes
> Task :sdks:java:core:shadowJar
> Task :sdks:java:extensions:protobuf:extractIncludeProto
> Task :sdks:java:extensions:protobuf:generateProto NO-SOURCE
> Task :vendor:sdks-java-extensions-protobuf:compileJava FROM-CACHE
> Task :vendor:sdks-java-extensions-protobuf:classes UP-TO-DATE
> Task :runners:local-java:compileJava FROM-CACHE
> Task :runners:local-java:classes UP-TO-DATE
> Task :vendor:sdks-java-extensions-protobuf:shadowJar
> Task :runners:local-java:jar
> Task :sdks:java:io:kafka:compileJava FROM-CACHE
> Task :sdks:java:io:kafka:classes UP-TO-DATE
> Task :sdks:java:io:common:compileTestJava FROM-CACHE
> Task :sdks:java:io:common:testClasses UP-TO-DATE
> Task :sdks:java:io:common:testJar
> Task :sdks:java:io:kafka:jar
> Task :sdks:java:io:jdbc:compileJava FROM-CACHE
> Task :sdks:java:io:jdbc:classes UP-TO-DATE
> Task :sdks:java:io:jdbc:jar
> Task :sdks:java:fn-execution:compileJava FROM-CACHE
> Task :sdks:java:fn-execution:classes UP-TO-DATE
> Task :sdks:java:extensions:google-cloud-platform-core:compileJava FROM-CACHE
> Task :sdks:java:extensions:google-cloud-platform-core:classes UP-TO-DATE
> Task :sdks:java:io:hadoop-common:compileJava FROM-CACHE
> Task :sdks:java:io:hadoop-common:classes UP-TO-DATE
> Task :sdks:java:io:hadoop-common:jar
> Task :sdks:java:fn-execution:jar
> Task :sdks:java:extensions:google-cloud-platform-core:jar
> Task :runners:core-construction-java:compileJava FROM-CACHE
> Task :runners:core-construction-java:classes UP-TO-DATE
> Task :sdks:java:io:hadoop-format:compileJava FROM-CACHE
> Task :sdks:java:io:hadoop-format:classes UP-TO-DATE
> Task :sdks:java:testing:test-utils:compileJava FROM-CACHE
> Task :sdks:java:testing:test-utils:classes UP-TO-DATE
> Task :sdks:java:io:hadoop-format:jar
> Task :sdks:java:testing:test-utils:jar
> Task :sdks:java:extensions:protobuf:compileJava FROM-CACHE
> Task :sdks:java:extensions:protobuf:classes UP-TO-DATE
> Task :sdks:java:extensions:protobuf:jar
> Task :sdks:java:testing:test-utils:compileTestJava FROM-CACHE
> Task :sdks:java:testing:test-utils:testClasses UP-TO-DATE
> Task :sdks:java:testing:test-utils:testJar
> Task :runners:core-construction-java:jar
> Task :runners:core-java:compileJava FROM-CACHE
> Task :runners:core-java:classes UP-TO-DATE
> Task :runners:core-java:jar
> Task :sdks:java:core:compileTestJava FROM-CACHE
> Task :sdks:java:core:testClasses
> Task :sdks:java:harness:compileJava FROM-CACHE
> Task :sdks:java:harness:classes UP-TO-DATE
> Task :sdks:java:io:google-cloud-platform:compileJava FROM-CACHE
> Task :sdks:java:io:google-cloud-platform:classes UP-TO-DATE
> Task :sdks:java:harness:jar
> Task :sdks:java:io:google-cloud-platform:jar
> Task :examples:java:compileJava FROM-CACHE
> Task :examples:java:classes UP-TO-DATE
> Task :examples:java:jar
> Task :examples:java:compileTestJava FROM-CACHE
> Task :examples:java:testClasses
> Task :examples:java:testJar
> Task :sdks:java:core:shadowTestJar
> Task :runners:core-java:compileTestJava FROM-CACHE
> Task :runners:core-java:testClasses UP-TO-DATE
> Task :runners:core-java:testJar
> Task :sdks:java:harness:shadowJar
> Task :runners:java-fn-execution:compileJava FROM-CACHE
> Task :runners:java-fn-execution:classes UP-TO-DATE
> Task :runners:java-fn-execution:jar
> Task :runners:direct-java:compileJava FROM-CACHE
> Task :runners:direct-java:classes UP-TO-DATE
> Task :runners:spark:compileJava FROM-CACHE
> Task :runners:spark:classes
> Task :runners:spark:jar
> Task :runners:spark:compileTestJava FROM-CACHE
> Task :runners:spark:testClasses
> Task :runners:spark:testJar
> Task :runners:direct-java:shadowJar
> Task :sdks:java:io:hadoop-format:compileTestJava FROM-CACHE
> Task :sdks:java:io:hadoop-format:testClasses
> Task :runners:spark:validatesStructuredStreamingRunnerBatch

org.apache.beam.sdk.transforms.ViewTest > testEmptyMultimapSideInput FAILED
    org.apache.beam.sdk.Pipeline$PipelineExecutionException at ViewTest.java:830
        Caused by: java.io.FileNotFoundException

org.apache.beam.sdk.transforms.ViewTest > testCombinedMapSideInput FAILED
    java.lang.IllegalStateException at ViewTest.java:1334
        Caused by: io.netty.channel.ChannelException at ViewTest.java:1334
            Caused by: java.io.IOException at ViewTest.java:1334

org.apache.beam.sdk.transforms.ViewTest > testMultimapSideInputIsImmutable FAILED
    org.apache.spark.SparkException at ViewTest.java:913
        Caused by: java.io.IOException
            Caused by: io.netty.channel.ChannelException
                Caused by: java.lang.reflect.InvocationTargetException
                    Caused by: io.netty.channel.ChannelException
                        Caused by: java.net.SocketException

org.apache.beam.sdk.transforms.ViewTest > testWindowedMultimapAsEntrySetSideInput FAILED
    org.apache.spark.SparkException at ViewTest.java:747
        Caused by: java.io.IOException

org.apache.beam.sdk.transforms.ViewTest > testWindowedMultimapSideInputWithNonDeterministicKeyCoder
FAILED
    org.apache.spark.SparkException at ViewTest.java:797
        Caused by: java.io.IOException

org.apache.beam.sdk.transforms.ViewTest > testMapSideInputWithNonDeterministicKeyCoder
FAILED
    org.apache.spark.SparkException at ViewTest.java:1012
        Caused by: java.io.IOException

org.apache.beam.sdk.transforms.ViewTest > testWindowedSingletonSideInput FAILED
    org.apache.spark.SparkException at ViewTest.java:152
        Caused by: java.io.IOException

org.apache.beam.sdk.transforms.ViewTest > testWindowedMultimapSideInput FAILED
    org.apache.spark.SparkException at ViewTest.java:699
        Caused by: java.io.IOException

org.apache.beam.sdk.transforms.ViewTest > testSideInputWithNullDefault FAILED
    org.apache.spark.SparkException at ViewTest.java:1484
        Caused by: java.io.IOException

org.apache.beam.sdk.transforms.ViewTest > testWindowedListSideInput FAILED
    org.apache.spark.SparkException at ViewTest.java:290
        Caused by: java.io.IOException

org.apache.beam.sdk.transforms.ViewTest > testWindowedMapSideInput FAILED
    org.apache.spark.SparkException at ViewTest.java:1056
        Caused by: java.io.IOException

org.apache.beam.sdk.transforms.ViewTest > testIterableSideInputIsImmutable FAILED
    org.apache.spark.SparkException at ViewTest.java:505
        Caused by: java.io.IOException

org.apache.beam.sdk.transforms.ViewTest > testListSideInputIsImmutable FAILED
    org.apache.spark.SparkException at ViewTest.java:368
        Caused by: java.io.IOException

org.apache.beam.sdk.transforms.ViewTest > testEmptyListSideInput FAILED
    org.apache.beam.sdk.Pipeline$PipelineExecutionException at ViewTest.java:319
        Caused by: java.io.IOException

org.apache.beam.sdk.transforms.ViewTest > testWindowedSideInputFixedToFixed FAILED
    java.lang.IllegalStateException at ViewTest.java:1375
        Caused by: io.netty.channel.ChannelException at ViewTest.java:1375
            Caused by: java.io.IOException at ViewTest.java:1375

org.apache.beam.sdk.transforms.ViewTest > testIterableSideInput FAILED
    java.lang.IllegalStateException at ViewTest.java:396
        Caused by: io.netty.channel.ChannelException at ViewTest.java:396
            Caused by: java.io.IOException at ViewTest.java:396

org.apache.beam.sdk.transforms.ViewTest > testEmptyMultimapSideInputWithNonDeterministicKeyCoder
FAILED
    java.lang.IllegalStateException at ViewTest.java:864
        Caused by: io.netty.channel.ChannelException at ViewTest.java:864
            Caused by: java.io.IOException at ViewTest.java:864

org.apache.beam.sdk.transforms.ViewTest > testEmptyMapSideInput FAILED
    java.lang.IllegalStateException at ViewTest.java:1177
        Caused by: io.netty.channel.ChannelException at ViewTest.java:1177
            Caused by: java.io.IOException at ViewTest.java:1177

org.apache.beam.sdk.transforms.ViewTest > testMapSideInputIsImmutable FAILED
    java.lang.IllegalStateException at ViewTest.java:1301
        Caused by: io.netty.channel.ChannelException at ViewTest.java:1301
            Caused by: java.io.IOException at ViewTest.java:1301

org.apache.beam.sdk.transforms.ViewTest > testWindowedMapAsEntrySetSideInput FAILED
    java.lang.IllegalStateException at ViewTest.java:1099
        Caused by: io.netty.channel.ChannelException at ViewTest.java:1099
            Caused by: java.io.IOException at ViewTest.java:1099

org.apache.beam.sdk.transforms.ViewTest > testEmptyMapSideInputWithNonDeterministicKeyCoder
FAILED
    java.lang.IllegalStateException at ViewTest.java:1211
        Caused by: io.netty.channel.ChannelException at ViewTest.java:1211
            Caused by: java.io.IOException at ViewTest.java:1211

org.apache.beam.sdk.transforms.ViewTest > testMultimapAsEntrySetSideInput FAILED
    java.lang.IllegalStateException at ViewTest.java:581
        Caused by: io.netty.channel.ChannelException at ViewTest.java:581
            Caused by: java.io.IOException at ViewTest.java:581

org.apache.beam.sdk.transforms.ViewTest > testSingletonSideInput FAILED
    java.lang.IllegalStateException at ViewTest.java:113
        Caused by: io.netty.channel.ChannelException at ViewTest.java:113
            Caused by: java.io.IOException at ViewTest.java:113

org.apache.beam.sdk.testing.PAssertTest > testGlobalWindowContainsInAnyOrder FAILED
    org.apache.beam.sdk.Pipeline$PipelineExecutionException at PAssertTest.java:406
        Caused by: java.io.FileNotFoundException

org.apache.beam.sdk.testing.PAssertTest > testEmptyFalseDefaultReasonString FAILED
    java.lang.AssertionError at PAssertTest.java:501

org.apache.beam.sdk.testing.PAssertTest > testAssertionSiteIsCapturedWithoutMessage FAILED
    java.lang.AssertionError at PAssertTest.java:543

org.apache.beam.sdk.testing.PAssertTest > testWindowedSerializablePredicate FAILED
    java.lang.IllegalStateException at PAssertTest.java:238
        Caused by: io.netty.channel.ChannelException at PAssertTest.java:238
            Caused by: java.io.IOException at PAssertTest.java:238

org.apache.beam.sdk.testing.PAssertTest > testContainsInAnyOrderFalse FAILED
    java.lang.AssertionError at PAssertTest.java:468

org.apache.beam.sdk.transforms.ParDoSchemaTest > testNestedSchema FAILED
    org.apache.beam.sdk.Pipeline$PipelineExecutionException at ParDoSchemaTest.java:492
        Caused by: java.io.FileNotFoundException

176 tests completed, 29 failed, 1 skipped

> Task :runners:spark:validatesStructuredStreamingRunnerBatch FAILED

FAILURE: Build failed with an exception.

* What went wrong:
Execution failed for task ':runners:spark:validatesStructuredStreamingRunnerBatch'.
> There were failing tests. See the report at: file://<https://builds.apache.org/job/beam_PostCommit_Java_ValidatesRunner_SparkStructuredStreaming/ws/src/runners/spark/build/reports/tests/validatesStructuredStreamingRunnerBatch/index.html>

* Try:
Run with --stacktrace option to get the stack trace. Run with --info or --debug option to
get more log output. Run with --scan to get full insights.

* Get more help at https://help.gradle.org

Deprecated Gradle features were used in this build, making it incompatible with Gradle 6.0.
Use '--warning-mode all' to show the individual deprecation warnings.
See https://docs.gradle.org/5.2.1/userguide/command_line_interface.html#sec:command_line_warnings

BUILD FAILED in 11m 20s
83 actionable tasks: 53 executed, 30 from cache

Publishing build scan...
https://gradle.com/s/dr356q6lliqdm

Build step 'Invoke Gradle script' changed build result to FAILURE
Build step 'Invoke Gradle script' marked build as failure

---------------------------------------------------------------------
To unsubscribe, e-mail: builds-unsubscribe@beam.apache.org
For additional commands, e-mail: builds-help@beam.apache.org


Mime
View raw message