beam-builds mailing list archives

Site index · List index
Message view « Date » · « Thread »
Top « Date » · « Thread »
From Apache Jenkins Server <jenk...@builds.apache.org>
Subject Build failed in Jenkins: beam_PostCommit_Java_PVR_Flink_Batch #3140
Date Mon, 28 Oct 2019 22:41:18 GMT
See <https://builds.apache.org/job/beam_PostCommit_Java_PVR_Flink_Batch/3140/display/redirect?page=changes>

Changes:

[thw] [BEAM-8471] Flink native job submission for portable pipelines


------------------------------------------
[...truncated 50.53 KB...]
org.apache.beam.sdk.transforms.CombineTest$WindowingTests > testWindowedCombineGloballyAsSingletonView
FAILED
    java.lang.RuntimeException at CombineTest.java:1401

org.apache.beam.sdk.transforms.CombineTest$WindowingTests > testCombineGloballyInstanceMethodReference
FAILED
    java.lang.RuntimeException at CombineTest.java:1435

org.apache.beam.sdk.transforms.CombineTest$WindowingTests > testFixedWindowsCombine FAILED
    java.lang.RuntimeException at CombineTest.java:1062

org.apache.beam.sdk.transforms.CombineTest$WindowingTests > testSlidingWindowsCombineWithContext
FAILED
    java.lang.RuntimeException at CombineTest.java:1214

org.apache.beam.sdk.transforms.CombineTest$WindowingTests > testFixedWindowsCombineWithContext
FAILED
    java.lang.RuntimeException at CombineTest.java:1104

org.apache.beam.sdk.transforms.CombineTest$WindowingTests > testSessionsCombineWithContext
FAILED
    java.lang.RuntimeException at CombineTest.java:1318

org.apache.beam.sdk.transforms.ParDoTest$TimestampTests > testParDoShiftTimestamp FAILED
    java.lang.RuntimeException at ParDoTest.java:1599

org.apache.beam.sdk.transforms.ParDoTest$TimestampTests > testParDoShiftTimestampUnlimited
FAILED
    java.lang.RuntimeException at ParDoTest.java:1688

org.apache.beam.sdk.transforms.FlattenTest > testFlattenIterablesCollections FAILED
    java.lang.RuntimeException at FlattenTest.java:297

org.apache.beam.sdk.transforms.FlattenTest > testEmptyFlattenAsSideInput FAILED
    java.lang.RuntimeException at FlattenTest.java:211

org.apache.beam.sdk.transforms.FlattenTest > testFlattenIterablesEmpty FAILED
    java.lang.RuntimeException at FlattenTest.java:312

org.apache.beam.sdk.transforms.FlattenTest > testFlattenIterablesLists FAILED
    java.lang.RuntimeException at FlattenTest.java:265

org.apache.beam.sdk.transforms.FlattenTest > testFlattenInputMultipleCopies FAILED
    java.lang.RuntimeException at FlattenTest.java:162

org.apache.beam.sdk.transforms.FlattenTest > testFlattenPCollectionsEmpty FAILED
    java.lang.RuntimeException at FlattenTest.java:130

org.apache.beam.sdk.transforms.FlattenTest > testFlattenPCollectionsSingletonList FAILED
    java.lang.RuntimeException at FlattenTest.java:104

org.apache.beam.sdk.transforms.FlattenTest > testFlattenPCollections FAILED
    java.lang.RuntimeException at FlattenTest.java:92

org.apache.beam.sdk.transforms.FlattenTest > testFlattenPCollectionsThenParDo FAILED
    java.lang.RuntimeException at FlattenTest.java:118

org.apache.beam.sdk.transforms.FlattenTest > testFlattenMultiplePCollectionsHavingMultipleConsumers
FAILED
    java.lang.RuntimeException at FlattenTest.java:347

org.apache.beam.sdk.transforms.FlattenTest > testFlattenIterables FAILED
    java.lang.RuntimeException at FlattenTest.java:252

org.apache.beam.sdk.transforms.FlattenTest > testFlattenIterablesSets FAILED
    java.lang.RuntimeException at FlattenTest.java:280

org.apache.beam.sdk.transforms.FlattenTest > testFlattenPCollectionsEmptyThenParDo FAILED
    java.lang.RuntimeException at FlattenTest.java:224

org.apache.beam.sdk.transforms.ParDoTest$BasicTests > testParDo FAILED
    java.lang.RuntimeException at ParDoTest.java:358

org.apache.beam.sdk.transforms.ParDoTest$BasicTests > testPipelineOptionsParameter FAILED
    java.lang.RuntimeException at ParDoTest.java:556

org.apache.beam.sdk.transforms.ParDoTest$BasicTests > testParDoEmpty FAILED
    java.lang.RuntimeException at ParDoTest.java:374

org.apache.beam.sdk.transforms.ParDoTest$BasicTests > testParDoInCustomTransform FAILED
    java.lang.RuntimeException at ParDoTest.java:420

org.apache.beam.sdk.transforms.ParDoTest$BasicTests > testParDoEmptyOutputs FAILED
    java.lang.RuntimeException at ParDoTest.java:390

org.apache.beam.sdk.transforms.CombineTest$AccumulationTests > testAccumulatingCombine
FAILED
    java.lang.RuntimeException at CombineTest.java:1449

org.apache.beam.sdk.transforms.CombineTest$AccumulationTests > testAccumulatingCombineEmpty
FAILED
    java.lang.RuntimeException at CombineTest.java:1462

org.apache.beam.sdk.transforms.CreateTest > testCreateEmpty FAILED
    java.lang.RuntimeException at CreateTest.java:101

org.apache.beam.sdk.transforms.CreateTest > testCreateWithKVVoidType FAILED
    java.lang.RuntimeException at CreateTest.java:337

org.apache.beam.sdk.transforms.CreateTest > testCreateWithNullsAndValues FAILED
    java.lang.RuntimeException at CreateTest.java:161

org.apache.beam.sdk.transforms.CreateTest > testCreateWithVoidType FAILED
    java.lang.RuntimeException at CreateTest.java:325

org.apache.beam.sdk.transforms.CreateTest > testCreate FAILED
    java.lang.RuntimeException at CreateTest.java:90

org.apache.beam.sdk.transforms.ParDoSchemaTest > testReadAndWrite FAILED
    java.lang.RuntimeException at ParDoSchemaTest.java:146

org.apache.beam.sdk.transforms.ParDoSchemaTest > testSchemasPassedThrough FAILED
    java.lang.RuntimeException at ParDoSchemaTest.java:411

org.apache.beam.sdk.transforms.ParDoSchemaTest > testSchemaFieldSelectionNested FAILED
    java.lang.RuntimeException at ParDoSchemaTest.java:624

org.apache.beam.sdk.transforms.ParDoSchemaTest > testSchemaFieldSelectionUnboxing FAILED
    java.lang.RuntimeException at ParDoSchemaTest.java:533

org.apache.beam.sdk.transforms.ParDoSchemaTest > testSchemaFieldDescriptorSelectionUnboxing
FAILED
    java.lang.RuntimeException at ParDoSchemaTest.java:574

org.apache.beam.sdk.transforms.ParDoSchemaTest > testInferredSchemaPipeline FAILED
    java.lang.RuntimeException at ParDoSchemaTest.java:396

org.apache.beam.sdk.transforms.ParDoSchemaTest > testFieldAccessSchemaPipeline FAILED
    java.lang.RuntimeException at ParDoSchemaTest.java:319

org.apache.beam.sdk.transforms.ParDoSchemaTest > testSimpleSchemaPipeline FAILED
    java.lang.RuntimeException at ParDoSchemaTest.java:94

org.apache.beam.sdk.transforms.ParDoSchemaTest > testSchemaConversionPipeline FAILED
    java.lang.RuntimeException at ParDoSchemaTest.java:444

org.apache.beam.sdk.transforms.ParDoSchemaTest > testReadAndWriteWithSchemaRegistry FAILED
    java.lang.RuntimeException at ParDoSchemaTest.java:285

org.apache.beam.sdk.transforms.ParDoSchemaTest > testReadAndWriteMultiOutput FAILED
    java.lang.RuntimeException at ParDoSchemaTest.java:240

org.apache.beam.sdk.transforms.ParDoSchemaTest > testNestedSchema FAILED
    java.lang.RuntimeException at ParDoSchemaTest.java:483

org.apache.beam.sdk.transforms.ParDoTest$TimerCoderInferenceTests > testValueStateCoderInferenceFromInputCoder
FAILED
    java.lang.RuntimeException at ParDoTest.java:3942

org.apache.beam.sdk.transforms.ParDoTest$TimerCoderInferenceTests > testValueStateCoderInference
FAILED
    java.lang.RuntimeException at ParDoTest.java:3872

org.apache.beam.sdk.transforms.ParDoTest$MultipleInputsAndOutputTests > testParDoWithOnlyTaggedOutput
FAILED
    java.lang.RuntimeException at ParDoTest.java:699

org.apache.beam.sdk.transforms.ParDoTest$MultipleInputsAndOutputTests > testMultiOutputParDoWithSideInputs
FAILED
    java.lang.RuntimeException at ParDoTest.java:1105

org.apache.beam.sdk.transforms.ParDoTest$MultipleInputsAndOutputTests > testSideInputsWithMultipleWindows
FAILED
    java.lang.RuntimeException at ParDoTest.java:1191

org.apache.beam.sdk.transforms.ParDoTest$MultipleInputsAndOutputTests > testParDoEmptyWithTaggedOutput
FAILED
    java.lang.RuntimeException at ParDoTest.java:646

org.apache.beam.sdk.transforms.ParDoTest$MultipleInputsAndOutputTests > testParDoWithTaggedOutput
FAILED
    java.lang.RuntimeException at ParDoTest.java:604

org.apache.beam.sdk.transforms.ParDoTest$MultipleInputsAndOutputTests > testMultiOutputParDoWithSideInputsIsCumulative
FAILED
    java.lang.RuntimeException at ParDoTest.java:1143

org.apache.beam.sdk.transforms.ParDoTest$MultipleInputsAndOutputTests > testSideInputAnnotationWithMultipleSideInputs
FAILED
    java.lang.RuntimeException at ParDoTest.java:1033

org.apache.beam.sdk.transforms.ParDoTest$MultipleInputsAndOutputTests > testSideInputAnnotation
FAILED
    java.lang.RuntimeException at ParDoTest.java:930

org.apache.beam.sdk.transforms.ParDoTest$MultipleInputsAndOutputTests > testParDoWithEmptyTaggedOutput
FAILED
    java.lang.RuntimeException at ParDoTest.java:670

org.apache.beam.sdk.transforms.ParDoTest$MultipleInputsAndOutputTests > testParDoWithSideInputs
FAILED
    java.lang.RuntimeException at ParDoTest.java:749

org.apache.beam.sdk.transforms.ParDoTest$MultipleInputsAndOutputTests > testParDoWithSideInputsIsCumulative
FAILED
    java.lang.RuntimeException at ParDoTest.java:1067

org.apache.beam.sdk.transforms.ParDoTest$LifecycleTests > testWindowingInStartAndFinishBundle
FAILED
    java.lang.RuntimeException at ParDoTest.java:1516

org.apache.beam.sdk.transforms.windowing.WindowingTest > testMergingWindowing FAILED
    java.lang.RuntimeException at WindowingTest.java:168

org.apache.beam.sdk.transforms.windowing.WindowingTest > testWindowPreservation FAILED
    java.lang.RuntimeException at WindowingTest.java:197

org.apache.beam.sdk.transforms.windowing.WindowingTest > testNonPartitioningWindowing FAILED
    java.lang.RuntimeException at WindowingTest.java:150

org.apache.beam.sdk.transforms.windowing.WindowingTest > testPartitioningWindowing FAILED
    java.lang.RuntimeException at WindowingTest.java:126

org.apache.beam.sdk.transforms.windowing.WindowTest > testTimestampCombinerEndOfWindow
FAILED
    java.lang.RuntimeException at WindowTest.java:498

org.apache.beam.sdk.transforms.windowing.WindowTest > testTimestampCombinerDefault FAILED
    java.lang.RuntimeException at WindowTest.java:468

org.apache.beam.sdk.transforms.windowing.WindowTest > testNoWindowFnDoesNotReassignWindows
FAILED
    java.lang.RuntimeException at WindowTest.java:434

org.apache.beam.sdk.transforms.WithTimestampsTest > withTimestampsShouldApplyTimestamps
FAILED
    java.lang.RuntimeException at WithTimestampsTest.java:78

org.apache.beam.sdk.transforms.WithTimestampsTest > withTimestampsBackwardsInTimeAndWithAllowedTimestampSkewShouldSucceed
FAILED
    java.lang.RuntimeException at WithTimestampsTest.java:142

org.apache.beam.sdk.transforms.WithTimestampsTest > withTimestampsLambdaShouldApplyTimestamps
FAILED
    java.lang.RuntimeException at WithTimestampsTest.java:205

org.apache.beam.sdk.transforms.ReifyTimestampsTest > extractFromValuesWhenValueTimestampedLaterSucceeds
FAILED
    java.lang.RuntimeException at ReifyTimestampsTest.java:128

org.apache.beam.sdk.transforms.ReifyTimestampsTest > extractFromValuesSucceeds FAILED
    java.lang.RuntimeException at ReifyTimestampsTest.java:92

org.apache.beam.sdk.transforms.ReifyTimestampsTest > inValuesSucceeds FAILED
    java.lang.RuntimeException at ReifyTimestampsTest.java:60

org.apache.beam.sdk.io.CountingSourceTest > testUnboundedSourceSplits FAILED
    java.lang.RuntimeException at CountingSourceTest.java:246

org.apache.beam.sdk.io.CountingSourceTest > testBoundedSourceSplits FAILED
    java.lang.RuntimeException at CountingSourceTest.java:121

207 tests completed, 194 failed, 2 skipped

> Task :runners:flink:1.9:job-server:validatesPortableRunnerBatch FAILED

FAILURE: Build failed with an exception.

* What went wrong:
Execution failed for task ':runners:flink:1.9:job-server:validatesPortableRunnerBatch'.
> There were failing tests. See the report at: file://<https://builds.apache.org/job/beam_PostCommit_Java_PVR_Flink_Batch/ws/src/runners/flink/1.9/job-server/build/reports/tests/validatesPortableRunnerBatch/index.html>

* Try:
Run with --stacktrace option to get the stack trace. Run with --info or --debug option to
get more log output. Run with --scan to get full insights.

* Get more help at https://help.gradle.org

Deprecated Gradle features were used in this build, making it incompatible with Gradle 6.0.
Use '--warning-mode all' to show the individual deprecation warnings.
See https://docs.gradle.org/5.2.1/userguide/command_line_interface.html#sec:command_line_warnings

BUILD FAILED in 1m 16s
68 actionable tasks: 51 executed, 17 from cache

Publishing build scan...
https://gradle.com/s/mhydnyrqn5rbg

Build step 'Invoke Gradle script' changed build result to FAILURE
Build step 'Invoke Gradle script' marked build as failure

---------------------------------------------------------------------
To unsubscribe, e-mail: builds-unsubscribe@beam.apache.org
For additional commands, e-mail: builds-help@beam.apache.org


Mime
View raw message