beam-builds mailing list archives

Site index · List index
Message view « Date » · « Thread »
Top « Date » · « Thread »
From Apache Jenkins Server <jenk...@builds.apache.org>
Subject Build failed in Jenkins: beam_PostCommit_Go_VR_Flink #1447
Date Wed, 30 Oct 2019 20:43:21 GMT
See <https://builds.apache.org/job/beam_PostCommit_Go_VR_Flink/1447/display/redirect?page=changes>

Changes:

[github] [Go SDK] Delete spammy log in datamgr.go


------------------------------------------
[...truncated 163.34 KB...]
    key: "n1"
    value: <
      unique_name: "n1"
      coder_id: "c0"
      is_bounded: BOUNDED
      windowing_strategy_id: "w0"
    >
  >
  pcollections: <
    key: "n2"
    value: <
      unique_name: "n2"
      coder_id: "c3"
      is_bounded: BOUNDED
      windowing_strategy_id: "w0"
    >
  >
  pcollections: <
    key: "n3"
    value: <
      unique_name: "n3"
      coder_id: "c0"
      is_bounded: BOUNDED
      windowing_strategy_id: "w0"
    >
  >
  pcollections: <
    key: "n4"
    value: <
      unique_name: "n4"
      coder_id: "c3"
      is_bounded: BOUNDED
      windowing_strategy_id: "w0"
    >
  >
  pcollections: <
    key: "n5"
    value: <
      unique_name: "n5"
      coder_id: "c0"
      is_bounded: BOUNDED
      windowing_strategy_id: "w0"
    >
  >
  pcollections: <
    key: "n6"
    value: <
      unique_name: "n6"
      coder_id: "c3"
      is_bounded: BOUNDED
      windowing_strategy_id: "w0"
    >
  >
  pcollections: <
    key: "n7"
    value: <
      unique_name: "n7"
      coder_id: "c3"
      is_bounded: BOUNDED
      windowing_strategy_id: "w0"
    >
  >
  pcollections: <
    key: "n8"
    value: <
      unique_name: "n8"
      coder_id: "c4"
      is_bounded: BOUNDED
      windowing_strategy_id: "w0"
    >
  >
  pcollections: <
    key: "n9"
    value: <
      unique_name: "n9"
      coder_id: "c6"
      is_bounded: BOUNDED
      windowing_strategy_id: "w0"
    >
  >
  windowing_strategies: <
    key: "w0"
    value: <
      window_fn: <
        spec: <
          urn: "beam:windowfn:global_windows:v0.1"
        >
      >
      merge_status: NON_MERGING
      window_coder_id: "c1"
      trigger: <
        default: <
        >
      >
      accumulation_mode: DISCARDING
      output_time: END_OF_WINDOW
      closing_behavior: EMIT_IF_NONEMPTY
      OnTimeBehavior: FIRE_ALWAYS
    >
  >
  coders: <
    key: "c0"
    value: <
      spec: <
        urn: "beam:coder:bytes:v1"
      >
    >
  >
  coders: <
    key: "c1"
    value: <
      spec: <
        urn: "beam:coder:global_window:v1"
      >
    >
  >
  coders: <
    key: "c2"
    value: <
      spec: <
        urn: "beam:go:coder:custom:v1"
        payload: "Cgd2YXJpbnR6EgIIAhqFAQpxZ2l0aHViLmNvbS9hcGFjaGUvYmVhbS9zZGtzL2dvL3Rlc3QvdmVuZG9yL2dpdGh1Yi5jb20vYXBhY2hlL2JlYW0vc2Rrcy9nby9wa2cvYmVhbS9jb3JlL3J1bnRpbWUvY29kZXJ4LmVuY1ZhckludFoSEAgWIgQIGUAPKgYIFBICCAgikQEKcWdpdGh1Yi5jb20vYXBhY2hlL2JlYW0vc2Rrcy9nby90ZXN0L3ZlbmRvci9naXRodWIuY29tL2FwYWNoZS9iZWFtL3Nka3MvZ28vcGtnL2JlYW0vY29yZS9ydW50aW1lL2NvZGVyeC5kZWNWYXJJbnRaEhwIFiIECBlAAyIGCBQSAggIKgQIGUAPKgQIGUAB"
      >
    >
  >
  coders: <
    key: "c3"
    value: <
      spec: <
        urn: "beam:coder:length_prefix:v1"
      >
      component_coder_ids: "c2"
    >
  >
  coders: <
    key: "c4"
    value: <
      spec: <
        urn: "beam:coder:kv:v1"
      >
      component_coder_ids: "c3"
      component_coder_ids: "c3"
    >
  >
  coders: <
    key: "c5"
    value: <
      spec: <
        urn: "beam:coder:iterable:v1"
      >
      component_coder_ids: "c3"
    >
  >
  coders: <
    key: "c6"
    value: <
      spec: <
        urn: "beam:coder:kv:v1"
      >
      component_coder_ids: "c3"
      component_coder_ids: "c5"
    >
  >
  environments: <
    key: "go"
    value: <
      urn: "beam:env:docker:v1"
      payload: "\n<us.gcr.io/apache-beam-testing/jenkins/go_sdk:20191030-202825"
    >
  >
>
root_transform_ids: "e1"
root_transform_ids: "e2"
root_transform_ids: "e3"
root_transform_ids: "e4"
root_transform_ids: "e5"
root_transform_ids: "e6"
root_transform_ids: "e7"
root_transform_ids: "s1"
2019/10/30 20:43:16 Test flatten:flatten failed: 	connecting to job service:
failed to dial server at localhost:47805
	caused by:
context deadline exceeded
2019/10/30 20:43:16 Result: 7 tests failed

if [[ ! -z "$JOB_PORT" ]]; then
  # Shut down the job server
  kill %1 || echo "Failed to shut down job server"
fi

# Delete the container locally and remotely
docker rmi $CONTAINER:$TAG || echo "Failed to remove container"
Untagged: us.gcr.io/apache-beam-testing/jenkins/go_sdk:20191030-202825
Untagged: us.gcr.io/apache-beam-testing/jenkins/go_sdk@sha256:c7c210bf571497699db8c28121174f12d1eddff3df6ee1a52f8a85699d870077
Deleted: sha256:b846e3ebe517ed7867f412b2720b21a4df5bc9b50ce16efb05d32de889288046
Deleted: sha256:ac7427650e57b7cbf67d27ed0de9e9d9981a389a6b97a4bcb03251a8a5ee0328
Deleted: sha256:92b2d414f3e09b2c1e21307e09c6b3861ff41eca0a82a15aa095d0a813a39493
Deleted: sha256:bcdf46ee11c52d9b6296e6a8044bc1133dee4872af7ce9e7b9ee68f3adbb6c96
Deleted: sha256:6dfdf8bb8ed9f64654986dde61168debc3755e67407c9e5ba6d55d45af4deb3f
Deleted: sha256:c361d2b1765e81462b4e63b0e93865f3923df0add73e3eda2862a90862b785ef
gcloud --quiet container images delete $CONTAINER:$TAG || echo "Failed to delete container"
Digests:
- us.gcr.io/apache-beam-testing/jenkins/go_sdk@sha256:c7c210bf571497699db8c28121174f12d1eddff3df6ee1a52f8a85699d870077
  Associated tags:
 - 20191030-202825
Tags:
- us.gcr.io/apache-beam-testing/jenkins/go_sdk:20191030-202825
Deleted [us.gcr.io/apache-beam-testing/jenkins/go_sdk:20191030-202825].
Deleted [us.gcr.io/apache-beam-testing/jenkins/go_sdk@sha256:c7c210bf571497699db8c28121174f12d1eddff3df6ee1a52f8a85699d870077].

# Clean up tempdir
rm -rf $TMPDIR

if [[ "$TEST_EXIT_CODE" -eq 0 ]]; then
  echo ">>> SUCCESS"
else
  echo ">>> FAILURE"
fi
>>> FAILURE
exit $TEST_EXIT_CODE

> Task :sdks:go:test:flinkValidatesRunner FAILED

FAILURE: Build failed with an exception.

* Where:
Build file '<https://builds.apache.org/job/beam_PostCommit_Go_VR_Flink/ws/src/sdks/go/test/build.gradle'>
line: 59

* What went wrong:
Execution failed for task ':sdks:go:test:flinkValidatesRunner'.
> Process 'command 'sh'' finished with non-zero exit value 1

* Try:
Run with --stacktrace option to get the stack trace. Run with --info or --debug option to
get more log output. Run with --scan to get full insights.

* Get more help at https://help.gradle.org

Deprecated Gradle features were used in this build, making it incompatible with Gradle 6.0.
Use '--warning-mode all' to show the individual deprecation warnings.
See https://docs.gradle.org/5.2.1/userguide/command_line_interface.html#sec:command_line_warnings

BUILD FAILED in 17m 0s
65 actionable tasks: 48 executed, 17 from cache

Publishing build scan...
https://gradle.com/s/hegcussu7djti

Build step 'Invoke Gradle script' changed build result to FAILURE
Build step 'Invoke Gradle script' marked build as failure

---------------------------------------------------------------------
To unsubscribe, e-mail: builds-unsubscribe@beam.apache.org
For additional commands, e-mail: builds-help@beam.apache.org


Mime
View raw message