beam-builds mailing list archives

Site index · List index
Message view « Date » · « Thread »
Top « Date » · « Thread »
From Apache Jenkins Server <jenk...@builds.apache.org>
Subject Build failed in Jenkins: beam_BiqQueryIO_Batch_Performance_Test_Java #12
Date Tue, 10 Sep 2019 07:14:41 GMT
See <https://builds.apache.org/job/beam_BiqQueryIO_Batch_Performance_Test_Java/12/display/redirect>

------------------------------------------
[...truncated 199.25 KB...]
:sdks:java:core:shadowTestJar (Thread[Execution worker for ':',5,main]) completed. Took 3.146
secs.
:sdks:java:extensions:google-cloud-platform-core:compileTestJava (Thread[Execution worker
for ':',5,main]) started.

> Task :sdks:java:harness:shadowJar
Build cache key for task ':sdks:java:harness:shadowJar' is 05749eb1429adc8c66faaa22e8242127
Caching disabled for task ':sdks:java:harness:shadowJar': Caching has not been enabled for
the task
Task ':sdks:java:harness:shadowJar' is not up-to-date because:
  No history is available.
Custom actions are attached to task ':sdks:java:harness:shadowJar'.

> Task :sdks:java:extensions:google-cloud-platform-core:compileTestJava FROM-CACHE
Build cache key for task ':sdks:java:extensions:google-cloud-platform-core:compileTestJava'
is 5f321de435d76d8aaa9bbc661ccb2693
Task ':sdks:java:extensions:google-cloud-platform-core:compileTestJava' is not up-to-date
because:
  No history is available.
Origin for org.gradle.api.internal.tasks.execution.ExecuteActionsTaskExecuter$TaskExecution@34c2f7db:
{executionTime=7759, hostName=apache-beam-jenkins-15, operatingSystem=Linux, buildInvocationId=kh7epmxcivhnfafz3eqpi5lpoa,
creationTime=1567872725637, identity=:sdks:java:extensions:google-cloud-platform-core:compileTestJava,
type=org.gradle.api.internal.tasks.execution.ExecuteActionsTaskExecuter.TaskExecution, userName=jenkins,
gradleVersion=5.2.1, rootPath=/home/jenkins/jenkins-slave/workspace/beam_PostCommit_Java/src}
Unpacked trees for task ':sdks:java:extensions:google-cloud-platform-core:compileTestJava'
from cache.
:sdks:java:extensions:google-cloud-platform-core:compileTestJava (Thread[Execution worker
for ':',5,main]) completed. Took 0.328 secs.
:sdks:java:extensions:google-cloud-platform-core:testClasses (Thread[Execution worker for
':',5,main]) started.

> Task :sdks:java:extensions:google-cloud-platform-core:testClasses UP-TO-DATE
Skipping task ':sdks:java:extensions:google-cloud-platform-core:testClasses' as it has no
actions.
:sdks:java:extensions:google-cloud-platform-core:testClasses (Thread[Execution worker for
':',5,main]) completed. Took 0.0 secs.
:sdks:java:extensions:google-cloud-platform-core:testJar (Thread[Execution worker for ':',5,main])
started.

> Task :sdks:java:extensions:google-cloud-platform-core:testJar
Build cache key for task ':sdks:java:extensions:google-cloud-platform-core:testJar' is c2665386849a33a7fb04bd7cbaeccb62
Caching disabled for task ':sdks:java:extensions:google-cloud-platform-core:testJar': Caching
has not been enabled for the task
Task ':sdks:java:extensions:google-cloud-platform-core:testJar' is not up-to-date because:
  No history is available.
:sdks:java:extensions:google-cloud-platform-core:testJar (Thread[Execution worker for ':',5,main])
completed. Took 0.011 secs.

> Task :sdks:java:harness:shadowJar
*******************
GRADLE SHADOW STATS

Total Jars: 49 (includes project)
Total Time: 6.743s [6743ms]
Average Time/Jar: 0.137612244898s [137.612244898ms]
*******************
:sdks:java:harness:shadowJar (Thread[Execution worker for ':' Thread 6,5,main]) completed.
Took 7.174 secs.
:runners:java-fn-execution:compileJava (Thread[Execution worker for ':' Thread 6,5,main])
started.

> Task :runners:java-fn-execution:compileJava
Build cache key for task ':runners:java-fn-execution:compileJava' is bffd724ff24c2dd97ed123857608e11e
Task ':runners:java-fn-execution:compileJava' is not up-to-date because:
  No history is available.
Origin for org.gradle.api.internal.tasks.execution.ExecuteActionsTaskExecuter$TaskExecution@67ceca99:
{executionTime=12994, hostName=apache-beam-jenkins-15, operatingSystem=Linux, buildInvocationId=eamnsntczvdplmswlls43moapm,
creationTime=1568071306607, identity=:runners:java-fn-execution:compileJava, type=org.gradle.api.internal.tasks.execution.ExecuteActionsTaskExecuter.TaskExecution,
userName=jenkins, gradleVersion=5.2.1, rootPath=/home/jenkins/jenkins-slave/workspace/beam_PreCommit_Portable_Python_Commit/src}
Unpacked trees for task ':runners:java-fn-execution:compileJava' from cache.

> Task :runners:java-fn-execution:compileJava FROM-CACHE
:runners:java-fn-execution:compileJava (Thread[Execution worker for ':' Thread 6,5,main])
completed. Took 2.162 secs.
:runners:java-fn-execution:classes (Thread[Execution worker for ':' Thread 6,5,main]) started.

> Task :runners:java-fn-execution:classes UP-TO-DATE
Skipping task ':runners:java-fn-execution:classes' as it has no actions.
:runners:java-fn-execution:classes (Thread[Execution worker for ':' Thread 6,5,main]) completed.
Took 0.0 secs.
:runners:java-fn-execution:jar (Thread[Execution worker for ':' Thread 6,5,main]) started.

> Task :runners:java-fn-execution:jar
Build cache key for task ':runners:java-fn-execution:jar' is c44d27bb73ad6641ad95e995d1c2b750
Caching disabled for task ':runners:java-fn-execution:jar': Caching has not been enabled for
the task
Task ':runners:java-fn-execution:jar' is not up-to-date because:
  No history is available.
:runners:java-fn-execution:jar (Thread[Execution worker for ':' Thread 6,5,main]) completed.
Took 0.042 secs.
:runners:direct-java:compileJava (Thread[Execution worker for ':' Thread 6,5,main]) started.
:runners:google-cloud-dataflow-java:worker:legacy-worker:compileJava (Thread[Execution worker
for ':',5,main]) started.

> Task :runners:direct-java:compileJava FROM-CACHE
Build cache key for task ':runners:direct-java:compileJava' is 76ce48c96c37a9ece56bd28fe62118e3
Task ':runners:direct-java:compileJava' is not up-to-date because:
  No history is available.
Origin for org.gradle.api.internal.tasks.execution.ExecuteActionsTaskExecuter$TaskExecution@2761bd8d:
{executionTime=8655, hostName=apache-beam-jenkins-15, operatingSystem=Linux, buildInvocationId=wu2gyx4zbzhthjoda3gbhonkbe,
creationTime=1568095264116, identity=:runners:direct-java:compileJava, type=org.gradle.api.internal.tasks.execution.ExecuteActionsTaskExecuter.TaskExecution,
userName=jenkins, gradleVersion=5.2.1, rootPath=/home/jenkins/jenkins-slave/workspace/beam_PostCommit_Java/src}
Unpacked trees for task ':runners:direct-java:compileJava' from cache.
:runners:direct-java:compileJava (Thread[Execution worker for ':' Thread 6,5,main]) completed.
Took 0.071 secs.
:runners:direct-java:classes (Thread[Execution worker for ':' Thread 6,5,main]) started.

> Task :runners:direct-java:classes UP-TO-DATE
Skipping task ':runners:direct-java:classes' as it has no actions.
:runners:direct-java:classes (Thread[Execution worker for ':' Thread 6,5,main]) completed.
Took 0.0 secs.
:runners:direct-java:shadowJar (Thread[Execution worker for ':' Thread 6,5,main]) started.

> Task :runners:google-cloud-dataflow-java:worker:legacy-worker:compileJava FROM-CACHE
file or directory '<https://builds.apache.org/job/beam_BiqQueryIO_Batch_Performance_Test_Java/ws/src/runners/google-cloud-dataflow-java/worker/legacy-worker/src/main/java',>
not found
Build cache key for task ':runners:google-cloud-dataflow-java:worker:legacy-worker:compileJava'
is 65c2a48b632096812fc6d1eb5d612d42
Task ':runners:google-cloud-dataflow-java:worker:legacy-worker:compileJava' is not up-to-date
because:
  No history is available.
Origin for org.gradle.api.internal.tasks.execution.ExecuteActionsTaskExecuter$TaskExecution@402fff3c:
{executionTime=14852, hostName=apache-beam-jenkins-15, operatingSystem=Linux, buildInvocationId=wu2gyx4zbzhthjoda3gbhonkbe,
creationTime=1568095270312, identity=:runners:google-cloud-dataflow-java:worker:legacy-worker:compileJava,
type=org.gradle.api.internal.tasks.execution.ExecuteActionsTaskExecuter.TaskExecution, userName=jenkins,
gradleVersion=5.2.1, rootPath=/home/jenkins/jenkins-slave/workspace/beam_PostCommit_Java/src}
Unpacked trees for task ':runners:google-cloud-dataflow-java:worker:legacy-worker:compileJava'
from cache.
:runners:google-cloud-dataflow-java:worker:legacy-worker:compileJava (Thread[Execution worker
for ':',5,main]) completed. Took 0.255 secs.
:runners:google-cloud-dataflow-java:worker:legacy-worker:classes (Thread[Execution worker
for ':',5,main]) started.

> Task :runners:google-cloud-dataflow-java:worker:legacy-worker:classes UP-TO-DATE
Skipping task ':runners:google-cloud-dataflow-java:worker:legacy-worker:classes' as it has
no actions.
:runners:google-cloud-dataflow-java:worker:legacy-worker:classes (Thread[Execution worker
for ':',5,main]) completed. Took 0.0 secs.
:runners:google-cloud-dataflow-java:worker:legacy-worker:shadowJar (Thread[Execution worker
for ':',5,main]) started.

> Task :runners:direct-java:shadowJar
Build cache key for task ':runners:direct-java:shadowJar' is 8d3497307e0536de9a54185b4f865794
Caching disabled for task ':runners:direct-java:shadowJar': Caching has not been enabled for
the task
Task ':runners:direct-java:shadowJar' is not up-to-date because:
  No history is available.
Custom actions are attached to task ':runners:direct-java:shadowJar'.
*******************
GRADLE SHADOW STATS

Total Jars: 6 (includes project)
Total Time: 0.575s [575ms]
Average Time/Jar: 0.0958333333333s [95.8333333333ms]
*******************
:runners:direct-java:shadowJar (Thread[Execution worker for ':' Thread 6,5,main]) completed.
Took 0.756 secs.
:sdks:java:io:google-cloud-platform:compileTestJava (Thread[Execution worker for ':' Thread
6,5,main]) started.

> Task :sdks:java:io:google-cloud-platform:compileTestJava FROM-CACHE
Build cache key for task ':sdks:java:io:google-cloud-platform:compileTestJava' is 7fad3721872dffff3a8f57b6c29d1d41
Task ':sdks:java:io:google-cloud-platform:compileTestJava' is not up-to-date because:
  No history is available.
Origin for org.gradle.api.internal.tasks.execution.ExecuteActionsTaskExecuter$TaskExecution@6e845a0c:
{executionTime=11758, hostName=apache-beam-jenkins-15, operatingSystem=Linux, buildInvocationId=wu2gyx4zbzhthjoda3gbhonkbe,
creationTime=1568095276822, identity=:sdks:java:io:google-cloud-platform:compileTestJava,
type=org.gradle.api.internal.tasks.execution.ExecuteActionsTaskExecuter.TaskExecution, userName=jenkins,
gradleVersion=5.2.1, rootPath=/home/jenkins/jenkins-slave/workspace/beam_PostCommit_Java/src}
Unpacked trees for task ':sdks:java:io:google-cloud-platform:compileTestJava' from cache.
:sdks:java:io:google-cloud-platform:compileTestJava (Thread[Execution worker for ':' Thread
6,5,main]) completed. Took 0.253 secs.
:sdks:java:io:google-cloud-platform:testClasses (Thread[Execution worker for ':' Thread 6,5,main])
started.

> Task :sdks:java:io:google-cloud-platform:testClasses UP-TO-DATE
Skipping task ':sdks:java:io:google-cloud-platform:testClasses' as it has no actions.
:sdks:java:io:google-cloud-platform:testClasses (Thread[Execution worker for ':' Thread 6,5,main])
completed. Took 0.0 secs.
:sdks:java:io:google-cloud-platform:testJar (Thread[Execution worker for ':' Thread 6,5,main])
started.

> Task :sdks:java:io:google-cloud-platform:testJar
Build cache key for task ':sdks:java:io:google-cloud-platform:testJar' is 7fa1b184f23558ac5b6130897230cec5
Caching disabled for task ':sdks:java:io:google-cloud-platform:testJar': Caching has not been
enabled for the task
Task ':sdks:java:io:google-cloud-platform:testJar' is not up-to-date because:
  No history is available.
:sdks:java:io:google-cloud-platform:testJar (Thread[Execution worker for ':' Thread 6,5,main])
completed. Took 0.048 secs.
:runners:google-cloud-dataflow-java:compileTestJava (Thread[Execution worker for ':' Thread
6,5,main]) started.
:sdks:java:io:bigquery-io-perf-tests:compileTestJava (Thread[Execution worker for ':' Thread
2,5,main]) started.

> Task :sdks:java:io:bigquery-io-perf-tests:compileTestJava FROM-CACHE
Build cache key for task ':sdks:java:io:bigquery-io-perf-tests:compileTestJava' is d17725dcbba12c3e25d33541da2afc82
Task ':sdks:java:io:bigquery-io-perf-tests:compileTestJava' is not up-to-date because:
  No history is available.
Origin for org.gradle.api.internal.tasks.execution.ExecuteActionsTaskExecuter$TaskExecution@494844f8:
{executionTime=11601, hostName=apache-beam-jenkins-15, operatingSystem=Linux, buildInvocationId=lpvpqz2p55bq3bzsxxcymn3fsq,
creationTime=1568095716598, identity=:sdks:java:io:bigquery-io-perf-tests:compileTestJava,
type=org.gradle.api.internal.tasks.execution.ExecuteActionsTaskExecuter.TaskExecution, userName=jenkins,
gradleVersion=5.2.1, rootPath=/home/jenkins/jenkins-slave/workspace/beam_PreCommit_Java_Cron/src}
Unpacked trees for task ':sdks:java:io:bigquery-io-perf-tests:compileTestJava' from cache.
:sdks:java:io:bigquery-io-perf-tests:compileTestJava (Thread[Execution worker for ':' Thread
2,5,main]) completed. Took 0.072 secs.
:sdks:java:io:bigquery-io-perf-tests:testClasses (Thread[Execution worker for ':' Thread 2,5,main])
started.

> Task :sdks:java:io:bigquery-io-perf-tests:testClasses UP-TO-DATE
Skipping task ':sdks:java:io:bigquery-io-perf-tests:testClasses' as it has no actions.
:sdks:java:io:bigquery-io-perf-tests:testClasses (Thread[Execution worker for ':' Thread 2,5,main])
completed. Took 0.0 secs.

> Task :runners:google-cloud-dataflow-java:compileTestJava FROM-CACHE
Build cache key for task ':runners:google-cloud-dataflow-java:compileTestJava' is ec59e7fafddf9090750749358562cd02
Task ':runners:google-cloud-dataflow-java:compileTestJava' is not up-to-date because:
  No history is available.
Origin for org.gradle.api.internal.tasks.execution.ExecuteActionsTaskExecuter$TaskExecution@5c82aa36:
{executionTime=47433, hostName=apache-beam-jenkins-15, operatingSystem=Linux, buildInvocationId=lpvpqz2p55bq3bzsxxcymn3fsq,
creationTime=1568095612891, identity=:runners:google-cloud-dataflow-java:compileTestJava,
type=org.gradle.api.internal.tasks.execution.ExecuteActionsTaskExecuter.TaskExecution, userName=jenkins,
gradleVersion=5.2.1, rootPath=/home/jenkins/jenkins-slave/workspace/beam_PreCommit_Java_Cron/src}
Unpacked trees for task ':runners:google-cloud-dataflow-java:compileTestJava' from cache.
:runners:google-cloud-dataflow-java:compileTestJava (Thread[Execution worker for ':' Thread
6,5,main]) completed. Took 0.113 secs.
:runners:google-cloud-dataflow-java:testClasses (Thread[Execution worker for ':' Thread 6,5,main])
started.

> Task :runners:google-cloud-dataflow-java:testClasses UP-TO-DATE
Skipping task ':runners:google-cloud-dataflow-java:testClasses' as it has no actions.
:runners:google-cloud-dataflow-java:testClasses (Thread[Execution worker for ':' Thread 6,5,main])
completed. Took 0.0 secs.
:runners:google-cloud-dataflow-java:testJar (Thread[Execution worker for ':' Thread 6,5,main])
started.

> Task :runners:google-cloud-dataflow-java:testJar
Build cache key for task ':runners:google-cloud-dataflow-java:testJar' is 8eebb657447beb2d98743540cf8324ce
Caching disabled for task ':runners:google-cloud-dataflow-java:testJar': Caching has not been
enabled for the task
Task ':runners:google-cloud-dataflow-java:testJar' is not up-to-date because:
  No history is available.
:runners:google-cloud-dataflow-java:testJar (Thread[Execution worker for ':' Thread 6,5,main])
completed. Took 0.025 secs.

> Task :runners:google-cloud-dataflow-java:worker:legacy-worker:shadowJar
Build cache key for task ':runners:google-cloud-dataflow-java:worker:legacy-worker:shadowJar'
is e3f33c0f7902599cb6f5ec40dc833e94
Caching disabled for task ':runners:google-cloud-dataflow-java:worker:legacy-worker:shadowJar':
Caching has not been enabled for the task
Task ':runners:google-cloud-dataflow-java:worker:legacy-worker:shadowJar' is not up-to-date
because:
  No history is available.
Custom actions are attached to task ':runners:google-cloud-dataflow-java:worker:legacy-worker:shadowJar'.
*******************
GRADLE SHADOW STATS

Total Jars: 16 (includes project)
Total Time: 3.331s [3331ms]
Average Time/Jar: 0.2081875s [208.1875ms]
*******************
:runners:google-cloud-dataflow-java:worker:legacy-worker:shadowJar (Thread[Execution worker
for ':',5,main]) completed. Took 4.198 secs.
:sdks:java:io:bigquery-io-perf-tests:integrationTest (Thread[Execution worker for ':',5,main])
started.
Gradle Test Executor 1 started executing tests.

> Task :sdks:java:io:bigquery-io-perf-tests:integrationTest
Build cache key for task ':sdks:java:io:bigquery-io-perf-tests:integrationTest' is c4b80e71f51dee8262ee482f362ac658
Task ':sdks:java:io:bigquery-io-perf-tests:integrationTest' is not up-to-date because:
  Task.upToDateWhen is false.
Custom actions are attached to task ':sdks:java:io:bigquery-io-perf-tests:integrationTest'.
Starting process 'Gradle Test Executor 1'. Working directory: <https://builds.apache.org/job/beam_BiqQueryIO_Batch_Performance_Test_Java/ws/src/sdks/java/io/bigquery-io-perf-tests>
Command: /usr/lib/jvm/java-8-openjdk-amd64/bin/java -DbeamTestPipelineOptions=["--project=apache-beam-testing","--tempLocation=gs://temp-storage-for-perf-tests/loadtests","--tempRoot=gs://temp-storage-for-perf-tests/loadtests","--writeMethod=FILE_LOADS","--publishToBigQuery=true","--testBigQueryDataset=beam_performance","--testBigQueryTable=bqio_write_10GB_java","--metricsBigQueryDataset=beam_performance","--metricsBigQueryTable=bqio_10GB_results_java_batch","--sourceOptions={'numRecords':
10485760,'keySizeBytes': 1,'valueSizeBytes': 1024}","--runner=DataflowRunner","--maxNumWorkers=5","--numWorkers=5","--autoscalingAlgorithm=NONE","--workerHarnessContainerImage=","--dataflowWorkerJar=${dataflowWorkerJar}"]
-Djava.security.manager=worker.org.gradle.process.internal.worker.child.BootstrapSecurityManager
-Dorg.gradle.native=false -Xmx2g -Dfile.encoding=UTF-8 -Duser.country=US -Duser.language=en
-Duser.variant -ea -cp /home/jenkins/.gradle/caches/5.2.1/workerMain/gradle-worker.jar worker.org.gradle.process.internal.worker.GradleWorkerMain
'Gradle Test Executor 1'
Successfully started process 'Gradle Test Executor 1'

org.apache.beam.sdk.bigqueryioperftests.BigQueryIOIT STANDARD_ERROR
    SLF4J: Class path contains multiple SLF4J bindings.
    SLF4J: Found binding in [jar:<https://builds.apache.org/job/beam_BiqQueryIO_Batch_Performance_Test_Java/ws/src/runners/google-cloud-dataflow-java/worker/legacy-worker/build/libs/beam-runners-google-cloud-dataflow-java-legacy-worker-2.16.0-SNAPSHOT.jar!/org/slf4j/impl/StaticLoggerBinder.class]>
    SLF4J: Found binding in [jar:file:/home/jenkins/.gradle/caches/modules-2/files-2.1/org.slf4j/slf4j-jdk14/1.7.25/bccda40ebc8067491b32a88f49615a747d20082d/slf4j-jdk14-1.7.25.jar!/org/slf4j/impl/StaticLoggerBinder.class]
    SLF4J: See http://www.slf4j.org/codes.html#multiple_bindings for an explanation.
    SLF4J: Actual binding is of type [org.slf4j.impl.JDK14LoggerFactory]

Gradle Test Executor 1 finished executing tests.

> Task :sdks:java:io:bigquery-io-perf-tests:integrationTest FAILED

org.apache.beam.sdk.bigqueryioperftests.BigQueryIOIT > classMethod FAILED
    java.lang.IllegalArgumentException: Class interface org.apache.beam.sdk.testing.TestPipelineOptions
missing a property named 'publishToBigQuery'.
        at org.apache.beam.sdk.options.PipelineOptionsFactory.parseObjects(PipelineOptionsFactory.java:1625)
        at org.apache.beam.sdk.options.PipelineOptionsFactory.access$400(PipelineOptionsFactory.java:115)
        at org.apache.beam.sdk.options.PipelineOptionsFactory$Builder.as(PipelineOptionsFactory.java:298)
        at org.apache.beam.sdk.testing.TestPipeline.testingPipelineOptions(TestPipeline.java:451)
        at org.apache.beam.sdk.io.common.IOITHelper.readIOTestPipelineOptions(IOITHelper.java:48)
        at org.apache.beam.sdk.bigqueryioperftests.BigQueryIOIT.setup(BigQueryIOIT.java:92)

org.apache.beam.sdk.bigqueryioperftests.BigQueryIOIT > classMethod FAILED
    java.lang.NullPointerException
        at com.google.common.base.Preconditions.checkNotNull(Preconditions.java:770)
        at com.google.cloud.bigquery.TableId.of(TableId.java:86)
        at org.apache.beam.sdk.bigqueryioperftests.BigQueryIOIT.tearDown(BigQueryIOIT.java:110)

2 tests completed, 2 failed
Finished generating test XML results (0.014 secs) into: <https://builds.apache.org/job/beam_BiqQueryIO_Batch_Performance_Test_Java/ws/src/sdks/java/io/bigquery-io-perf-tests/build/test-results/integrationTest>
Generating HTML test report...
Finished generating test html results (0.021 secs) into: <https://builds.apache.org/job/beam_BiqQueryIO_Batch_Performance_Test_Java/ws/src/sdks/java/io/bigquery-io-perf-tests/build/reports/tests/integrationTest>
:sdks:java:io:bigquery-io-perf-tests:integrationTest (Thread[Execution worker for ':',5,main])
completed. Took 2.977 secs.

FAILURE: Build failed with an exception.

* What went wrong:
Execution failed for task ':sdks:java:io:bigquery-io-perf-tests:integrationTest'.
> There were failing tests. See the report at: file://<https://builds.apache.org/job/beam_BiqQueryIO_Batch_Performance_Test_Java/ws/src/sdks/java/io/bigquery-io-perf-tests/build/reports/tests/integrationTest/index.html>

* Try:
Run with --stacktrace option to get the stack trace. Run with --debug option to get more log
output. Run with --scan to get full insights.

* Get more help at https://help.gradle.org

Deprecated Gradle features were used in this build, making it incompatible with Gradle 6.0.
Use '--warning-mode all' to show the individual deprecation warnings.
See https://docs.gradle.org/5.2.1/userguide/command_line_interface.html#sec:command_line_warnings

BUILD FAILED in 43s
80 actionable tasks: 52 executed, 28 from cache

Publishing build scan...
https://gradle.com/s/llddzutrg3usu

Build step 'Invoke Gradle script' changed build result to FAILURE
Build step 'Invoke Gradle script' marked build as failure

---------------------------------------------------------------------
To unsubscribe, e-mail: builds-unsubscribe@beam.apache.org
For additional commands, e-mail: builds-help@beam.apache.org


Mime
View raw message