beam-builds mailing list archives

Site index · List index
Message view « Date » · « Thread »
Top « Date » · « Thread »
From Apache Jenkins Server <jenk...@builds.apache.org>
Subject Build failed in Jenkins: beam_PerformanceTests_WordCountIT_Py35 #467
Date Mon, 09 Sep 2019 19:09:26 GMT
See <https://builds.apache.org/job/beam_PerformanceTests_WordCountIT_Py35/467/display/redirect?page=changes>

Changes:

[robertwb] Fix docker workers on os-x.

[github] Revert "[BEAM-5878] support DoFns with Keyword-only arguments (#9237)"

[ostrokach] [BEAM-8170] Don't import PyArrow on Python 2 + Windows

[lostluck] Replace tabs with spaces

------------------------------------------
[...truncated 59.38 KB...]
Collecting mock<3.0.0,>=1.0.1 (from apache-beam==2.16.0.dev0)
  Using cached https://files.pythonhosted.org/packages/e6/35/f187bdf23be87092bd0f1200d43d23076cee4d0dec109f195173fd3ebc79/mock-2.0.0-py2.py3-none-any.whl
Collecting pymongo<4.0.0,>=3.8.0 (from apache-beam==2.16.0.dev0)
  Using cached https://files.pythonhosted.org/packages/fe/96/3f43c48b2801e5cefe893421d67640cdc2b7cd940a51790b5c2062fb044e/pymongo-3.9.0-cp35-cp35m-manylinux1_x86_64.whl
Collecting oauth2client<4,>=2.0.1 (from apache-beam==2.16.0.dev0)
Requirement already satisfied: protobuf<4,>=3.5.0.post1 in <https://builds.apache.org/job/beam_PerformanceTests_WordCountIT_Py35/ws/src/build/gradleenv/-1734967054/lib/python3.5/site-packages>
(from apache-beam==2.16.0.dev0) (3.9.1)
Collecting pydot<2,>=1.2.0 (from apache-beam==2.16.0.dev0)
  Using cached https://files.pythonhosted.org/packages/33/d1/b1479a770f66d962f545c2101630ce1d5592d90cb4f083d38862e93d16d2/pydot-1.4.1-py2.py3-none-any.whl
Collecting python-dateutil<3,>=2.8.0 (from apache-beam==2.16.0.dev0)
  Using cached https://files.pythonhosted.org/packages/41/17/c62faccbfbd163c7f57f3844689e3a78bae1f403648a6afb1d0866d87fbb/python_dateutil-2.8.0-py2.py3-none-any.whl
Collecting pytz>=2018.3 (from apache-beam==2.16.0.dev0)
  Using cached https://files.pythonhosted.org/packages/87/76/46d697698a143e05f77bec5a526bf4e56a0be61d63425b68f4ba553b51f2/pytz-2019.2-py2.py3-none-any.whl
Collecting pyyaml<4.0.0,>=3.12 (from apache-beam==2.16.0.dev0)
Collecting pyarrow<0.15.0,>=0.11.1 (from apache-beam==2.16.0.dev0)
  Using cached https://files.pythonhosted.org/packages/54/95/bcbe5658d6ac65af35996a80ed66d82c50f9c0b36424f4758cd54dd08d73/pyarrow-0.14.1-cp35-cp35m-manylinux2010_x86_64.whl
Collecting avro-python3<2.0.0,>=1.8.1 (from apache-beam==2.16.0.dev0)
Collecting cachetools<4,>=3.1.0 (from apache-beam==2.16.0.dev0)
  Using cached https://files.pythonhosted.org/packages/2f/a6/30b0a0bef12283e83e58c1d6e7b5aabc7acfc4110df81a4471655d33e704/cachetools-3.1.1-py2.py3-none-any.whl
Collecting google-apitools<0.5.29,>=0.5.28 (from apache-beam==2.16.0.dev0)
Collecting google-cloud-datastore<1.8.0,>=1.7.1 (from apache-beam==2.16.0.dev0)
  Using cached https://files.pythonhosted.org/packages/d0/aa/29cbcf8cf7d08ce2d55b9dce858f7c632b434cb6451bed17cb4275804217/google_cloud_datastore-1.7.4-py2.py3-none-any.whl
Collecting google-cloud-pubsub<0.40.0,>=0.39.0 (from apache-beam==2.16.0.dev0)
  Using cached https://files.pythonhosted.org/packages/c0/9a/4455b1c1450e9b912855b58ca6eee7a27ff1e9b52e4d98c243d93256f469/google_cloud_pubsub-0.39.1-py2.py3-none-any.whl
Collecting google-cloud-bigquery<1.18.0,>=1.6.0 (from apache-beam==2.16.0.dev0)
  Using cached https://files.pythonhosted.org/packages/d7/72/e88edd9a0b3c16a7b2c4107b1a9d3ff182b84a29f051ae15293e1375d7fe/google_cloud_bigquery-1.17.0-py2.py3-none-any.whl
Collecting google-cloud-core<2,>=0.28.1 (from apache-beam==2.16.0.dev0)
  Using cached https://files.pythonhosted.org/packages/ee/f0/084f598629db8e6ec3627688723875cdb03637acb6d86999bb105a71df64/google_cloud_core-1.0.3-py2.py3-none-any.whl
Collecting google-cloud-bigtable<0.33.0,>=0.31.1 (from apache-beam==2.16.0.dev0)
  Using cached https://files.pythonhosted.org/packages/08/77/b468e209dbb0a6f614e6781f06a4894299a4c6167c2c525cc086caa7c075/google_cloud_bigtable-0.32.2-py2.py3-none-any.whl
Collecting nose>=1.3.7 (from apache-beam==2.16.0.dev0)
  Using cached https://files.pythonhosted.org/packages/15/d8/dd071918c040f50fa1cf80da16423af51ff8ce4a0f2399b7bf8de45ac3d9/nose-1.3.7-py3-none-any.whl
Collecting nose_xunitmp>=0.4.1 (from apache-beam==2.16.0.dev0)
Collecting numpy<2,>=1.14.3 (from apache-beam==2.16.0.dev0)
  Using cached https://files.pythonhosted.org/packages/9b/21/2b18339d24a2f73dcefb2f10f48aff6182e16da83e3a612684443c6cfb29/numpy-1.17.2-cp35-cp35m-manylinux1_x86_64.whl
Collecting pandas<0.25,>=0.23.4 (from apache-beam==2.16.0.dev0)
  Using cached https://files.pythonhosted.org/packages/74/24/0cdbf8907e1e3bc5a8da03345c23cbed7044330bb8f73bb12e711a640a00/pandas-0.24.2-cp35-cp35m-manylinux1_x86_64.whl
Collecting parameterized<0.7.0,>=0.6.0 (from apache-beam==2.16.0.dev0)
  Using cached https://files.pythonhosted.org/packages/3a/49/75f6dadb09e2f8ace3cdffe0c99a04f1b98dff41fbf9e768665d8b469e29/parameterized-0.6.3-py2.py3-none-any.whl
Collecting pyhamcrest<2.0,>=1.9 (from apache-beam==2.16.0.dev0)
  Using cached https://files.pythonhosted.org/packages/9a/d5/d37fd731b7d0e91afcc84577edeccf4638b4f9b82f5ffe2f8b62e2ddc609/PyHamcrest-1.9.0-py2.py3-none-any.whl
Collecting tenacity<6.0,>=5.0.2 (from apache-beam==2.16.0.dev0)
  Using cached https://files.pythonhosted.org/packages/1e/a1/be8c8610f4620c56790965ba2b564dd76d13cbcd7c2ff8f6053ce63027fb/tenacity-5.1.1-py2.py3-none-any.whl
Requirement already satisfied: six>=1.5.2 in <https://builds.apache.org/job/beam_PerformanceTests_WordCountIT_Py35/ws/src/build/gradleenv/-1734967054/lib/python3.5/site-packages>
(from grpcio<2,>=1.12.1->apache-beam==2.16.0.dev0) (1.12.0)
Collecting requests>=2.7.0 (from hdfs<3.0.0,>=2.1.0->apache-beam==2.16.0.dev0)
  Using cached https://files.pythonhosted.org/packages/51/bd/23c926cd341ea6b7dd0b2a00aba99ae0f828be89d72b2190f27c11d4b7fb/requests-2.22.0-py2.py3-none-any.whl
Collecting docopt (from hdfs<3.0.0,>=2.1.0->apache-beam==2.16.0.dev0)
Collecting pbr>=0.11 (from mock<3.0.0,>=1.0.1->apache-beam==2.16.0.dev0)
  Using cached https://files.pythonhosted.org/packages/46/a4/d5c83831a3452713e4b4f126149bc4fbda170f7cb16a86a00ce57ce0e9ad/pbr-5.4.3-py2.py3-none-any.whl
Collecting pyasn1-modules>=0.0.5 (from oauth2client<4,>=2.0.1->apache-beam==2.16.0.dev0)
  Using cached https://files.pythonhosted.org/packages/be/70/e5ea8afd6d08a4b99ebfc77bd1845248d56cfcf43d11f9dc324b9580a35c/pyasn1_modules-0.2.6-py2.py3-none-any.whl
Collecting pyasn1>=0.1.7 (from oauth2client<4,>=2.0.1->apache-beam==2.16.0.dev0)
  Using cached https://files.pythonhosted.org/packages/a1/71/8f0d444e3a74e5640a3d5d967c1c6b015da9c655f35b2d308a55d907a517/pyasn1-0.4.7-py2.py3-none-any.whl
Collecting rsa>=3.1.4 (from oauth2client<4,>=2.0.1->apache-beam==2.16.0.dev0)
  Using cached https://files.pythonhosted.org/packages/02/e5/38518af393f7c214357079ce67a317307936896e961e35450b70fad2a9cf/rsa-4.0-py2.py3-none-any.whl
Requirement already satisfied: setuptools in <https://builds.apache.org/job/beam_PerformanceTests_WordCountIT_Py35/ws/src/build/gradleenv/-1734967054/lib/python3.5/site-packages>
(from protobuf<4,>=3.5.0.post1->apache-beam==2.16.0.dev0) (41.2.0)
Collecting pyparsing>=2.1.4 (from pydot<2,>=1.2.0->apache-beam==2.16.0.dev0)
  Using cached https://files.pythonhosted.org/packages/11/fa/0160cd525c62d7abd076a070ff02b2b94de589f1a9789774f17d7c54058e/pyparsing-2.4.2-py2.py3-none-any.whl
Collecting fasteners>=0.14 (from google-apitools<0.5.29,>=0.5.28->apache-beam==2.16.0.dev0)
  Using cached https://files.pythonhosted.org/packages/18/bd/55eb2d6397b9c0e263af9d091ebdb756b15756029b3cededf6461481bc63/fasteners-0.15-py2.py3-none-any.whl
Collecting google-api-core[grpc]<2.0.0dev,>=1.6.0 (from google-cloud-datastore<1.8.0,>=1.7.1->apache-beam==2.16.0.dev0)
  Using cached https://files.pythonhosted.org/packages/71/e5/7059475b3013a3c75abe35015c5761735ab224eb1b129fee7c8e376e7805/google_api_core-1.14.2-py2.py3-none-any.whl
Collecting grpc-google-iam-v1<0.12dev,>=0.11.4 (from google-cloud-pubsub<0.40.0,>=0.39.0->apache-beam==2.16.0.dev0)
Collecting google-resumable-media>=0.3.1 (from google-cloud-bigquery<1.18.0,>=1.6.0->apache-beam==2.16.0.dev0)
  Using cached https://files.pythonhosted.org/packages/f0/5e/cebf1313c256e9e7e1ad730862e76b6a0953b720ae1be116aa2d5b9f5107/google_resumable_media-0.4.0-py2.py3-none-any.whl
Collecting chardet<3.1.0,>=3.0.2 (from requests>=2.7.0->hdfs<3.0.0,>=2.1.0->apache-beam==2.16.0.dev0)
  Using cached https://files.pythonhosted.org/packages/bc/a9/01ffebfb562e4274b6487b4bb1ddec7ca55ec7510b22e4c51f14098443b8/chardet-3.0.4-py2.py3-none-any.whl
Collecting idna<2.9,>=2.5 (from requests>=2.7.0->hdfs<3.0.0,>=2.1.0->apache-beam==2.16.0.dev0)
  Using cached https://files.pythonhosted.org/packages/14/2c/cd551d81dbe15200be1cf41cd03869a46fe7226e7450af7a6545bfc474c9/idna-2.8-py2.py3-none-any.whl
Collecting certifi>=2017.4.17 (from requests>=2.7.0->hdfs<3.0.0,>=2.1.0->apache-beam==2.16.0.dev0)
  Using cached https://files.pythonhosted.org/packages/69/1b/b853c7a9d4f6a6d00749e94eb6f3a041e342a885b87340b79c1ef73e3a78/certifi-2019.6.16-py2.py3-none-any.whl
Collecting urllib3!=1.25.0,!=1.25.1,<1.26,>=1.21.1 (from requests>=2.7.0->hdfs<3.0.0,>=2.1.0->apache-beam==2.16.0.dev0)
  Using cached https://files.pythonhosted.org/packages/e6/60/247f23a7121ae632d62811ba7f273d0e58972d75e58a94d329d51550a47d/urllib3-1.25.3-py2.py3-none-any.whl
Collecting monotonic>=0.1 (from fasteners>=0.14->google-apitools<0.5.29,>=0.5.28->apache-beam==2.16.0.dev0)
  Using cached https://files.pythonhosted.org/packages/ac/aa/063eca6a416f397bd99552c534c6d11d57f58f2e94c14780f3bbf818c4cf/monotonic-1.5-py2.py3-none-any.whl
Collecting google-auth<2.0dev,>=0.4.0 (from google-api-core[grpc]<2.0.0dev,>=1.6.0->google-cloud-datastore<1.8.0,>=1.7.1->apache-beam==2.16.0.dev0)
  Using cached https://files.pythonhosted.org/packages/c5/9b/ed0516cc1f7609fb0217e3057ff4f0f9f3e3ce79a369c6af4a6c5ca25664/google_auth-1.6.3-py2.py3-none-any.whl
Collecting googleapis-common-protos<2.0dev,>=1.6.0 (from google-api-core[grpc]<2.0.0dev,>=1.6.0->google-cloud-datastore<1.8.0,>=1.7.1->apache-beam==2.16.0.dev0)
Installing collected packages: crcmod, dill, fastavro, future, chardet, idna, certifi, urllib3,
requests, docopt, hdfs, httplib2, pbr, mock, pymongo, pyasn1, pyasn1-modules, rsa, oauth2client,
pyparsing, pydot, python-dateutil, pytz, pyyaml, numpy, pyarrow, avro-python3, cachetools,
monotonic, fasteners, google-apitools, google-auth, googleapis-common-protos, google-api-core,
google-cloud-core, google-cloud-datastore, grpc-google-iam-v1, google-cloud-pubsub, google-resumable-media,
google-cloud-bigquery, google-cloud-bigtable, nose, nose-xunitmp, pandas, parameterized, pyhamcrest,
tenacity, apache-beam
  Running setup.py develop for apache-beam
Successfully installed apache-beam avro-python3-1.9.1 cachetools-3.1.1 certifi-2019.6.16 chardet-3.0.4
crcmod-1.7 dill-0.3.0 docopt-0.6.2 fastavro-0.21.24 fasteners-0.15 future-0.17.1 google-api-core-1.14.2
google-apitools-0.5.28 google-auth-1.6.3 google-cloud-bigquery-1.17.0 google-cloud-bigtable-0.32.2
google-cloud-core-1.0.3 google-cloud-datastore-1.7.4 google-cloud-pubsub-0.39.1 google-resumable-media-0.4.0
googleapis-common-protos-1.6.0 grpc-google-iam-v1-0.11.4 hdfs-2.5.8 httplib2-0.12.0 idna-2.8
mock-2.0.0 monotonic-1.5 nose-1.3.7 nose-xunitmp-0.4.1 numpy-1.17.2 oauth2client-3.0.0 pandas-0.24.2
parameterized-0.6.3 pbr-5.4.3 pyarrow-0.14.1 pyasn1-0.4.7 pyasn1-modules-0.2.6 pydot-1.4.1
pyhamcrest-1.9.0 pymongo-3.9.0 pyparsing-2.4.2 python-dateutil-2.8.0 pytz-2019.2 pyyaml-3.13
requests-2.22.0 rsa-4.0 tenacity-5.1.1 urllib3-1.25.3
:sdks:python:test-suites:dataflow:py35:installGcpTest (Thread[Execution worker for ':',5,main])
completed. Took 18.045 secs.
:sdks:python:test-suites:dataflow:py35:integrationTest (Thread[Execution worker for ':',5,main])
started.

> Task :sdks:python:test-suites:dataflow:py35:integrationTest
Caching disabled for task ':sdks:python:test-suites:dataflow:py35:integrationTest': Caching
has not been enabled for the task
Task ':sdks:python:test-suites:dataflow:py35:integrationTest' is not up-to-date because:
  Task has not declared any outputs despite executing actions.
Custom actions are attached to task ':sdks:python:test-suites:dataflow:py35:integrationTest'.
Starting process 'command 'sh''. Working directory: <https://builds.apache.org/job/beam_PerformanceTests_WordCountIT_Py35/ws/src/sdks/python/test-suites/dataflow/py35>
Command: sh -c . <https://builds.apache.org/job/beam_PerformanceTests_WordCountIT_Py35/ws/src/build/gradleenv/-1734967054/bin/activate>
&& <https://builds.apache.org/job/beam_PerformanceTests_WordCountIT_Py35/ws/src/sdks/python/scripts/run_integration_test.sh>
--test_opts "--tests=apache_beam.examples.wordcount_it_test:WordCountIT.test_wordcount_it
--attr=IT --nocapture" --pipeline_opts "--project=apache-beam-testing --staging_location=gs://temp-storage-for-end-to-end-tests/staging-it
--temp_location=gs://temp-storage-for-end-to-end-tests/temp-it --input=gs://apache-beam-samples/input_small_files/ascii_sort_1MB_input.0000*
--output=gs://temp-storage-for-end-to-end-tests/py-it-cloud/output --expect_checksum=ea0ca2e5ee4ea5f218790f28d0b9fe7d09d8d710
--num_workers=10 --autoscaling_algorithm=NONE --runner=TestDataflowRunner --sdk_location=build/apache-beam.tar.gz"
--suite integrationTest-perf
Successfully started process 'command 'sh''
>>> RUNNING integration tests with pipeline options: --project=apache-beam-testing
--staging_location=gs://temp-storage-for-end-to-end-tests/staging-it --temp_location=gs://temp-storage-for-end-to-end-tests/temp-it
--input=gs://apache-beam-samples/input_small_files/ascii_sort_1MB_input.0000* --output=gs://temp-storage-for-end-to-end-tests/py-it-cloud/output
--expect_checksum=ea0ca2e5ee4ea5f218790f28d0b9fe7d09d8d710 --num_workers=10 --autoscaling_algorithm=NONE
--runner=TestDataflowRunner --sdk_location=build/apache-beam.tar.gz
>>>   test options: --tests=apache_beam.examples.wordcount_it_test:WordCountIT.test_wordcount_it
--attr=IT --nocapture
running nosetests
running egg_info
writing dependency_links to apache_beam.egg-info/dependency_links.txt
writing entry points to apache_beam.egg-info/entry_points.txt
writing top-level names to apache_beam.egg-info/top_level.txt
writing apache_beam.egg-info/PKG-INFO
writing requirements to apache_beam.egg-info/requires.txt
reading manifest file 'apache_beam.egg-info/SOURCES.txt'
reading manifest template 'MANIFEST.in'
writing manifest file 'apache_beam.egg-info/SOURCES.txt'

STDERR: DEPRECATION: Python 2.7 will reach the end of its life on January 1st, 2020. Please
upgrade your Python as Python 2.7 won't be maintained after that date. A future version of
pip will drop support for Python 2.7. More details about Python 2 support in pip, can be found
at https://pip.pypa.io/en/latest/development/release-process/#python-2-support
<https://builds.apache.org/job/beam_PerformanceTests_WordCountIT_Py35/ws/src/build/gradleenv/1922375555/local/lib/python2.7/site-packages/setuptools/dist.py>:474:
UserWarning: Normalizing '2.16.0.dev' to '2.16.0.dev0'
  normalized_version,
beam_fn_api.proto: warning: Import google/protobuf/descriptor.proto but not used.
beam_fn_api.proto: warning: Import google/protobuf/wrappers.proto but not used.
DEPRECATION: Python 2.7 will reach the end of its life on January 1st, 2020. Please upgrade
your Python as Python 2.7 won't be maintained after that date. A future version of pip will
drop support for Python 2.7. More details about Python 2 support in pip, can be found at https://pip.pypa.io/en/latest/development/release-process/#python-2-support
root: Generating grammar tables from /usr/lib/python2.7/lib2to3/PatternGrammar.txt
root: Generating grammar tables from /usr/lib/python2.7/lib2to3/PatternGrammar.txt
root: Generating grammar tables from /usr/lib/python2.7/lib2to3/PatternGrammar.txt
root: Generating grammar tables from /usr/lib/python2.7/lib2to3/PatternGrammar.txt
root: Generating grammar tables from /usr/lib/python2.7/lib2to3/PatternGrammar.txt
root: Generating grammar tables from /usr/lib/python2.7/lib2to3/PatternGrammar.txt
root: Generating grammar tables from /usr/lib/python2.7/lib2to3/PatternGrammar.txt
root: Generating grammar tables from /usr/lib/python2.7/lib2to3/PatternGrammar.txt
root: Generating grammar tables from /usr/lib/python2.7/lib2to3/PatternGrammar.txt
root: Generating grammar tables from /usr/lib/python2.7/lib2to3/PatternGrammar.txt
root: Generating grammar tables from /usr/lib/python2.7/lib2to3/PatternGrammar.txt
root: Generating grammar tables from /usr/lib/python2.7/lib2to3/PatternGrammar.txt
RefactoringTool: Skipping optional fixer: idioms
root: Generating grammar tables from /usr/lib/python2.7/lib2to3/PatternGrammar.txt
root: Generating grammar tables from /usr/lib/python2.7/lib2to3/PatternGrammar.txt
root: Generating grammar tables from /usr/lib/python2.7/lib2to3/PatternGrammar.txt
root: Generating grammar tables from /usr/lib/python2.7/lib2to3/PatternGrammar.txt
root: Generating grammar tables from /usr/lib/python2.7/lib2to3/PatternGrammar.txt
root: Generating grammar tables from /usr/lib/python2.7/lib2to3/PatternGrammar.txt
root: Generating grammar tables from /usr/lib/python2.7/lib2to3/PatternGrammar.txt
root: Generating grammar tables from /usr/lib/python2.7/lib2to3/PatternGrammar.txt
root: Generating grammar tables from /usr/lib/python2.7/lib2to3/PatternGrammar.txt
root: Generating grammar tables from /usr/lib/python2.7/lib2to3/PatternGrammar.txt
root: Generating grammar tables from /usr/lib/python2.7/lib2to3/PatternGrammar.txt
root: Generating grammar tables from /usr/lib/python2.7/lib2to3/PatternGrammar.txt
root: Generating grammar tables from /usr/lib/python2.7/lib2to3/PatternGrammar.txt
root: Generating grammar tables from /usr/lib/python2.7/lib2to3/PatternGrammar.txt
root: Generating grammar tables from /usr/lib/python2.7/lib2to3/PatternGrammar.txt
root: Generating grammar tables from /usr/lib/python2.7/lib2to3/PatternGrammar.txt
root: Generating grammar tables from /usr/lib/python2.7/lib2to3/PatternGrammar.txt
root: Generating grammar tables from /usr/lib/python2.7/lib2to3/PatternGrammar.txt
root: Generating grammar tables from /usr/lib/python2.7/lib2to3/PatternGrammar.txt
root: Generating grammar tables from /usr/lib/python2.7/lib2to3/PatternGrammar.txt
root: Generating grammar tables from /usr/lib/python2.7/lib2to3/PatternGrammar.txt
root: Generating grammar tables from /usr/lib/python2.7/lib2to3/PatternGrammar.txt
root: Generating grammar tables from /usr/lib/python2.7/lib2to3/PatternGrammar.txt
RefactoringTool: Skipping optional fixer: ws_comma
root: Generating grammar tables from /usr/lib/python2.7/lib2to3/PatternGrammar.txt
root: Generating grammar tables from /usr/lib/python2.7/lib2to3/PatternGrammar.txt
root: Generating grammar tables from /usr/lib/python2.7/lib2to3/PatternGrammar.txt
root: Generating grammar tables from /usr/lib/python2.7/lib2to3/PatternGrammar.txt
root: Generating grammar tables from /usr/lib/python2.7/lib2to3/PatternGrammar.txt
root: Generating grammar tables from /usr/lib/python2.7/lib2to3/PatternGrammar.txt
root: Generating grammar tables from /usr/lib/python2.7/lib2to3/PatternGrammar.txt
root: Generating grammar tables from /usr/lib/python2.7/lib2to3/PatternGrammar.txt
root: Generating grammar tables from /usr/lib/python2.7/lib2to3/PatternGrammar.txt
root: Generating grammar tables from /usr/lib/python2.7/lib2to3/PatternGrammar.txt
root: Generating grammar tables from /usr/lib/python2.7/lib2to3/PatternGrammar.txt
root: Generating grammar tables from /usr/lib/python2.7/lib2to3/PatternGrammar.txt
root: Generating grammar tables from /usr/lib/python2.7/lib2to3/PatternGrammar.txt
root: Generating grammar tables from /usr/lib/python2.7/lib2to3/PatternGrammar.txt
root: Generating grammar tables from /usr/lib/python2.7/lib2to3/PatternGrammar.txt
root: Generating grammar tables from /usr/lib/python2.7/lib2to3/PatternGrammar.txt
root: Generating grammar tables from /usr/lib/python2.7/lib2to3/PatternGrammar.txt
root: Generating grammar tables from /usr/lib/python2.7/lib2to3/PatternGrammar.txt
root: Generating grammar tables from /usr/lib/python2.7/lib2to3/PatternGrammar.txt
root: Generating grammar tables from /usr/lib/python2.7/lib2to3/PatternGrammar.txt
root: Generating grammar tables from /usr/lib/python2.7/lib2to3/PatternGrammar.txt
RefactoringTool: No changes to <https://builds.apache.org/job/beam_PerformanceTests_WordCountIT_Py35/ws/src/sdks/python/apache_beam/portability/api/beam_artifact_api_pb2.py>
RefactoringTool: Refactored <https://builds.apache.org/job/beam_PerformanceTests_WordCountIT_Py35/ws/src/sdks/python/apache_beam/portability/api/beam_artifact_api_pb2_grpc.py>
RefactoringTool: Refactored <https://builds.apache.org/job/beam_PerformanceTests_WordCountIT_Py35/ws/src/sdks/python/apache_beam/portability/api/beam_expansion_api_pb2.py>
RefactoringTool: Refactored <https://builds.apache.org/job/beam_PerformanceTests_WordCountIT_Py35/ws/src/sdks/python/apache_beam/portability/api/beam_expansion_api_pb2_grpc.py>
RefactoringTool: Refactored <https://builds.apache.org/job/beam_PerformanceTests_WordCountIT_Py35/ws/src/sdks/python/apache_beam/portability/api/beam_fn_api_pb2.py>
RefactoringTool: Refactored <https://builds.apache.org/job/beam_PerformanceTests_WordCountIT_Py35/ws/src/sdks/python/apache_beam/portability/api/beam_fn_api_pb2_grpc.py>
RefactoringTool: Refactored <https://builds.apache.org/job/beam_PerformanceTests_WordCountIT_Py35/ws/src/sdks/python/apache_beam/portability/api/beam_job_api_pb2.py>
RefactoringTool: Refactored <https://builds.apache.org/job/beam_PerformanceTests_WordCountIT_Py35/ws/src/sdks/python/apache_beam/portability/api/beam_job_api_pb2_grpc.py>
RefactoringTool: No changes to <https://builds.apache.org/job/beam_PerformanceTests_WordCountIT_Py35/ws/src/sdks/python/apache_beam/portability/api/beam_provision_api_pb2.py>
RefactoringTool: Refactored <https://builds.apache.org/job/beam_PerformanceTests_WordCountIT_Py35/ws/src/sdks/python/apache_beam/portability/api/beam_provision_api_pb2_grpc.py>
RefactoringTool: Refactored <https://builds.apache.org/job/beam_PerformanceTests_WordCountIT_Py35/ws/src/sdks/python/apache_beam/portability/api/beam_runner_api_pb2.py>
RefactoringTool: No changes to <https://builds.apache.org/job/beam_PerformanceTests_WordCountIT_Py35/ws/src/sdks/python/apache_beam/portability/api/endpoints_pb2.py>
RefactoringTool: Refactored <https://builds.apache.org/job/beam_PerformanceTests_WordCountIT_Py35/ws/src/sdks/python/apache_beam/portability/api/external_transforms_pb2.py>
RefactoringTool: Refactored <https://builds.apache.org/job/beam_PerformanceTests_WordCountIT_Py35/ws/src/sdks/python/apache_beam/portability/api/metrics_pb2.py>
RefactoringTool: Refactored <https://builds.apache.org/job/beam_PerformanceTests_WordCountIT_Py35/ws/src/sdks/python/apache_beam/portability/api/standard_window_fns_pb2.py>
RefactoringTool: Files that were modified:
RefactoringTool: <https://builds.apache.org/job/beam_PerformanceTests_WordCountIT_Py35/ws/src/sdks/python/apache_beam/portability/api/beam_artifact_api_pb2.py>
RefactoringTool: <https://builds.apache.org/job/beam_PerformanceTests_WordCountIT_Py35/ws/src/sdks/python/apache_beam/portability/api/beam_artifact_api_pb2_grpc.py>
RefactoringTool: <https://builds.apache.org/job/beam_PerformanceTests_WordCountIT_Py35/ws/src/sdks/python/apache_beam/portability/api/beam_expansion_api_pb2.py>
RefactoringTool: <https://builds.apache.org/job/beam_PerformanceTests_WordCountIT_Py35/ws/src/sdks/python/apache_beam/portability/api/beam_expansion_api_pb2_grpc.py>
RefactoringTool: <https://builds.apache.org/job/beam_PerformanceTests_WordCountIT_Py35/ws/src/sdks/python/apache_beam/portability/api/beam_fn_api_pb2.py>
RefactoringTool: <https://builds.apache.org/job/beam_PerformanceTests_WordCountIT_Py35/ws/src/sdks/python/apache_beam/portability/api/beam_fn_api_pb2_grpc.py>
RefactoringTool: <https://builds.apache.org/job/beam_PerformanceTests_WordCountIT_Py35/ws/src/sdks/python/apache_beam/portability/api/beam_job_api_pb2.py>
RefactoringTool: <https://builds.apache.org/job/beam_PerformanceTests_WordCountIT_Py35/ws/src/sdks/python/apache_beam/portability/api/beam_job_api_pb2_grpc.py>
RefactoringTool: <https://builds.apache.org/job/beam_PerformanceTests_WordCountIT_Py35/ws/src/sdks/python/apache_beam/portability/api/beam_provision_api_pb2.py>
RefactoringTool: <https://builds.apache.org/job/beam_PerformanceTests_WordCountIT_Py35/ws/src/sdks/python/apache_beam/portability/api/beam_provision_api_pb2_grpc.py>
RefactoringTool: <https://builds.apache.org/job/beam_PerformanceTests_WordCountIT_Py35/ws/src/sdks/python/apache_beam/portability/api/beam_runner_api_pb2.py>
RefactoringTool: <https://builds.apache.org/job/beam_PerformanceTests_WordCountIT_Py35/ws/src/sdks/python/apache_beam/portability/api/endpoints_pb2.py>
RefactoringTool: <https://builds.apache.org/job/beam_PerformanceTests_WordCountIT_Py35/ws/src/sdks/python/apache_beam/portability/api/external_transforms_pb2.py>
RefactoringTool: <https://builds.apache.org/job/beam_PerformanceTests_WordCountIT_Py35/ws/src/sdks/python/apache_beam/portability/api/metrics_pb2.py>
RefactoringTool: <https://builds.apache.org/job/beam_PerformanceTests_WordCountIT_Py35/ws/src/sdks/python/apache_beam/portability/api/standard_window_fns_pb2.py>
warning: no files found matching 'README.md'
warning: no files found matching 'NOTICE'
warning: no files found matching 'LICENSE'
warning: cmd: standard file not found: should have one of README, README.rst, README.txt,
README.md

setup.py:179: UserWarning: Some syntactic constructs of Python 3 are not yet fully supported
by Apache Beam.
  'Some syntactic constructs of Python 3 are not yet fully supported by '
<https://builds.apache.org/job/beam_PerformanceTests_WordCountIT_Py35/ws/src/build/gradleenv/-1734967054/lib/python3.5/site-packages/setuptools/dist.py>:474:
UserWarning: Normalizing '2.16.0.dev' to '2.16.0.dev0'
  normalized_version,
warning: no files found matching 'README.md'
warning: no files found matching 'NOTICE'
warning: no files found matching 'LICENSE'
<https://builds.apache.org/job/beam_PerformanceTests_WordCountIT_Py35/ws/src/sdks/python/apache_beam/__init__.py>:84:
UserWarning: Some syntactic constructs of Python 3 are not yet fully supported by Apache Beam.
  'Some syntactic constructs of Python 3 are not yet fully supported by '
test_wordcount_it (apache_beam.examples.wordcount_it_test.WordCountIT) ... 
2019-09-09 19:08:37,375 e7e93695 MainThread beam_integration_benchmark(1/1) ERROR    Error
during benchmark beam_integration_benchmark
Traceback (most recent call last):
  File "<https://builds.apache.org/job/beam_PerformanceTests_WordCountIT_Py35/ws/PerfKitBenchmarker/perfkitbenchmarker/pkb.py",>
line 841, in RunBenchmark
    DoRunPhase(spec, collector, detailed_timer)
  File "<https://builds.apache.org/job/beam_PerformanceTests_WordCountIT_Py35/ws/PerfKitBenchmarker/perfkitbenchmarker/pkb.py",>
line 687, in DoRunPhase
    samples = spec.BenchmarkRun(spec)
  File "<https://builds.apache.org/job/beam_PerformanceTests_WordCountIT_Py35/ws/PerfKitBenchmarker/perfkitbenchmarker/linux_benchmarks/beam_integration_benchmark.py",>
line 160, in Run
    job_type=job_type)
  File "<https://builds.apache.org/job/beam_PerformanceTests_WordCountIT_Py35/ws/PerfKitBenchmarker/perfkitbenchmarker/providers/gcp/gcp_dpb_dataflow.py",>
line 91, in SubmitJob
    assert retcode == 0, "Integration Test Failed."
AssertionError: Integration Test Failed.
2019-09-09 19:08:37,377 e7e93695 MainThread beam_integration_benchmark(1/1) INFO     Cleaning
up benchmark beam_integration_benchmark
2019-09-09 19:08:37,379 e7e93695 MainThread beam_integration_benchmark(1/1) ERROR    Exception
running benchmark
Traceback (most recent call last):
  File "<https://builds.apache.org/job/beam_PerformanceTests_WordCountIT_Py35/ws/PerfKitBenchmarker/perfkitbenchmarker/pkb.py",>
line 984, in RunBenchmarkTask
    RunBenchmark(spec, collector)
  File "<https://builds.apache.org/job/beam_PerformanceTests_WordCountIT_Py35/ws/PerfKitBenchmarker/perfkitbenchmarker/pkb.py",>
line 841, in RunBenchmark
    DoRunPhase(spec, collector, detailed_timer)
  File "<https://builds.apache.org/job/beam_PerformanceTests_WordCountIT_Py35/ws/PerfKitBenchmarker/perfkitbenchmarker/pkb.py",>
line 687, in DoRunPhase
    samples = spec.BenchmarkRun(spec)
  File "<https://builds.apache.org/job/beam_PerformanceTests_WordCountIT_Py35/ws/PerfKitBenchmarker/perfkitbenchmarker/linux_benchmarks/beam_integration_benchmark.py",>
line 160, in Run
    job_type=job_type)
  File "<https://builds.apache.org/job/beam_PerformanceTests_WordCountIT_Py35/ws/PerfKitBenchmarker/perfkitbenchmarker/providers/gcp/gcp_dpb_dataflow.py",>
line 91, in SubmitJob
    assert retcode == 0, "Integration Test Failed."
AssertionError: Integration Test Failed.
2019-09-09 19:08:37,379 e7e93695 MainThread beam_integration_benchmark(1/1) ERROR    Benchmark
1/1 beam_integration_benchmark (UID: beam_integration_benchmark0) failed. Execution will continue.
2019-09-09 19:08:37,380 e7e93695 MainThread beam_integration_benchmark(1/1) INFO     Benchmark
run statuses:
---------------------------------------------------------------------------------
Name                        UID                          Status  Failed Substatus
---------------------------------------------------------------------------------
beam_integration_benchmark  beam_integration_benchmark0  FAILED                  
---------------------------------------------------------------------------------
Success rate: 0.00% (0/1)
2019-09-09 19:08:37,380 e7e93695 MainThread beam_integration_benchmark(1/1) INFO     Complete
logs can be found at: <https://builds.apache.org/job/beam_PerformanceTests_WordCountIT_Py35/ws/runs/e7e93695/pkb.log>
2019-09-09 19:08:37,380 e7e93695 MainThread beam_integration_benchmark(1/1) INFO     Completion
statuses can be found at: <https://builds.apache.org/job/beam_PerformanceTests_WordCountIT_Py35/ws/runs/e7e93695/completion_statuses.json>
Build step 'Execute shell' marked build as failure

---------------------------------------------------------------------
To unsubscribe, e-mail: builds-unsubscribe@beam.apache.org
For additional commands, e-mail: builds-help@beam.apache.org


Mime
View raw message