beam-builds mailing list archives

Site index · List index
Message view « Date » · « Thread »
Top « Date » · « Thread »
From Apache Jenkins Server <jenk...@builds.apache.org>
Subject Build failed in Jenkins: beam_PreCommit_Portable_Python_Cron #1099
Date Mon, 02 Sep 2019 12:26:06 GMT
See <https://builds.apache.org/job/beam_PreCommit_Portable_Python_Cron/1099/display/redirect>

------------------------------------------
[...truncated 901.22 KB...]
[ref_AppliedPTransform_write/Write/WriteImpl/FinalizeWrite_43-side2 -> Map (2/2)] INFO
org.apache.flink.runtime.taskmanager.Task - Ensuring all FileSystem streams are closed for
task ref_AppliedPTransform_write/Write/WriteImpl/FinalizeWrite_43-side2 -> Map (2/2) (a809087e7f4e85fa4479ae7df1ed49fc)
[CANCELED]
[flink-akka.actor.default-dispatcher-17] INFO org.apache.flink.runtime.taskmanager.Task -
Triggering cancellation of task code ref_AppliedPTransform_write/Write/WriteImpl/FinalizeWrite_43-side0
-> Map (1/2) (24c977de6607c248368b99958efa7829).
[flink-akka.actor.default-dispatcher-17] INFO org.apache.flink.runtime.taskmanager.Task -
Attempting to cancel task ref_AppliedPTransform_write/Write/WriteImpl/FinalizeWrite_43-side0
-> Map (2/2) (5e2d61ee3eb5486ecd2a16e809292f8a).
[flink-akka.actor.default-dispatcher-17] INFO org.apache.flink.runtime.taskmanager.Task -
ref_AppliedPTransform_write/Write/WriteImpl/FinalizeWrite_43-side0 -> Map (2/2) (5e2d61ee3eb5486ecd2a16e809292f8a)
switched from RUNNING to CANCELING.
[ref_AppliedPTransform_write/Write/WriteImpl/FinalizeWrite_43-side0 -> Map (1/2)] INFO
org.apache.flink.runtime.taskmanager.Task - ref_AppliedPTransform_write/Write/WriteImpl/FinalizeWrite_43-side0
-> Map (1/2) (24c977de6607c248368b99958efa7829) switched from CANCELING to CANCELED.
[ref_AppliedPTransform_write/Write/WriteImpl/FinalizeWrite_43-side0 -> Map (1/2)] INFO
org.apache.flink.runtime.taskmanager.Task - Freeing task resources for ref_AppliedPTransform_write/Write/WriteImpl/FinalizeWrite_43-side0
-> Map (1/2) (24c977de6607c248368b99958efa7829).
[ref_AppliedPTransform_write/Write/WriteImpl/FinalizeWrite_43-side0 -> Map (1/2)] INFO
org.apache.flink.runtime.taskmanager.Task - Ensuring all FileSystem streams are closed for
task ref_AppliedPTransform_write/Write/WriteImpl/FinalizeWrite_43-side0 -> Map (1/2) (24c977de6607c248368b99958efa7829)
[CANCELED]
[flink-akka.actor.default-dispatcher-17] INFO org.apache.flink.runtime.taskmanager.Task -
Triggering cancellation of task code ref_AppliedPTransform_write/Write/WriteImpl/FinalizeWrite_43-side0
-> Map (2/2) (5e2d61ee3eb5486ecd2a16e809292f8a).
[ref_AppliedPTransform_write/Write/WriteImpl/FinalizeWrite_43-side0 -> Map (2/2)] INFO
org.apache.flink.runtime.taskmanager.Task - ref_AppliedPTransform_write/Write/WriteImpl/FinalizeWrite_43-side0
-> Map (2/2) (5e2d61ee3eb5486ecd2a16e809292f8a) switched from CANCELING to CANCELED.
[ref_AppliedPTransform_write/Write/WriteImpl/FinalizeWrite_43-side0 -> Map (2/2)] INFO
org.apache.flink.runtime.taskmanager.Task - Freeing task resources for ref_AppliedPTransform_write/Write/WriteImpl/FinalizeWrite_43-side0
-> Map (2/2) (5e2d61ee3eb5486ecd2a16e809292f8a).
[flink-akka.actor.default-dispatcher-16] INFO org.apache.flink.runtime.taskexecutor.TaskExecutor
- Un-registering task and sending final execution state CANCELED to JobManager for task ref_AppliedPTransform_write/Write/WriteImpl/WriteBundles_34-side0
-> Map 1e70645619a3514b0b6018ecd8b6e6ce.
[ref_AppliedPTransform_write/Write/WriteImpl/FinalizeWrite_43-side0 -> Map (2/2)] INFO
org.apache.flink.runtime.taskmanager.Task - Ensuring all FileSystem streams are closed for
task ref_AppliedPTransform_write/Write/WriteImpl/FinalizeWrite_43-side0 -> Map (2/2) (5e2d61ee3eb5486ecd2a16e809292f8a)
[CANCELED]
[flink-akka.actor.default-dispatcher-12] INFO org.apache.flink.runtime.executiongraph.ExecutionGraph
- ref_AppliedPTransform_write/Write/WriteImpl/WriteBundles_34-side0 -> Map (1/2) (1e70645619a3514b0b6018ecd8b6e6ce)
switched from CANCELING to CANCELED.
[flink-akka.actor.default-dispatcher-16] INFO org.apache.flink.runtime.taskexecutor.TaskExecutor
- Un-registering task and sending final execution state CANCELED to JobManager for task ref_AppliedPTransform_write/Write/WriteImpl/WriteBundles_34-side0
-> Map 72a7c67f5d7fb4c756d171cf33c8f4cc.
[flink-akka.actor.default-dispatcher-16] INFO org.apache.flink.runtime.taskexecutor.TaskExecutor
- Un-registering task and sending final execution state CANCELED to JobManager for task ref_AppliedPTransform_write/Write/WriteImpl/PreFinalize_42-side1
-> Map 0198e4f92db935cc8bd2789c08a9a24a.
[flink-akka.actor.default-dispatcher-12] INFO org.apache.flink.runtime.executiongraph.ExecutionGraph
- ref_AppliedPTransform_write/Write/WriteImpl/WriteBundles_34-side0 -> Map (2/2) (72a7c67f5d7fb4c756d171cf33c8f4cc)
switched from CANCELING to CANCELED.
[flink-akka.actor.default-dispatcher-16] INFO org.apache.flink.runtime.taskexecutor.TaskExecutor
- Un-registering task and sending final execution state CANCELED to JobManager for task ref_AppliedPTransform_write/Write/WriteImpl/PreFinalize_42-side1
-> Map d1093c4e372b28e91cfeb4ec14b5fa02.
[flink-akka.actor.default-dispatcher-16] INFO org.apache.flink.runtime.taskexecutor.TaskExecutor
- Un-registering task and sending final execution state CANCELED to JobManager for task ref_AppliedPTransform_write/Write/WriteImpl/FinalizeWrite_43-side1
-> Map dc4dc9aee798373a40f9f2e560c16a64.
[flink-akka.actor.default-dispatcher-12] INFO org.apache.flink.runtime.executiongraph.ExecutionGraph
- ref_AppliedPTransform_write/Write/WriteImpl/PreFinalize_42-side1 -> Map (1/2) (0198e4f92db935cc8bd2789c08a9a24a)
switched from CANCELING to CANCELED.
[flink-akka.actor.default-dispatcher-17] INFO org.apache.flink.runtime.taskexecutor.TaskExecutor
- Un-registering task and sending final execution state CANCELED to JobManager for task ref_AppliedPTransform_write/Write/WriteImpl/FinalizeWrite_43-side1
-> Map e3f53456763e33aecd7b190878a0b4bd.
[flink-akka.actor.default-dispatcher-17] INFO org.apache.flink.runtime.taskexecutor.TaskExecutor
- Un-registering task and sending final execution state CANCELED to JobManager for task ref_AppliedPTransform_write/Write/WriteImpl/PreFinalize_42-side0
-> Map 38ac63c3dba96623cca411b8ad681a70.
[flink-akka.actor.default-dispatcher-12] INFO org.apache.flink.runtime.executiongraph.ExecutionGraph
- ref_AppliedPTransform_write/Write/WriteImpl/PreFinalize_42-side1 -> Map (2/2) (d1093c4e372b28e91cfeb4ec14b5fa02)
switched from CANCELING to CANCELED.
[flink-akka.actor.default-dispatcher-17] INFO org.apache.flink.runtime.taskexecutor.TaskExecutor
- Un-registering task and sending final execution state CANCELED to JobManager for task ref_AppliedPTransform_write/Write/WriteImpl/PreFinalize_42-side0
-> Map 0ec4c43b296ab5efadc0e3bf1ccbcb72.
[flink-akka.actor.default-dispatcher-12] INFO org.apache.flink.runtime.executiongraph.ExecutionGraph
- ref_AppliedPTransform_write/Write/WriteImpl/FinalizeWrite_43-side1 -> Map (1/2) (dc4dc9aee798373a40f9f2e560c16a64)
switched from CANCELING to CANCELED.
[flink-akka.actor.default-dispatcher-17] INFO org.apache.flink.runtime.taskexecutor.TaskExecutor
- Un-registering task and sending final execution state CANCELED to JobManager for task ref_AppliedPTransform_write/Write/WriteImpl/FinalizeWrite_43-side2
-> Map 402c6c72ffd1f2f5d82322000b2f4d16.
[flink-akka.actor.default-dispatcher-17] INFO org.apache.flink.runtime.taskexecutor.TaskExecutor
- Un-registering task and sending final execution state CANCELED to JobManager for task ref_AppliedPTransform_write/Write/WriteImpl/FinalizeWrite_43-side2
-> Map a809087e7f4e85fa4479ae7df1ed49fc.
[flink-akka.actor.default-dispatcher-12] INFO org.apache.flink.runtime.executiongraph.ExecutionGraph
- ref_AppliedPTransform_write/Write/WriteImpl/FinalizeWrite_43-side1 -> Map (2/2) (e3f53456763e33aecd7b190878a0b4bd)
switched from CANCELING to CANCELED.
[flink-akka.actor.default-dispatcher-17] INFO org.apache.flink.runtime.taskexecutor.TaskExecutor
- Un-registering task and sending final execution state CANCELED to JobManager for task ref_AppliedPTransform_write/Write/WriteImpl/FinalizeWrite_43-side0
-> Map 24c977de6607c248368b99958efa7829.
[flink-akka.actor.default-dispatcher-12] INFO org.apache.flink.runtime.executiongraph.ExecutionGraph
- ref_AppliedPTransform_write/Write/WriteImpl/PreFinalize_42-side0 -> Map (1/2) (38ac63c3dba96623cca411b8ad681a70)
switched from CANCELING to CANCELED.
[flink-akka.actor.default-dispatcher-13] INFO org.apache.flink.runtime.taskexecutor.TaskExecutor
- Un-registering task and sending final execution state CANCELED to JobManager for task ref_AppliedPTransform_write/Write/WriteImpl/FinalizeWrite_43-side0
-> Map 5e2d61ee3eb5486ecd2a16e809292f8a.
[flink-akka.actor.default-dispatcher-12] INFO org.apache.flink.runtime.executiongraph.ExecutionGraph
- ref_AppliedPTransform_write/Write/WriteImpl/PreFinalize_42-side0 -> Map (2/2) (0ec4c43b296ab5efadc0e3bf1ccbcb72)
switched from CANCELING to CANCELED.
[flink-akka.actor.default-dispatcher-12] INFO org.apache.flink.runtime.executiongraph.ExecutionGraph
- ref_AppliedPTransform_write/Write/WriteImpl/FinalizeWrite_43-side2 -> Map (1/2) (402c6c72ffd1f2f5d82322000b2f4d16)
switched from CANCELING to CANCELED.
[flink-akka.actor.default-dispatcher-12] INFO org.apache.flink.runtime.executiongraph.ExecutionGraph
- ref_AppliedPTransform_write/Write/WriteImpl/FinalizeWrite_43-side2 -> Map (2/2) (a809087e7f4e85fa4479ae7df1ed49fc)
switched from CANCELING to CANCELED.
[flink-akka.actor.default-dispatcher-12] INFO org.apache.flink.runtime.executiongraph.ExecutionGraph
- ref_AppliedPTransform_write/Write/WriteImpl/FinalizeWrite_43-side0 -> Map (1/2) (24c977de6607c248368b99958efa7829)
switched from CANCELING to CANCELED.
[flink-akka.actor.default-dispatcher-12] INFO org.apache.flink.runtime.executiongraph.ExecutionGraph
- ref_AppliedPTransform_write/Write/WriteImpl/FinalizeWrite_43-side0 -> Map (2/2) (5e2d61ee3eb5486ecd2a16e809292f8a)
switched from CANCELING to CANCELED.
[flink-akka.actor.default-dispatcher-13] INFO org.apache.flink.runtime.executiongraph.ExecutionGraph
- Try to restart or fail the job BeamApp-root-0902122458-b54bb171 (1addc07f14bbda30ba0946452062bef2)
if no longer possible.
[flink-akka.actor.default-dispatcher-13] INFO org.apache.flink.runtime.executiongraph.ExecutionGraph
- Job BeamApp-root-0902122458-b54bb171 (1addc07f14bbda30ba0946452062bef2) switched from state
FAILING to FAILED.
org.apache.beam.vendor.guava.v26_0_jre.com.google.common.util.concurrent.UncheckedExecutionException:
java.lang.RuntimeException: Docker container jenkins-docker-apache.bintray.io/beam/python3:latest
failed to start up successfully within 1 minute.
	at org.apache.beam.vendor.guava.v26_0_jre.com.google.common.cache.LocalCache$Segment.get(LocalCache.java:2050)
	at org.apache.beam.vendor.guava.v26_0_jre.com.google.common.cache.LocalCache.get(LocalCache.java:3952)
	at org.apache.beam.vendor.guava.v26_0_jre.com.google.common.cache.LocalCache.getOrLoad(LocalCache.java:3974)
	at org.apache.beam.vendor.guava.v26_0_jre.com.google.common.cache.LocalCache$LocalLoadingCache.get(LocalCache.java:4958)
	at org.apache.beam.vendor.guava.v26_0_jre.com.google.common.cache.LocalCache$LocalLoadingCache.getUnchecked(LocalCache.java:4964)
	at org.apache.beam.runners.fnexecution.control.DefaultJobBundleFactory$SimpleStageBundleFactory.<init>(DefaultJobBundleFactory.java:213)
	at org.apache.beam.runners.fnexecution.control.DefaultJobBundleFactory$SimpleStageBundleFactory.<init>(DefaultJobBundleFactory.java:204)
	at org.apache.beam.runners.fnexecution.control.DefaultJobBundleFactory.forStage(DefaultJobBundleFactory.java:187)
	at org.apache.beam.runners.flink.translation.functions.FlinkDefaultExecutableStageContext.getStageBundleFactory(FlinkDefaultExecutableStageContext.java:49)
	at org.apache.beam.runners.flink.translation.functions.ReferenceCountingFlinkExecutableStageContextFactory$WrappedContext.getStageBundleFactory(ReferenceCountingFlinkExecutableStageContextFactory.java:203)
	at org.apache.beam.runners.flink.translation.wrappers.streaming.ExecutableStageDoFnOperator.open(ExecutableStageDoFnOperator.java:192)
	at org.apache.flink.streaming.runtime.tasks.StreamTask.openAllOperators(StreamTask.java:420)
	at org.apache.flink.streaming.runtime.tasks.StreamTask.invoke(StreamTask.java:296)
	at org.apache.flink.runtime.taskmanager.Task.run(Task.java:712)
	at java.lang.Thread.run(Thread.java:748)
Caused by: java.lang.RuntimeException: Docker container jenkins-docker-apache.bintray.io/beam/python3:latest
failed to start up successfully within 1 minute.
	at org.apache.beam.runners.fnexecution.environment.DockerEnvironmentFactory.createEnvironment(DockerEnvironmentFactory.java:156)
	at org.apache.beam.runners.fnexecution.control.DefaultJobBundleFactory$1.load(DefaultJobBundleFactory.java:180)
	at org.apache.beam.runners.fnexecution.control.DefaultJobBundleFactory$1.load(DefaultJobBundleFactory.java:164)
	at org.apache.beam.vendor.guava.v26_0_jre.com.google.common.cache.LocalCache$LoadingValueReference.loadFuture(LocalCache.java:3528)
	at org.apache.beam.vendor.guava.v26_0_jre.com.google.common.cache.LocalCache$Segment.loadSync(LocalCache.java:2277)
	at org.apache.beam.vendor.guava.v26_0_jre.com.google.common.cache.LocalCache$Segment.lockedGetOrLoad(LocalCache.java:2154)
	at org.apache.beam.vendor.guava.v26_0_jre.com.google.common.cache.LocalCache$Segment.get(LocalCache.java:2044)
	... 14 more
	Suppressed: java.io.IOException: Received exit code 1 for command 'docker kill 1f4bf8e8d1c8e4506dae93e8ed2ac07ced2922fe92c0c8ac7bf4b61d4bf41748'.
stderr: Error response from daemon: Cannot kill container: 1f4bf8e8d1c8e4506dae93e8ed2ac07ced2922fe92c0c8ac7bf4b61d4bf41748:
Container 1f4bf8e8d1c8e4506dae93e8ed2ac07ced2922fe92c0c8ac7bf4b61d4bf41748 is not running
		at org.apache.beam.runners.fnexecution.environment.DockerCommand.runShortCommand(DockerCommand.java:234)
		at org.apache.beam.runners.fnexecution.environment.DockerCommand.runShortCommand(DockerCommand.java:168)
		at org.apache.beam.runners.fnexecution.environment.DockerCommand.killContainer(DockerCommand.java:148)
		at org.apache.beam.runners.fnexecution.environment.DockerEnvironmentFactory.createEnvironment(DockerEnvironmentFactory.java:175)
		... 20 more
Caused by: java.util.concurrent.TimeoutException
	at java.util.concurrent.CompletableFuture.timedGet(CompletableFuture.java:1771)
	at java.util.concurrent.CompletableFuture.get(CompletableFuture.java:1915)
	at org.apache.beam.runners.fnexecution.control.MapControlClientPool.getClient(MapControlClientPool.java:69)
	at org.apache.beam.runners.fnexecution.environment.DockerEnvironmentFactory.createEnvironment(DockerEnvironmentFactory.java:152)
	... 20 more
[flink-akka.actor.default-dispatcher-13] INFO org.apache.flink.runtime.executiongraph.ExecutionGraph
- Could not restart the job BeamApp-root-0902122458-b54bb171 (1addc07f14bbda30ba0946452062bef2)
because the restart strategy prevented it.
org.apache.beam.vendor.guava.v26_0_jre.com.google.common.util.concurrent.UncheckedExecutionException:
java.lang.RuntimeException: Docker container jenkins-docker-apache.bintray.io/beam/python3:latest
failed to start up successfully within 1 minute.
	at org.apache.beam.vendor.guava.v26_0_jre.com.google.common.cache.LocalCache$Segment.get(LocalCache.java:2050)
	at org.apache.beam.vendor.guava.v26_0_jre.com.google.common.cache.LocalCache.get(LocalCache.java:3952)
	at org.apache.beam.vendor.guava.v26_0_jre.com.google.common.cache.LocalCache.getOrLoad(LocalCache.java:3974)
	at org.apache.beam.vendor.guava.v26_0_jre.com.google.common.cache.LocalCache$LocalLoadingCache.get(LocalCache.java:4958)
	at org.apache.beam.vendor.guava.v26_0_jre.com.google.common.cache.LocalCache$LocalLoadingCache.getUnchecked(LocalCache.java:4964)
	at org.apache.beam.runners.fnexecution.control.DefaultJobBundleFactory$SimpleStageBundleFactory.<init>(DefaultJobBundleFactory.java:213)
	at org.apache.beam.runners.fnexecution.control.DefaultJobBundleFactory$SimpleStageBundleFactory.<init>(DefaultJobBundleFactory.java:204)
	at org.apache.beam.runners.fnexecution.control.DefaultJobBundleFactory.forStage(DefaultJobBundleFactory.java:187)
	at org.apache.beam.runners.flink.translation.functions.FlinkDefaultExecutableStageContext.getStageBundleFactory(FlinkDefaultExecutableStageContext.java:49)
	at org.apache.beam.runners.flink.translation.functions.ReferenceCountingFlinkExecutableStageContextFactory$WrappedContext.getStageBundleFactory(ReferenceCountingFlinkExecutableStageContextFactory.java:203)
	at org.apache.beam.runners.flink.translation.wrappers.streaming.ExecutableStageDoFnOperator.open(ExecutableStageDoFnOperator.java:192)
	at org.apache.flink.streaming.runtime.tasks.StreamTask.openAllOperators(StreamTask.java:420)
	at org.apache.flink.streaming.runtime.tasks.StreamTask.invoke(StreamTask.java:296)
	at org.apache.flink.runtime.taskmanager.Task.run(Task.java:712)
	at java.lang.Thread.run(Thread.java:748)
Caused by: java.lang.RuntimeException: Docker container jenkins-docker-apache.bintray.io/beam/python3:latest
failed to start up successfully within 1 minute.
	at org.apache.beam.runners.fnexecution.environment.DockerEnvironmentFactory.createEnvironment(DockerEnvironmentFactory.java:156)
	at org.apache.beam.runners.fnexecution.control.DefaultJobBundleFactory$1.load(DefaultJobBundleFactory.java:180)
	at org.apache.beam.runners.fnexecution.control.DefaultJobBundleFactory$1.load(DefaultJobBundleFactory.java:164)
	at org.apache.beam.vendor.guava.v26_0_jre.com.google.common.cache.LocalCache$LoadingValueReference.loadFuture(LocalCache.java:3528)
	at org.apache.beam.vendor.guava.v26_0_jre.com.google.common.cache.LocalCache$Segment.loadSync(LocalCache.java:2277)
	at org.apache.beam.vendor.guava.v26_0_jre.com.google.common.cache.LocalCache$Segment.lockedGetOrLoad(LocalCache.java:2154)
	at org.apache.beam.vendor.guava.v26_0_jre.com.google.common.cache.LocalCache$Segment.get(LocalCache.java:2044)
	... 14 more
	Suppressed: java.io.IOException: Received exit code 1 for command 'docker kill 1f4bf8e8d1c8e4506dae93e8ed2ac07ced2922fe92c0c8ac7bf4b61d4bf41748'.
stderr: Error response from daemon: Cannot kill container: 1f4bf8e8d1c8e4506dae93e8ed2ac07ced2922fe92c0c8ac7bf4b61d4bf41748:
Container 1f4bf8e8d1c8e4506dae93e8ed2ac07ced2922fe92c0c8ac7bf4b61d4bf41748 is not running
		at org.apache.beam.runners.fnexecution.environment.DockerCommand.runShortCommand(DockerCommand.java:234)
		at org.apache.beam.runners.fnexecution.environment.DockerCommand.runShortCommand(DockerCommand.java:168)
		at org.apache.beam.runners.fnexecution.environment.DockerCommand.killContainer(DockerCommand.java:148)
		at org.apache.beam.runners.fnexecution.environment.DockerEnvironmentFactory.createEnvironment(DockerEnvironmentFactory.java:175)
		... 20 more
Caused by: java.util.concurrent.TimeoutException
	at java.util.concurrent.CompletableFuture.timedGet(CompletableFuture.java:1771)
	at java.util.concurrent.CompletableFuture.get(CompletableFuture.java:1915)
	at org.apache.beam.runners.fnexecution.control.MapControlClientPool.getClient(MapControlClientPool.java:69)
	at org.apache.beam.runners.fnexecution.environment.DockerEnvironmentFactory.createEnvironment(DockerEnvironmentFactory.java:152)
	... 20 more
[flink-akka.actor.default-dispatcher-13] INFO org.apache.flink.runtime.checkpoint.CheckpointCoordinator
- Stopping checkpoint coordinator for job 1addc07f14bbda30ba0946452062bef2.
[flink-akka.actor.default-dispatcher-13] INFO org.apache.flink.runtime.checkpoint.StandaloneCompletedCheckpointStore
- Shutting down
[flink-akka.actor.default-dispatcher-13] INFO org.apache.flink.runtime.dispatcher.StandaloneDispatcher
- Job 1addc07f14bbda30ba0946452062bef2 reached globally terminal state FAILED.
[flink-runner-job-invoker] INFO org.apache.flink.runtime.minicluster.MiniCluster - Shutting
down Flink Mini Cluster
[flink-runner-job-invoker] INFO org.apache.flink.runtime.dispatcher.DispatcherRestEndpoint
- Shutting down rest endpoint.
[flink-akka.actor.default-dispatcher-16] INFO org.apache.flink.runtime.taskexecutor.TaskExecutor
- Stopping TaskExecutor akka://flink/user/taskmanager_0.
[flink-akka.actor.default-dispatcher-12] INFO org.apache.flink.runtime.jobmaster.JobMaster
- Stopping the JobMaster for job BeamApp-root-0902122458-b54bb171(1addc07f14bbda30ba0946452062bef2).
[flink-akka.actor.default-dispatcher-16] INFO org.apache.flink.runtime.state.TaskExecutorLocalStateStoresManager
- Shutting down TaskExecutorLocalStateStoresManager.
[flink-akka.actor.default-dispatcher-12] INFO org.apache.flink.runtime.jobmaster.JobMaster
- Close ResourceManager connection 84f6880efa135d68ab1548a5021619b4: JobManager is shutting
down..
[flink-akka.actor.default-dispatcher-17] INFO org.apache.flink.runtime.jobmaster.slotpool.SlotPool
- Suspending SlotPool.
[flink-akka.actor.default-dispatcher-17] INFO org.apache.flink.runtime.jobmaster.slotpool.SlotPool
- Stopping SlotPool.
[flink-akka.actor.default-dispatcher-13] INFO org.apache.flink.runtime.dispatcher.StandaloneDispatcher
- Stopping dispatcher akka://flink/user/dispatchere9d4b59b-191e-4821-ac76-1c4628db8955.
[flink-akka.actor.default-dispatcher-13] INFO org.apache.flink.runtime.dispatcher.StandaloneDispatcher
- Stopping all currently running jobs of dispatcher akka://flink/user/dispatchere9d4b59b-191e-4821-ac76-1c4628db8955.
[flink-akka.actor.default-dispatcher-16] INFO org.apache.flink.runtime.io.disk.iomanager.IOManager
- I/O manager removed spill file directory /tmp/flink-io-53203092-6cc9-4fdf-a8d8-7da9a25a41e4
[flink-akka.actor.default-dispatcher-16] INFO org.apache.flink.runtime.io.network.NetworkEnvironment
- Shutting down the network environment and its components.
[flink-akka.actor.default-dispatcher-13] INFO org.apache.flink.runtime.resourcemanager.StandaloneResourceManager
- Disconnect job manager 830f59b568b06157f7c4e32720eb4508@akka://flink/user/jobmanager_1 for
job 1addc07f14bbda30ba0946452062bef2 from the resource manager.
[flink-akka.actor.default-dispatcher-13] INFO org.apache.flink.runtime.taskexecutor.TaskExecutor
- JobManager for job 1addc07f14bbda30ba0946452062bef2 with leader id 830f59b568b06157f7c4e32720eb4508
lost leadership.
[flink-akka.actor.default-dispatcher-12] INFO org.apache.flink.runtime.rest.handler.legacy.backpressure.StackTraceSampleCoordinator
- Shutting down stack trace sample coordinator.
[flink-akka.actor.default-dispatcher-12] INFO org.apache.flink.runtime.dispatcher.StandaloneDispatcher
- Stopped dispatcher akka://flink/user/dispatchere9d4b59b-191e-4821-ac76-1c4628db8955.
[flink-akka.actor.default-dispatcher-17] INFO org.apache.flink.runtime.resourcemanager.slotmanager.SlotManager
- Closing the SlotManager.
[flink-akka.actor.default-dispatcher-17] INFO org.apache.flink.runtime.resourcemanager.slotmanager.SlotManager
- Suspending the SlotManager.
[ForkJoinPool.commonPool-worker-4] INFO org.apache.flink.runtime.dispatcher.DispatcherRestEndpoint
- Removing cache directory /tmp/flink-web-ui
[ForkJoinPool.commonPool-worker-4] INFO org.apache.flink.runtime.dispatcher.DispatcherRestEndpoint
- Shut down complete.
[flink-akka.actor.default-dispatcher-16] INFO org.apache.flink.runtime.taskexecutor.JobLeaderService
- Stop job leader service.
[flink-akka.actor.default-dispatcher-16] INFO org.apache.flink.runtime.taskexecutor.TaskExecutor
- Stopped TaskExecutor akka://flink/user/taskmanager_0.
[flink-akka.actor.default-dispatcher-16] INFO org.apache.flink.runtime.rpc.akka.AkkaRpcService
- Stopping Akka RPC service.
[flink-akka.actor.default-dispatcher-16] INFO org.apache.flink.runtime.blob.PermanentBlobCache
- Shutting down BLOB cache
[flink-akka.actor.default-dispatcher-16] INFO org.apache.flink.runtime.blob.TransientBlobCache
- Shutting down BLOB cache
[flink-akka.actor.default-dispatcher-16] INFO org.apache.flink.runtime.blob.BlobServer - Stopped
BLOB server at 0.0.0.0:41437
[flink-akka.actor.default-dispatcher-16] INFO org.apache.flink.runtime.rpc.akka.AkkaRpcService
- Stopped Akka RPC service.
[flink-runner-job-invoker] ERROR org.apache.beam.runners.fnexecution.jobsubmission.JobInvocation
- Error during job invocation BeamApp-root-0902122458-b54bb171_37ac760c-706b-4a4c-b3ca-f2788330436b.
org.apache.flink.runtime.client.JobExecutionException: Job execution failed.
	at org.apache.flink.runtime.jobmaster.JobResult.toJobExecutionResult(JobResult.java:146)
	at org.apache.flink.runtime.minicluster.MiniCluster.executeJobBlocking(MiniCluster.java:632)
	at org.apache.flink.streaming.api.environment.LocalStreamEnvironment.execute(LocalStreamEnvironment.java:123)
	at org.apache.beam.runners.flink.FlinkStreamingPortablePipelineTranslator$StreamingTranslationContext.execute(FlinkStreamingPortablePipelineTranslator.java:171)
	at org.apache.beam.runners.flink.FlinkPipelineRunner.runPipelineWithTranslator(FlinkPipelineRunner.java:92)
	at org.apache.beam.runners.flink.FlinkPipelineRunner.run(FlinkPipelineRunner.java:68)
	at org.apache.beam.runners.fnexecution.jobsubmission.JobInvocation.runPipeline(JobInvocation.java:78)
	at org.apache.beam.vendor.guava.v26_0_jre.com.google.common.util.concurrent.TrustedListenableFutureTask$TrustedFutureInterruptibleTask.runInterruptibly(TrustedListenableFutureTask.java:125)
	at org.apache.beam.vendor.guava.v26_0_jre.com.google.common.util.concurrent.InterruptibleTask.run(InterruptibleTask.java:57)
	at org.apache.beam.vendor.guava.v26_0_jre.com.google.common.util.concurrent.TrustedListenableFutureTask.run(TrustedListenableFutureTask.java:78)
	at java.util.concurrent.ThreadPoolExecutor.runWorker(ThreadPoolExecutor.java:1149)
	at java.util.concurrent.ThreadPoolExecutor$Worker.run(ThreadPoolExecutor.java:624)
	at java.lang.Thread.run(Thread.java:748)
Caused by: org.apache.beam.vendor.guava.v26_0_jre.com.google.common.util.concurrent.UncheckedExecutionException:
java.lang.RuntimeException: Docker container jenkins-docker-apache.bintray.io/beam/python3:latest
failed to start up successfully within 1 minute.
	at org.apache.beam.vendor.guava.v26_0_jre.com.google.common.cache.LocalCache$Segment.get(LocalCache.java:2050)
	at org.apache.beam.vendor.guava.v26_0_jre.com.google.common.cache.LocalCache.get(LocalCache.java:3952)
	at org.apache.beam.vendor.guava.v26_0_jre.com.google.common.cache.LocalCache.getOrLoad(LocalCache.java:3974)
	at org.apache.beam.vendor.guava.v26_0_jre.com.google.common.cache.LocalCache$LocalLoadingCache.get(LocalCache.java:4958)
	at org.apache.beam.vendor.guava.v26_0_jre.com.google.common.cache.LocalCache$LocalLoadingCache.getUnchecked(LocalCache.java:4964)
	at org.apache.beam.runners.fnexecution.control.DefaultJobBundleFactory$SimpleStageBundleFactory.<init>(DefaultJobBundleFactory.java:213)
	at org.apache.beam.runners.fnexecution.control.DefaultJobBundleFactory$SimpleStageBundleFactory.<init>(DefaultJobBundleFactory.java:204)
	at org.apache.beam.runners.fnexecution.control.DefaultJobBundleFactory.forStage(DefaultJobBundleFactory.java:187)
	at org.apache.beam.runners.flink.translation.functions.FlinkDefaultExecutableStageContext.getStageBundleFactory(FlinkDefaultExecutableStageContext.java:49)
	at org.apache.beam.runners.flink.translation.functions.ReferenceCountingFlinkExecutableStageContextFactory$WrappedContext.getStageBundleFactory(ReferenceCountingFlinkExecutableStageContextFactory.java:203)
	at org.apache.beam.runners.flink.translation.wrappers.streaming.ExecutableStageDoFnOperator.open(ExecutableStageDoFnOperator.java:192)
	at org.apache.flink.streaming.runtime.tasks.StreamTask.openAllOperators(StreamTask.java:420)
	at org.apache.flink.streaming.runtime.tasks.StreamTask.invoke(StreamTask.java:296)
	at org.apache.flink.runtime.taskmanager.Task.run(Task.java:712)
	... 1 more
Caused by: java.lang.RuntimeException: Docker container jenkins-docker-apache.bintray.io/beam/python3:latest
failed to start up successfully within 1 minute.
	at org.apache.beam.runners.fnexecution.environment.DockerEnvironmentFactory.createEnvironment(DockerEnvironmentFactory.java:156)
	at org.apache.beam.runners.fnexecution.control.DefaultJobBundleFactory$1.load(DefaultJobBundleFactory.java:180)
	at org.apache.beam.runners.fnexecution.control.DefaultJobBundleFactory$1.load(DefaultJobBundleFactory.java:164)
	at org.apache.beam.vendor.guava.v26_0_jre.com.google.common.cache.LocalCache$LoadingValueReference.loadFuture(LocalCache.java:3528)
	at org.apache.beam.vendor.guava.v26_0_jre.com.google.common.cache.LocalCache$Segment.loadSync(LocalCache.java:2277)
	at org.apache.beam.vendor.guava.v26_0_jre.com.google.common.cache.LocalCache$Segment.lockedGetOrLoad(LocalCache.java:2154)
	at org.apache.beam.vendor.guava.v26_0_jre.com.google.common.cache.LocalCache$Segment.get(LocalCache.java:2044)
	... 14 more
	Suppressed: java.io.IOException: Received exit code 1 for command 'docker kill 1f4bf8e8d1c8e4506dae93e8ed2ac07ced2922fe92c0c8ac7bf4b61d4bf41748'.
stderr: Error response from daemon: Cannot kill container: 1f4bf8e8d1c8e4506dae93e8ed2ac07ced2922fe92c0c8ac7bf4b61d4bf41748:
Container 1f4bf8e8d1c8e4506dae93e8ed2ac07ced2922fe92c0c8ac7bf4b61d4bf41748 is not running
		at org.apache.beam.runners.fnexecution.environment.DockerCommand.runShortCommand(DockerCommand.java:234)
		at org.apache.beam.runners.fnexecution.environment.DockerCommand.runShortCommand(DockerCommand.java:168)
		at org.apache.beam.runners.fnexecution.environment.DockerCommand.killContainer(DockerCommand.java:148)
		at org.apache.beam.runners.fnexecution.environment.DockerEnvironmentFactory.createEnvironment(DockerEnvironmentFactory.java:175)
		... 20 more
Caused by: java.util.concurrent.TimeoutException
	at java.util.concurrent.CompletableFuture.timedGet(CompletableFuture.java:1771)
	at java.util.concurrent.CompletableFuture.get(CompletableFuture.java:1915)
	at org.apache.beam.runners.fnexecution.control.MapControlClientPool.getClient(MapControlClientPool.java:69)
	at org.apache.beam.runners.fnexecution.environment.DockerEnvironmentFactory.createEnvironment(DockerEnvironmentFactory.java:152)
	... 20 more
ERROR:root:java.util.concurrent.TimeoutException
[flink-runner-job-invoker] INFO org.apache.beam.runners.fnexecution.artifact.BeamFileSystemArtifactRetrievalService
- Manifest at /tmp/beam-artifact-staging/job_981361f0-6920-4dcf-a41c-3a4074f7d730/MANIFEST
has 1 artifact locations
[flink-runner-job-invoker] INFO org.apache.beam.runners.fnexecution.artifact.BeamFileSystemArtifactStagingService
- Removed dir /tmp/beam-artifact-staging/job_981361f0-6920-4dcf-a41c-3a4074f7d730/
INFO:root:Job state changed to FAILED
Traceback (most recent call last):
  File "/usr/lib/python3.5/runpy.py", line 184, in _run_module_as_main
    "__main__", mod_spec)
  File "/usr/lib/python3.5/runpy.py", line 85, in _run_code
    exec(code, run_globals)
  File "<https://builds.apache.org/job/beam_PreCommit_Portable_Python_Cron/ws/src/sdks/python/apache_beam/examples/wordcount.py",>
line 135, in <module>
    run()
  File "<https://builds.apache.org/job/beam_PreCommit_Portable_Python_Cron/ws/src/sdks/python/apache_beam/examples/wordcount.py",>
line 115, in run
    result.wait_until_finish()
  File "<https://builds.apache.org/job/beam_PreCommit_Portable_Python_Cron/ws/src/sdks/python/apache_beam/runners/portability/portable_runner.py",>
line 450, in wait_until_finish
    self._job_id, self._state, self._last_error_message()))
RuntimeError: Pipeline BeamApp-root-0902122458-b54bb171_37ac760c-706b-4a4c-b3ca-f2788330436b
failed in state FAILED: java.util.concurrent.TimeoutException

> Task :sdks:python:test-suites:portable:py35:portableWordCountStreaming FAILED

FAILURE: Build completed with 2 failures.

1: Task failed with an exception.
-----------
* What went wrong:
Execution failed for task ':sdks:python:test-suites:portable:py35:portableWordCountBatch'.
> Process 'command 'sh'' finished with non-zero exit value 1

* Try:
Run with --stacktrace option to get the stack trace. Run with --info or --debug option to
get more log output. Run with --scan to get full insights.
==============================================================================

2: Task failed with an exception.
-----------
* What went wrong:
Execution failed for task ':sdks:python:test-suites:portable:py35:portableWordCountStreaming'.
> Process 'command 'sh'' finished with non-zero exit value 1

* Try:
Run with --stacktrace option to get the stack trace. Run with --info or --debug option to
get more log output. Run with --scan to get full insights.
==============================================================================

* Get more help at https://help.gradle.org

Deprecated Gradle features were used in this build, making it incompatible with Gradle 6.0.
Use '--warning-mode all' to show the individual deprecation warnings.
See https://docs.gradle.org/5.2.1/userguide/command_line_interface.html#sec:command_line_warnings

BUILD FAILED in 8m 48s
80 actionable tasks: 62 executed, 15 from cache, 3 up-to-date

Publishing build scan...
https://gradle.com/s/vt4cjnjp5lrbq

Build step 'Invoke Gradle script' changed build result to FAILURE
Build step 'Invoke Gradle script' marked build as failure

---------------------------------------------------------------------
To unsubscribe, e-mail: builds-unsubscribe@beam.apache.org
For additional commands, e-mail: builds-help@beam.apache.org


Mime
View raw message