beam-builds mailing list archives

Site index · List index
Message view « Date » · « Thread »
Top « Date » · « Thread »
From Apache Jenkins Server <jenk...@builds.apache.org>
Subject Build failed in Jenkins: beam_Release_NightlySnapshot #529
Date Mon, 05 Aug 2019 07:06:21 GMT
See <https://builds.apache.org/job/beam_Release_NightlySnapshot/529/display/redirect?page=changes>

Changes:

[github] Update design-documents.md

------------------------------------------
Started by timer
[EnvInject] - Loading node environment variables.
Building remotely on H38 (ubuntu xenial) in workspace <https://builds.apache.org/job/beam_Release_NightlySnapshot/ws/>
No credentials specified
Wiping out workspace first.
Cloning the remote Git repository
Cloning repository https://github.com/apache/beam.git
 > git init <https://builds.apache.org/job/beam_Release_NightlySnapshot/ws/src> #
timeout=10
Fetching upstream changes from https://github.com/apache/beam.git
 > git --version # timeout=10
 > git fetch --tags --progress https://github.com/apache/beam.git +refs/heads/*:refs/remotes/origin/*
 > git config remote.origin.url https://github.com/apache/beam.git # timeout=10
 > git config --add remote.origin.fetch +refs/heads/*:refs/remotes/origin/* # timeout=10
 > git config remote.origin.url https://github.com/apache/beam.git # timeout=10
Fetching upstream changes from https://github.com/apache/beam.git
 > git fetch --tags --progress https://github.com/apache/beam.git +refs/heads/*:refs/remotes/origin/*
+refs/pull/${ghprbPullId}/*:refs/remotes/origin/pr/${ghprbPullId}/*
 > git rev-parse origin/master^{commit} # timeout=10
Checking out Revision 2c1932a1be9277a5551cd62693bbd387f75aaa79 (origin/master)
 > git config core.sparsecheckout # timeout=10
 > git checkout -f 2c1932a1be9277a5551cd62693bbd387f75aaa79
Commit message: "Update design-documents.md"
 > git rev-list --no-walk dbcd2656aeee9683f3c7f3cb52daf7892b07c8eb # timeout=10
[EnvInject] - Executing scripts and injecting environment variables after the SCM step.
[EnvInject] - Injecting as environment variables the properties content 
SPARK_LOCAL_IP=127.0.0.1

[EnvInject] - Variables injected successfully.
[Gradle] - Launching build.
[src] $ <https://builds.apache.org/job/beam_Release_NightlySnapshot/ws/src/gradlew>
clean
Downloading https://services.gradle.org/distributions/gradle-5.2.1-all.zip
..............................................................................................................................

Welcome to Gradle 5.2.1!

Here are the highlights of this release:
 - Define sets of dependencies that work together with Java Platform plugin
 - New C++ plugins with dependency management built-in
 - New C++ project types for gradle init
 - Service injection into plugins and project extensions

For more details see https://docs.gradle.org/5.2.1/release-notes.html

To honour the JVM settings for this build a new JVM will be forked. Please consider using
the daemon: https://docs.gradle.org/5.2.1/userguide/gradle_daemon.html.
Daemon will be stopped at the end of the build stopping after processing
> Task :buildSrc:compileJava NO-SOURCE
> Task :buildSrc:compileGroovy
> Task :buildSrc:pluginDescriptors
> Task :buildSrc:processResources
> Task :buildSrc:classes
> Task :buildSrc:jar
> Task :buildSrc:assemble
> Task :buildSrc:spotlessGroovy
> Task :buildSrc:spotlessGroovyCheck
> Task :buildSrc:spotlessGroovyGradle
> Task :buildSrc:spotlessGroovyGradleCheck
> Task :buildSrc:spotlessCheck
> Task :buildSrc:pluginUnderTestMetadata
> Task :buildSrc:compileTestJava NO-SOURCE
> Task :buildSrc:compileTestGroovy NO-SOURCE
> Task :buildSrc:processTestResources NO-SOURCE
> Task :buildSrc:testClasses UP-TO-DATE
> Task :buildSrc:test NO-SOURCE
> Task :buildSrc:validateTaskProperties
> Task :buildSrc:check
> Task :buildSrc:build
Configuration on demand is an incubating feature.

> Configure project :beam-test-tools
Start downloading go 1.12.
downloading https://storage.googleapis.com/golang/go1.12.linux-amd64.tar.gz -> /home/jenkins/.gradle/go/binary/go1.12.linux-amd64.tar.gz
Extracting /home/jenkins/.gradle/go/binary/go1.12.linux-amd64.tar.gz to /home/jenkins/.gradle/go/binary/1.12

FAILURE: Build failed with an exception.

* Where:
Build file '<https://builds.apache.org/job/beam_Release_NightlySnapshot/ws/src/sdks/python/apache_beam/testing/load_tests/build.gradle'>
line: 44

* What went wrong:
A problem occurred evaluating project ':sdks:python:apache_beam:testing:load_tests'.
> Could not get unknown property 'files' for task ':sdks:python:apache_beam:testing:load_tests:run'
of type org.gradle.api.tasks.Exec.

* Try:
Run with --stacktrace option to get the stack trace. Run with --info or --debug option to
get more log output. Run with --scan to get full insights.

* Get more help at https://help.gradle.org

Deprecated Gradle features were used in this build, making it incompatible with Gradle 6.0.
Use '--warning-mode all' to show the individual deprecation warnings.
See https://docs.gradle.org/5.2.1/userguide/command_line_interface.html#sec:command_line_warnings

BUILD FAILED in 3m 15s

Publishing build scan...
https://gradle.com/s/rci6jobrlm4tc

Build step 'Invoke Gradle script' changed build result to FAILURE
Build step 'Invoke Gradle script' marked build as failure

---------------------------------------------------------------------
To unsubscribe, e-mail: builds-unsubscribe@beam.apache.org
For additional commands, e-mail: builds-help@beam.apache.org


Mime
View raw message