beam-builds mailing list archives

Site index · List index
Message view « Date » · « Thread »
Top « Date » · « Thread »
From Apache Jenkins Server <jenk...@builds.apache.org>
Subject Build failed in Jenkins: beam_Prober_CommunityMetrics #1133
Date Mon, 05 Aug 2019 06:17:58 GMT
See <https://builds.apache.org/job/beam_Prober_CommunityMetrics/1133/display/redirect>

------------------------------------------
Started by timer
[EnvInject] - Loading node environment variables.
Building remotely on apache-beam-jenkins-11 (beam) in workspace <https://builds.apache.org/job/beam_Prober_CommunityMetrics/ws/>
No credentials specified
Wiping out workspace first.
Cloning the remote Git repository
Cloning repository https://github.com/apache/beam.git
 > git init <https://builds.apache.org/job/beam_Prober_CommunityMetrics/ws/src> #
timeout=10
Fetching upstream changes from https://github.com/apache/beam.git
 > git --version # timeout=10
 > git fetch --tags --progress https://github.com/apache/beam.git +refs/heads/*:refs/remotes/origin/*
 > git config remote.origin.url https://github.com/apache/beam.git # timeout=10
 > git config --add remote.origin.fetch +refs/heads/*:refs/remotes/origin/* # timeout=10
 > git config remote.origin.url https://github.com/apache/beam.git # timeout=10
Fetching upstream changes from https://github.com/apache/beam.git
 > git fetch --tags --progress https://github.com/apache/beam.git +refs/heads/*:refs/remotes/origin/*
+refs/pull/${ghprbPullId}/*:refs/remotes/origin/pr/${ghprbPullId}/*
 > git rev-parse origin/master^{commit} # timeout=10
Checking out Revision 2c1932a1be9277a5551cd62693bbd387f75aaa79 (origin/master)
 > git config core.sparsecheckout # timeout=10
 > git checkout -f 2c1932a1be9277a5551cd62693bbd387f75aaa79
Commit message: "Update design-documents.md"
 > git rev-list --no-walk 2c1932a1be9277a5551cd62693bbd387f75aaa79 # timeout=10
[EnvInject] - Executing scripts and injecting environment variables after the SCM step.
[EnvInject] - Injecting as environment variables the properties content 
SPARK_LOCAL_IP=127.0.0.1

[EnvInject] - Variables injected successfully.
[Gradle] - Launching build.
[src] $ <https://builds.apache.org/job/beam_Prober_CommunityMetrics/ws/src/gradlew>
--continue --max-workers=12 -Dorg.gradle.jvmargs=-Xms2g -Dorg.gradle.jvmargs=-Xmx4g :communityMetricsProber
Starting a Gradle Daemon, 2 busy Daemons could not be reused, use --status for details
> Task :buildSrc:compileJava NO-SOURCE
> Task :buildSrc:compileGroovy FROM-CACHE
> Task :buildSrc:pluginDescriptors
> Task :buildSrc:processResources
> Task :buildSrc:classes
> Task :buildSrc:jar
> Task :buildSrc:assemble
> Task :buildSrc:spotlessGroovy
> Task :buildSrc:spotlessGroovyCheck
> Task :buildSrc:spotlessGroovyGradle
> Task :buildSrc:spotlessGroovyGradleCheck
> Task :buildSrc:spotlessCheck
> Task :buildSrc:pluginUnderTestMetadata
> Task :buildSrc:compileTestJava NO-SOURCE
> Task :buildSrc:compileTestGroovy NO-SOURCE
> Task :buildSrc:processTestResources NO-SOURCE
> Task :buildSrc:testClasses UP-TO-DATE
> Task :buildSrc:test NO-SOURCE
> Task :buildSrc:validateTaskProperties FROM-CACHE
> Task :buildSrc:check
> Task :buildSrc:build
Configuration on demand is an incubating feature.
> Task :beam-test-infra-metrics:compileJava NO-SOURCE
> Task :beam-test-infra-metrics:compileGroovy NO-SOURCE
> Task :beam-test-infra-metrics:processResources NO-SOURCE
> Task :beam-test-infra-metrics:classes UP-TO-DATE
> Task :beam-test-infra-metrics:compileTestJava NO-SOURCE
> Task :beam-test-infra-metrics:compileTestGroovy FROM-CACHE
> Task :beam-test-infra-metrics:processTestResources NO-SOURCE
> Task :beam-test-infra-metrics:testClasses UP-TO-DATE

> Task :beam-test-infra-metrics:test FAILED

org.apache.beam.testinfra.metrics.ProberTests > CheckGrafanaStalenessAlerts FAILED
    java.lang.AssertionError at ProberTests.groovy:47

2 tests completed, 1 failed

FAILURE: Build failed with an exception.

* What went wrong:
Execution failed for task ':beam-test-infra-metrics:test'.
> There were failing tests. See the report at: file://<https://builds.apache.org/job/beam_Prober_CommunityMetrics/ws/src/.test-infra/metrics/build/reports/tests/test/index.html>

* Try:
Run with --stacktrace option to get the stack trace. Run with --info or --debug option to
get more log output. Run with --scan to get full insights.

* Get more help at https://help.gradle.org

Deprecated Gradle features were used in this build, making it incompatible with Gradle 6.0.
Use '--warning-mode all' to show the individual deprecation warnings.
See https://docs.gradle.org/5.2.1/userguide/command_line_interface.html#sec:command_line_warnings

BUILD FAILED in 11s
2 actionable tasks: 1 executed, 1 from cache

Publishing build scan...
https://gradle.com/s/n4vitvquhfv6a

Build step 'Invoke Gradle script' changed build result to FAILURE
Build step 'Invoke Gradle script' marked build as failure

---------------------------------------------------------------------
To unsubscribe, e-mail: builds-unsubscribe@beam.apache.org
For additional commands, e-mail: builds-help@beam.apache.org


Mime
View raw message