beam-builds mailing list archives

Site index · List index
Message view « Date » · « Thread »
Top « Date » · « Thread »
From Apache Jenkins Server <jenk...@builds.apache.org>
Subject Build failed in Jenkins: beam_PostCommit_Python2 #168
Date Thu, 08 Aug 2019 15:20:45 GMT
See <https://builds.apache.org/job/beam_PostCommit_Python2/168/display/redirect?page=changes>

Changes:

[robertwb] [BEAM -7741] Implement SetState for Python SDK (#9090)

------------------------------------------
[...truncated 736.10 KB...]
	at org.apache.beam.vendor.guava.v26_0_jre.com.google.common.cache.LocalCache.get(LocalCache.java:3952)
	at org.apache.beam.vendor.guava.v26_0_jre.com.google.common.cache.LocalCache.getOrLoad(LocalCache.java:3974)
	at org.apache.beam.vendor.guava.v26_0_jre.com.google.common.cache.LocalCache$LocalLoadingCache.get(LocalCache.java:4958)
	at org.apache.beam.vendor.guava.v26_0_jre.com.google.common.cache.LocalCache$LocalLoadingCache.getUnchecked(LocalCache.java:4964)
	... 11 more
	Suppressed: java.io.IOException: Received exit code 1 for command 'docker kill 5b4581c4b6f5dceceabddba59c0e3f664dc987c9c71bcabd0960da6374460956'.
stderr: Error response from daemon: Cannot kill container: 5b4581c4b6f5dceceabddba59c0e3f664dc987c9c71bcabd0960da6374460956:
No such container: 5b4581c4b6f5dceceabddba59c0e3f664dc987c9c71bcabd0960da6374460956
		at org.apache.beam.runners.fnexecution.environment.DockerCommand.runShortCommand(DockerCommand.java:179)
		at org.apache.beam.runners.fnexecution.environment.DockerCommand.killContainer(DockerCommand.java:134)
		at org.apache.beam.runners.fnexecution.environment.DockerEnvironmentFactory.createEnvironment(DockerEnvironmentFactory.java:174)
		... 21 more
[flink-akka.actor.default-dispatcher-15] INFO org.apache.flink.runtime.dispatcher.StandaloneDispatcher
- Job fa5949cdc66c8dfb92454a9106c71fee reached globally terminal state FAILED.
[flink-runner-job-invoker] INFO org.apache.flink.runtime.minicluster.MiniCluster - Shutting
down Flink Mini Cluster
[flink-runner-job-invoker] INFO org.apache.flink.runtime.dispatcher.DispatcherRestEndpoint
- Shutting down rest endpoint.
[flink-akka.actor.default-dispatcher-13] INFO org.apache.flink.runtime.jobmaster.JobMaster
- Stopping the JobMaster for job BeamApp-root-0808142849-53572945(fa5949cdc66c8dfb92454a9106c71fee).
[flink-akka.actor.default-dispatcher-10] INFO org.apache.flink.runtime.taskexecutor.TaskExecutor
- Stopping TaskExecutor akka://flink/user/taskmanager_0.
[flink-akka.actor.default-dispatcher-10] INFO org.apache.flink.runtime.state.TaskExecutorLocalStateStoresManager
- Shutting down TaskExecutorLocalStateStoresManager.
[flink-akka.actor.default-dispatcher-13] INFO org.apache.flink.runtime.jobmaster.JobMaster
- Close ResourceManager connection fea7bae6601b337ed718d259eb8700c0: JobManager is shutting
down..
[flink-akka.actor.default-dispatcher-16] INFO org.apache.flink.runtime.jobmaster.slotpool.SlotPool
- Suspending SlotPool.
[flink-akka.actor.default-dispatcher-16] INFO org.apache.flink.runtime.jobmaster.slotpool.SlotPool
- Stopping SlotPool.
[flink-akka.actor.default-dispatcher-15] INFO org.apache.flink.runtime.dispatcher.StandaloneDispatcher
- Stopping dispatcher akka://flink/user/dispatcher1cb14101-c8b4-434a-b0fb-d9169b417fca.
[flink-akka.actor.default-dispatcher-15] INFO org.apache.flink.runtime.dispatcher.StandaloneDispatcher
- Stopping all currently running jobs of dispatcher akka://flink/user/dispatcher1cb14101-c8b4-434a-b0fb-d9169b417fca.
[flink-akka.actor.default-dispatcher-13] INFO org.apache.flink.runtime.resourcemanager.StandaloneResourceManager
- Disconnect job manager 97c2ba28f7d17b0516248ebfb46c4c6e@akka://flink/user/jobmanager_1 for
job fa5949cdc66c8dfb92454a9106c71fee from the resource manager.
[flink-akka.actor.default-dispatcher-16] INFO org.apache.flink.runtime.taskexecutor.TaskExecutor
- JobManager for job fa5949cdc66c8dfb92454a9106c71fee with leader id 97c2ba28f7d17b0516248ebfb46c4c6e
lost leadership.
[flink-akka.actor.default-dispatcher-10] INFO org.apache.flink.runtime.io.disk.iomanager.IOManager
- I/O manager removed spill file directory /tmp/flink-io-6871b8ad-77a5-4204-b930-85c96883e25b
[flink-akka.actor.default-dispatcher-10] INFO org.apache.flink.runtime.io.network.NetworkEnvironment
- Shutting down the network environment and its components.
[flink-akka.actor.default-dispatcher-13] INFO org.apache.flink.runtime.rest.handler.legacy.backpressure.StackTraceSampleCoordinator
- Shutting down stack trace sample coordinator.
[flink-akka.actor.default-dispatcher-13] INFO org.apache.flink.runtime.dispatcher.StandaloneDispatcher
- Stopped dispatcher akka://flink/user/dispatcher1cb14101-c8b4-434a-b0fb-d9169b417fca.
[flink-akka.actor.default-dispatcher-13] INFO org.apache.flink.runtime.resourcemanager.slotmanager.SlotManager
- Closing the SlotManager.
[flink-akka.actor.default-dispatcher-13] INFO org.apache.flink.runtime.resourcemanager.slotmanager.SlotManager
- Suspending the SlotManager.
[ForkJoinPool.commonPool-worker-4] INFO org.apache.flink.runtime.dispatcher.DispatcherRestEndpoint
- Removing cache directory /tmp/flink-web-ui
[ForkJoinPool.commonPool-worker-4] INFO org.apache.flink.runtime.dispatcher.DispatcherRestEndpoint
- Shut down complete.
[flink-akka.actor.default-dispatcher-10] INFO org.apache.flink.runtime.taskexecutor.JobLeaderService
- Stop job leader service.
[flink-akka.actor.default-dispatcher-10] INFO org.apache.flink.runtime.taskexecutor.TaskExecutor
- Stopped TaskExecutor akka://flink/user/taskmanager_0.
[flink-akka.actor.default-dispatcher-10] INFO org.apache.flink.runtime.rpc.akka.AkkaRpcService
- Stopping Akka RPC service.
[flink-akka.actor.default-dispatcher-10] INFO org.apache.flink.runtime.blob.PermanentBlobCache
- Shutting down BLOB cache
[flink-akka.actor.default-dispatcher-10] INFO org.apache.flink.runtime.blob.TransientBlobCache
- Shutting down BLOB cache
[flink-akka.actor.default-dispatcher-10] INFO org.apache.flink.runtime.blob.BlobServer - Stopped
BLOB server at 0.0.0.0:44675
[flink-akka.actor.default-dispatcher-10] INFO org.apache.flink.runtime.rpc.akka.AkkaRpcService
- Stopped Akka RPC service.
[flink-runner-job-invoker] ERROR org.apache.beam.runners.fnexecution.jobsubmission.JobInvocation
- Error during job invocation BeamApp-root-0808142849-53572945_a40af2ea-2f78-48a0-9099-d1306275a7b9.
org.apache.flink.runtime.client.JobExecutionException: Job execution failed.
	at org.apache.flink.runtime.jobmaster.JobResult.toJobExecutionResult(JobResult.java:146)
	at org.apache.flink.runtime.minicluster.MiniCluster.executeJobBlocking(MiniCluster.java:632)
	at org.apache.flink.client.LocalExecutor.executePlan(LocalExecutor.java:234)
	at org.apache.flink.api.java.LocalEnvironment.execute(LocalEnvironment.java:91)
	at org.apache.beam.runners.flink.FlinkBatchPortablePipelineTranslator$BatchTranslationContext.execute(FlinkBatchPortablePipelineTranslator.java:200)
	at org.apache.beam.runners.flink.FlinkPipelineRunner.runPipelineWithTranslator(FlinkPipelineRunner.java:87)
	at org.apache.beam.runners.flink.FlinkPipelineRunner.run(FlinkPipelineRunner.java:63)
	at org.apache.beam.runners.fnexecution.jobsubmission.JobInvocation.runPipeline(JobInvocation.java:74)
	at org.apache.beam.vendor.guava.v26_0_jre.com.google.common.util.concurrent.TrustedListenableFutureTask$TrustedFutureInterruptibleTask.runInterruptibly(TrustedListenableFutureTask.java:125)
	at org.apache.beam.vendor.guava.v26_0_jre.com.google.common.util.concurrent.InterruptibleTask.run(InterruptibleTask.java:57)
	at org.apache.beam.vendor.guava.v26_0_jre.com.google.common.util.concurrent.TrustedListenableFutureTask.run(TrustedListenableFutureTask.java:78)
	at java.util.concurrent.ThreadPoolExecutor.runWorker(ThreadPoolExecutor.java:1149)
	at java.util.concurrent.ThreadPoolExecutor$Worker.run(ThreadPoolExecutor.java:624)
	at java.lang.Thread.run(Thread.java:748)
Caused by: java.lang.Exception: The user defined 'open()' method caused an exception: java.io.IOException:
Received exit code 1 for command 'docker inspect -f {{.State.Running}} 5b4581c4b6f5dceceabddba59c0e3f664dc987c9c71bcabd0960da6374460956'.
stderr: Error: No such object: 5b4581c4b6f5dceceabddba59c0e3f664dc987c9c71bcabd0960da6374460956
	at org.apache.flink.runtime.operators.BatchTask.run(BatchTask.java:498)
	at org.apache.flink.runtime.operators.BatchTask.invoke(BatchTask.java:368)
	at org.apache.flink.runtime.taskmanager.Task.run(Task.java:712)
	... 1 more
Caused by: org.apache.beam.vendor.guava.v26_0_jre.com.google.common.util.concurrent.UncheckedExecutionException:
java.io.IOException: Received exit code 1 for command 'docker inspect -f {{.State.Running}}
5b4581c4b6f5dceceabddba59c0e3f664dc987c9c71bcabd0960da6374460956'. stderr: Error: No such
object: 5b4581c4b6f5dceceabddba59c0e3f664dc987c9c71bcabd0960da6374460956
	at org.apache.beam.vendor.guava.v26_0_jre.com.google.common.cache.LocalCache$LocalLoadingCache.getUnchecked(LocalCache.java:4966)
	at org.apache.beam.runners.fnexecution.control.DefaultJobBundleFactory$SimpleStageBundleFactory.<init>(DefaultJobBundleFactory.java:211)
	at org.apache.beam.runners.fnexecution.control.DefaultJobBundleFactory$SimpleStageBundleFactory.<init>(DefaultJobBundleFactory.java:202)
	at org.apache.beam.runners.fnexecution.control.DefaultJobBundleFactory.forStage(DefaultJobBundleFactory.java:185)
	at org.apache.beam.runners.flink.translation.functions.FlinkDefaultExecutableStageContext.getStageBundleFactory(FlinkDefaultExecutableStageContext.java:49)
	at org.apache.beam.runners.flink.translation.functions.ReferenceCountingFlinkExecutableStageContextFactory$WrappedContext.getStageBundleFactory(ReferenceCountingFlinkExecutableStageContextFactory.java:203)
	at org.apache.beam.runners.flink.translation.functions.FlinkExecutableStageFunction.open(FlinkExecutableStageFunction.java:129)
	at org.apache.flink.api.common.functions.util.FunctionUtils.openFunction(FunctionUtils.java:36)
	at org.apache.flink.runtime.operators.BatchTask.run(BatchTask.java:494)
	... 3 more
Caused by: java.io.IOException: Received exit code 1 for command 'docker inspect -f {{.State.Running}}
5b4581c4b6f5dceceabddba59c0e3f664dc987c9c71bcabd0960da6374460956'. stderr: Error: No such
object: 5b4581c4b6f5dceceabddba59c0e3f664dc987c9c71bcabd0960da6374460956
	at org.apache.beam.runners.fnexecution.environment.DockerCommand.runShortCommand(DockerCommand.java:179)
	at org.apache.beam.runners.fnexecution.environment.DockerCommand.isContainerRunning(DockerCommand.java:112)
	at org.apache.beam.runners.fnexecution.environment.DockerEnvironmentFactory.createEnvironment(DockerEnvironmentFactory.java:160)
	at org.apache.beam.runners.fnexecution.control.DefaultJobBundleFactory$1.load(DefaultJobBundleFactory.java:178)
	at org.apache.beam.runners.fnexecution.control.DefaultJobBundleFactory$1.load(DefaultJobBundleFactory.java:162)
	at org.apache.beam.vendor.guava.v26_0_jre.com.google.common.cache.LocalCache$LoadingValueReference.loadFuture(LocalCache.java:3528)
	at org.apache.beam.vendor.guava.v26_0_jre.com.google.common.cache.LocalCache$Segment.loadSync(LocalCache.java:2277)
	at org.apache.beam.vendor.guava.v26_0_jre.com.google.common.cache.LocalCache$Segment.lockedGetOrLoad(LocalCache.java:2154)
	at org.apache.beam.vendor.guava.v26_0_jre.com.google.common.cache.LocalCache$Segment.get(LocalCache.java:2044)
	at org.apache.beam.vendor.guava.v26_0_jre.com.google.common.cache.LocalCache.get(LocalCache.java:3952)
	at org.apache.beam.vendor.guava.v26_0_jre.com.google.common.cache.LocalCache.getOrLoad(LocalCache.java:3974)
	at org.apache.beam.vendor.guava.v26_0_jre.com.google.common.cache.LocalCache$LocalLoadingCache.get(LocalCache.java:4958)
	at org.apache.beam.vendor.guava.v26_0_jre.com.google.common.cache.LocalCache$LocalLoadingCache.getUnchecked(LocalCache.java:4964)
	... 11 more
	Suppressed: java.io.IOException: Received exit code 1 for command 'docker kill 5b4581c4b6f5dceceabddba59c0e3f664dc987c9c71bcabd0960da6374460956'.
stderr: Error response from daemon: Cannot kill container: 5b4581c4b6f5dceceabddba59c0e3f664dc987c9c71bcabd0960da6374460956:
No such container: 5b4581c4b6f5dceceabddba59c0e3f664dc987c9c71bcabd0960da6374460956
		at org.apache.beam.runners.fnexecution.environment.DockerCommand.runShortCommand(DockerCommand.java:179)
		at org.apache.beam.runners.fnexecution.environment.DockerCommand.killContainer(DockerCommand.java:134)
		at org.apache.beam.runners.fnexecution.environment.DockerEnvironmentFactory.createEnvironment(DockerEnvironmentFactory.java:174)
		... 21 more
[flink-runner-job-invoker] INFO org.apache.beam.runners.fnexecution.artifact.BeamFileSystemArtifactRetrievalService
- Manifest at /tmp/beam-artifact-staging/job_ca5ffa43-bcc0-4b33-a8d2-57d513b3c1a3/MANIFEST
has 1 artifact locations
[flink-runner-job-invoker] INFO org.apache.beam.runners.fnexecution.artifact.BeamFileSystemArtifactStagingService
- Removed dir /tmp/beam-artifact-staging/job_ca5ffa43-bcc0-4b33-a8d2-57d513b3c1a3/
ERROR:root:java.io.IOException: Received exit code 1 for command 'docker inspect -f {{.State.Running}}
5b4581c4b6f5dceceabddba59c0e3f664dc987c9c71bcabd0960da6374460956'. stderr: Error: No such
object: 5b4581c4b6f5dceceabddba59c0e3f664dc987c9c71bcabd0960da6374460956
Traceback (most recent call last):
  File "/usr/lib/python2.7/runpy.py", line 174, in _run_module_as_main
    "__main__", fname, loader, pkg_name)
  File "/usr/lib/python2.7/runpy.py", line 72, in _run_code
    exec code in run_globals
  File "<https://builds.apache.org/job/beam_PostCommit_Python2/ws/src/sdks/python/apache_beam/transforms/external_test.py",>
line 236, in <module>
    ExternalTransformTest.run_pipeline_with_portable_runner(pipeline_options)
  File "<https://builds.apache.org/job/beam_PostCommit_Python2/ws/src/sdks/python/apache_beam/transforms/external_test.py",>
line 186, in run_pipeline_with_portable_runner
    pipeline_options, ExternalTransformTest.expansion_service_port, True)
  File "<https://builds.apache.org/job/beam_PostCommit_Python2/ws/src/sdks/python/apache_beam/transforms/external_test.py",>
line 219, in run_pipeline
    result = p.run()
  File "apache_beam/testing/test_pipeline.py", line 109, in run
    state = result.wait_until_finish()
  File "apache_beam/runners/portability/portable_runner.py", line 446, in wait_until_finish
    self._job_id, self._state, self._last_error_message()))
RuntimeError: Pipeline BeamApp-root-0808142849-53572945_a40af2ea-2f78-48a0-9099-d1306275a7b9
failed in state FAILED: java.io.IOException: Received exit code 1 for command 'docker inspect
-f {{.State.Running}} 5b4581c4b6f5dceceabddba59c0e3f664dc987c9c71bcabd0960da6374460956'. stderr:
Error: No such object: 5b4581c4b6f5dceceabddba59c0e3f664dc987c9c71bcabd0960da6374460956

> Task :sdks:python:test-suites:portable:py2:crossLanguagePythonJavaFlink FAILED

> Task :sdks:python:test-suites:dataflow:py2:postCommitIT
test_autocomplete_it (apache_beam.examples.complete.autocomplete_test.AutocompleteTest) ...
ok
test_bigquery_tornadoes_it (apache_beam.examples.cookbook.bigquery_tornadoes_it_test.BigqueryTornadoesIT)
... ok
test_datastore_wordcount_it (apache_beam.examples.cookbook.datastore_wordcount_it_test.DatastoreWordCountIT)
... ok
test_leader_board_it (apache_beam.examples.complete.game.leader_board_it_test.LeaderBoardIT)
... ok
test_datastore_write_limit (apache_beam.io.gcp.datastore.v1new.datastore_write_it_test.DatastoreWriteIT)
... SKIP: GCP dependencies are not installed
<https://builds.apache.org/job/beam_PostCommit_Python2/ws/src/sdks/python/apache_beam/runners/dataflow/dataflow_runner.py>:695:
BeamDeprecationWarning: BigQuerySink is deprecated since 2.11.0. Use WriteToBigQuery instead.
  kms_key=transform.kms_key))
test_game_stats_it (apache_beam.examples.complete.game.game_stats_it_test.GameStatsIT) ...
ok
<https://builds.apache.org/job/beam_PostCommit_Python2/ws/src/sdks/python/apache_beam/io/gcp/bigquery_file_loads.py>:642:
BeamDeprecationWarning: options is deprecated since First stable release. References to <pipeline>.options
will not be supported
  temp_location = p.options.view_as(GoogleCloudOptions).temp_location
test_wordcount_fnapi_it (apache_beam.examples.wordcount_it_test.WordCountIT) ... ok
test_wordcount_it (apache_beam.examples.wordcount_it_test.WordCountIT) ... ok
test_streaming_wordcount_it (apache_beam.examples.streaming_wordcount_it_test.StreamingWordCountIT)
... ok
<https://builds.apache.org/job/beam_PostCommit_Python2/ws/src/sdks/python/apache_beam/io/gcp/bigquery_test.py>:572:
BeamDeprecationWarning: options is deprecated since First stable release. References to <pipeline>.options
will not be supported
  streaming = self.test_pipeline.options.view_as(StandardOptions).streaming
<https://builds.apache.org/job/beam_PostCommit_Python2/ws/src/sdks/python/apache_beam/io/gcp/bigquery.py>:1145:
BeamDeprecationWarning: options is deprecated since First stable release. References to <pipeline>.options
will not be supported
  experiments = p.options.view_as(DebugOptions).experiments or []
test_avro_it (apache_beam.examples.fastavro_it_test.FastavroIT) ... ok
<https://builds.apache.org/job/beam_PostCommit_Python2/ws/src/sdks/python/apache_beam/io/gcp/bigquery.py>:1145:
BeamDeprecationWarning: options is deprecated since First stable release. References to <pipeline>.options
will not be supported
  experiments = p.options.view_as(DebugOptions).experiments or []
<https://builds.apache.org/job/beam_PostCommit_Python2/ws/src/sdks/python/apache_beam/io/gcp/bigquery_file_loads.py>:642:
BeamDeprecationWarning: options is deprecated since First stable release. References to <pipeline>.options
will not be supported
  temp_location = p.options.view_as(GoogleCloudOptions).temp_location
test_hourly_team_score_it (apache_beam.examples.complete.game.hourly_team_score_it_test.HourlyTeamScoreIT)
... ok
test_user_score_it (apache_beam.examples.complete.game.user_score_it_test.UserScoreIT) ...
ok
test_bigquery_read_1M_python (apache_beam.io.gcp.bigquery_io_read_it_test.BigqueryIOReadIT)
... ok
test_copy (apache_beam.io.gcp.gcsio_integration_test.GcsIOIntegrationTest) ... ok
test_copy_batch (apache_beam.io.gcp.gcsio_integration_test.GcsIOIntegrationTest) ... ok
test_copy_batch_kms (apache_beam.io.gcp.gcsio_integration_test.GcsIOIntegrationTest) ... ok
test_copy_batch_rewrite_token (apache_beam.io.gcp.gcsio_integration_test.GcsIOIntegrationTest)
... ok
test_copy_kms (apache_beam.io.gcp.gcsio_integration_test.GcsIOIntegrationTest) ... ok
test_copy_rewrite_token (apache_beam.io.gcp.gcsio_integration_test.GcsIOIntegrationTest) ...
ok
test_multiple_destinations_transform (apache_beam.io.gcp.bigquery_test.BigQueryStreamingInsertTransformIntegrationTests)
... ok
<https://builds.apache.org/job/beam_PostCommit_Python2/ws/src/sdks/python/apache_beam/io/fileio_test.py>:232:
FutureWarning: MatchAll is experimental.
  | 'GetPath' >> beam.Map(lambda metadata: metadata.path))
<https://builds.apache.org/job/beam_PostCommit_Python2/ws/src/sdks/python/apache_beam/io/fileio_test.py>:243:
FutureWarning: MatchAll is experimental.
  | 'Checksums' >> beam.Map(compute_hash))
<https://builds.apache.org/job/beam_PostCommit_Python2/ws/src/sdks/python/apache_beam/io/fileio_test.py>:243:
FutureWarning: ReadMatches is experimental.
  | 'Checksums' >> beam.Map(compute_hash))
test_value_provider_transform (apache_beam.io.gcp.bigquery_test.BigQueryStreamingInsertTransformIntegrationTests)
... ok
test_big_query_read (apache_beam.io.gcp.bigquery_read_it_test.BigQueryReadIntegrationTests)
... ok
test_big_query_read_new_types (apache_beam.io.gcp.bigquery_read_it_test.BigQueryReadIntegrationTests)
... ok
test_bqfl_streaming (apache_beam.io.gcp.bigquery_file_loads_test.BigQueryFileLoadsIT) ...
SKIP: TestStream is not supported on TestDataflowRunner
test_multiple_destinations_transform (apache_beam.io.gcp.bigquery_file_loads_test.BigQueryFileLoadsIT)
... ok
test_one_job_fails_all_jobs_fail (apache_beam.io.gcp.bigquery_file_loads_test.BigQueryFileLoadsIT)
... ok
<https://builds.apache.org/job/beam_PostCommit_Python2/ws/src/sdks/python/apache_beam/io/gcp/big_query_query_to_table_pipeline.py>:73:
BeamDeprecationWarning: BigQuerySink is deprecated since 2.11.0. Use WriteToBigQuery instead.
  kms_key=kms_key))
test_transform_on_gcs (apache_beam.io.fileio_test.MatchIntegrationTest) ... ok
test_parquetio_it (apache_beam.io.parquetio_it_test.TestParquetIT) ... ok
test_job_python_from_python_it (apache_beam.transforms.external_test_it.ExternalTransformIT)
... ok
test_streaming_data_only (apache_beam.io.gcp.pubsub_integration_test.PubSubIntegrationTest)
... ok
test_streaming_with_attributes (apache_beam.io.gcp.pubsub_integration_test.PubSubIntegrationTest)
... ok
test_big_query_legacy_sql (apache_beam.io.gcp.big_query_query_to_table_it_test.BigQueryQueryToTableIT)
... ok
test_big_query_new_types (apache_beam.io.gcp.big_query_query_to_table_it_test.BigQueryQueryToTableIT)
... ok
test_big_query_standard_sql (apache_beam.io.gcp.big_query_query_to_table_it_test.BigQueryQueryToTableIT)
... ok
test_big_query_standard_sql_kms_key_native (apache_beam.io.gcp.big_query_query_to_table_it_test.BigQueryQueryToTableIT)
... ok
test_big_query_write (apache_beam.io.gcp.bigquery_write_it_test.BigQueryWriteIntegrationTests)
... ok
test_big_query_write_new_types (apache_beam.io.gcp.bigquery_write_it_test.BigQueryWriteIntegrationTests)
... ok
test_big_query_write_schema_autodetect (apache_beam.io.gcp.bigquery_write_it_test.BigQueryWriteIntegrationTests)
... SKIP: DataflowRunner does not support schema autodetection
test_big_query_write_without_schema (apache_beam.io.gcp.bigquery_write_it_test.BigQueryWriteIntegrationTests)
... ok
test_metrics_fnapi_it (apache_beam.runners.dataflow.dataflow_exercise_metrics_pipeline_test.ExerciseMetricsPipelineTest)
... ok
test_metrics_it (apache_beam.runners.dataflow.dataflow_exercise_metrics_pipeline_test.ExerciseMetricsPipelineTest)
... ok
test_datastore_write_limit (apache_beam.io.gcp.datastore_write_it_test.DatastoreWriteIT) ...
ok

----------------------------------------------------------------------
XML: nosetests-postCommitIT-df.xml
----------------------------------------------------------------------
XML: <https://builds.apache.org/job/beam_PostCommit_Python2/ws/src/sdks/python/nosetests.xml>
----------------------------------------------------------------------
Ran 42 tests in 3517.245s

OK (SKIP=3)
Found: https://console.cloud.google.com/dataflow/jobsDetail/locations/us-central1/jobs/2019-08-08_07_22_21-10900124926254287699?project=apache-beam-testing.
Found: https://console.cloud.google.com/dataflow/jobsDetail/locations/us-central1/jobs/2019-08-08_07_42_17-16379824777972995941?project=apache-beam-testing.
Found: https://console.cloud.google.com/dataflow/jobsDetail/locations/us-central1/jobs/2019-08-08_07_48_44-9636875548675548106?project=apache-beam-testing.
Found: https://console.cloud.google.com/dataflow/jobsDetail/locations/us-central1/jobs/2019-08-08_07_57_10-2063653436789347635?project=apache-beam-testing.
Found: https://console.cloud.google.com/dataflow/jobsDetail/locations/us-central1/jobs/2019-08-08_08_05_10-9117022190015416951?project=apache-beam-testing.
Found: https://console.cloud.google.com/dataflow/jobsDetail/locations/us-central1/jobs/2019-08-08_08_12_46-5374210114278675513?project=apache-beam-testing.
Found: https://console.cloud.google.com/dataflow/jobsDetail/locations/us-central1/jobs/2019-08-08_07_22_22-4649718559913676860?project=apache-beam-testing.
Found: https://console.cloud.google.com/dataflow/jobsDetail/locations/us-central1/jobs/2019-08-08_07_37_19-4802789348718598646?project=apache-beam-testing.
Found: https://console.cloud.google.com/dataflow/jobsDetail/locations/us-central1/jobs/2019-08-08_07_46_16-7120467269647224613?project=apache-beam-testing.
Found: https://console.cloud.google.com/dataflow/jobsDetail/locations/us-central1/jobs/2019-08-08_07_54_34-11029654812776874457?project=apache-beam-testing.
Found: https://console.cloud.google.com/dataflow/jobsDetail/locations/us-central1/jobs/2019-08-08_07_22_20-9758092306832937846?project=apache-beam-testing.
Found: https://console.cloud.google.com/dataflow/jobsDetail/locations/us-central1/jobs/2019-08-08_07_41_52-4066988344730910069?project=apache-beam-testing.
Found: https://console.cloud.google.com/dataflow/jobsDetail/locations/us-central1/jobs/2019-08-08_07_48_25-14833681501306920651?project=apache-beam-testing.
Found: https://console.cloud.google.com/dataflow/jobsDetail/locations/us-central1/jobs/2019-08-08_07_55_57-5164304361153443000?project=apache-beam-testing.
Found: https://console.cloud.google.com/dataflow/jobsDetail/locations/us-central1/jobs/2019-08-08_07_22_22-5492506585062753216?project=apache-beam-testing.
Found: https://console.cloud.google.com/dataflow/jobsDetail/locations/us-central1/jobs/2019-08-08_07_35_33-10136725309423200987?project=apache-beam-testing.
Found: https://console.cloud.google.com/dataflow/jobsDetail/locations/us-central1/jobs/2019-08-08_07_42_15-1378950107105780336?project=apache-beam-testing.
Found: https://console.cloud.google.com/dataflow/jobsDetail/locations/us-central1/jobs/2019-08-08_07_48_47-12364348686630924629?project=apache-beam-testing.
Found: https://console.cloud.google.com/dataflow/jobsDetail/locations/us-central1/jobs/2019-08-08_07_55_59-10822040687131477157?project=apache-beam-testing.
Found: https://console.cloud.google.com/dataflow/jobsDetail/locations/us-central1/jobs/2019-08-08_07_22_21-12401898445968770721?project=apache-beam-testing.
Found: https://console.cloud.google.com/dataflow/jobsDetail/locations/us-central1/jobs/2019-08-08_07_30_33-12828456927370485386?project=apache-beam-testing.
Found: https://console.cloud.google.com/dataflow/jobsDetail/locations/us-central1/jobs/2019-08-08_07_39_44-14989788346688473461?project=apache-beam-testing.
Found: https://console.cloud.google.com/dataflow/jobsDetail/locations/us-central1/jobs/2019-08-08_07_48_12-16011375875722898814?project=apache-beam-testing.
Found: https://console.cloud.google.com/dataflow/jobsDetail/locations/us-central1/jobs/2019-08-08_07_22_20-12496705116853109413?project=apache-beam-testing.
Found: https://console.cloud.google.com/dataflow/jobsDetail/locations/us-central1/jobs/2019-08-08_07_30_33-10717639693654027464?project=apache-beam-testing.
Found: https://console.cloud.google.com/dataflow/jobsDetail/locations/us-central1/jobs/2019-08-08_07_38_37-11438369011568771627?project=apache-beam-testing.
Found: https://console.cloud.google.com/dataflow/jobsDetail/locations/us-central1/jobs/2019-08-08_07_47_15-1355472439299198532?project=apache-beam-testing.
Found: https://console.cloud.google.com/dataflow/jobsDetail/locations/us-central1/jobs/2019-08-08_07_54_39-7168049863974309014?project=apache-beam-testing.
Found: https://console.cloud.google.com/dataflow/jobsDetail/locations/us-central1/jobs/2019-08-08_07_22_21-17389431265225887793?project=apache-beam-testing.
Found: https://console.cloud.google.com/dataflow/jobsDetail/locations/us-central1/jobs/2019-08-08_07_31_22-594749977428453524?project=apache-beam-testing.
Found: https://console.cloud.google.com/dataflow/jobsDetail/locations/us-central1/jobs/2019-08-08_07_39_34-16784378434967611553?project=apache-beam-testing.
Found: https://console.cloud.google.com/dataflow/jobsDetail/locations/us-central1/jobs/2019-08-08_07_46_45-16079042174656194148?project=apache-beam-testing.
Found: https://console.cloud.google.com/dataflow/jobsDetail/locations/us-central1/jobs/2019-08-08_07_54_31-14932366939471386331?project=apache-beam-testing.
Found: https://console.cloud.google.com/dataflow/jobsDetail/locations/us-central1/jobs/2019-08-08_08_01_51-1283502514325674360?project=apache-beam-testing.
Found: https://console.cloud.google.com/dataflow/jobsDetail/locations/us-central1/jobs/2019-08-08_07_22_21-1170427613102018795?project=apache-beam-testing.
Found: https://console.cloud.google.com/dataflow/jobsDetail/locations/us-central1/jobs/2019-08-08_07_30_51-16509028550726785970?project=apache-beam-testing.
Found: https://console.cloud.google.com/dataflow/jobsDetail/locations/us-central1/jobs/2019-08-08_07_40_39-10894051443625323510?project=apache-beam-testing.
Found: https://console.cloud.google.com/dataflow/jobsDetail/locations/us-central1/jobs/2019-08-08_07_48_48-6332891577857014898?project=apache-beam-testing.

FAILURE: Build failed with an exception.

* Where:
Build file '<https://builds.apache.org/job/beam_PostCommit_Python2/ws/src/sdks/python/test-suites/portable/py2/build.gradle'>
line: 87

* What went wrong:
Execution failed for task ':sdks:python:test-suites:portable:py2:crossLanguagePythonJavaFlink'.
> Process 'command 'sh'' finished with non-zero exit value 1

* Try:
Run with --stacktrace option to get the stack trace. Run with --info or --debug option to
get more log output. Run with --scan to get full insights.

* Get more help at https://help.gradle.org

Deprecated Gradle features were used in this build, making it incompatible with Gradle 6.0.
Use '--warning-mode all' to show the individual deprecation warnings.
See https://docs.gradle.org/5.2.1/userguide/command_line_interface.html#sec:command_line_warnings

BUILD FAILED in 59m 42s
111 actionable tasks: 86 executed, 22 from cache, 3 up-to-date

Publishing build scan...
https://gradle.com/s/aulizzzxxlqha

Build step 'Invoke Gradle script' changed build result to FAILURE
Build step 'Invoke Gradle script' marked build as failure

---------------------------------------------------------------------
To unsubscribe, e-mail: builds-unsubscribe@beam.apache.org
For additional commands, e-mail: builds-help@beam.apache.org


Mime
View raw message