beam-builds mailing list archives

Site index · List index
Message view « Date » · « Thread »
Top « Date » · « Thread »
From Apache Jenkins Server <jenk...@builds.apache.org>
Subject Build failed in Jenkins: beam_PerformanceTests_WordCountIT_Py27 #304
Date Mon, 29 Jul 2019 18:24:45 GMT
See <https://builds.apache.org/job/beam_PerformanceTests_WordCountIT_Py27/304/display/redirect?page=changes>

Changes:

[iemejia] [BEAM-7807] Forbid TestNG imports on Beam classes

[iemejia] [BEAM-7807] Update Beam tests to not import TestNG related classes

[filiperegadas] [BEAM-7830]: make spark default duration consistent with PipelineResult

[alireza4263] [BEAM-7783] BeamIOSourceRel using custom BeamStatistics

[filiperegadas] fixup! [BEAM-7830]: make spark default duration consistent with

[mxm] [BEAM-7366] Restore Spotless check for Flink Runner

[jozsi] Set job name in Jet Runner

[b_m.vishwas] [BEAM-7623] Add support to select MAP with Row as values in Beam SQL

[pabloem] [BEAM-7814] Make BigqueryMatcher wait for results. (#9154)

------------------------------------------
[...truncated 16.13 KB...]
--beam_it_class=apache_beam.examples.wordcount_it_test:WordCountIT.test_wordcount_it
--beam_it_timeout=1200
--beam_it_module=:sdks:python:test-suites:dataflow:py2
--beam_sdk=python
--k8s_get_wait_interval=10
--bigquery_table=beam_performance.wordcount_py27_pkb_results
--temp_dir=<https://builds.apache.org/job/beam_PerformanceTests_WordCountIT_Py27/ws/>
--beam_it_args=--project=apache-beam-testing,--staging_location=gs://temp-storage-for-end-to-end-tests/staging-it,--temp_location=gs://temp-storage-for-end-to-end-tests/temp-it,--input=gs://apache-beam-samples/input_small_files/ascii_sort_1MB_input.0000*,--output=gs://temp-storage-for-end-to-end-tests/py-it-cloud/output,--expect_checksum=ea0ca2e5ee4ea5f218790f28d0b9fe7d09d8d710,--num_workers=10,--autoscaling_algorithm=NONE
--beam_prebuilt
--dpb_service_zone=fake_zone
--project=apache-beam-testing
--official
--dpb_log_level=INFO
--beam_location=<https://builds.apache.org/job/beam_PerformanceTests_WordCountIT_Py27/ws/src>
--beam_runner=TestDataflowRunner
--k8s_get_retry_count=36
--benchmarks=beam_integration_benchmark
--beam_python_sdk_location=test-suites/dataflow/py2/build/apache-beam.tar.gz
2019-07-29 18:24:33,028 2cd7e382 MainThread INFO     Setting --max_concurrent_threads=200.
2019-07-29 18:24:33,052 2cd7e382 MainThread WARNING  The key "flags" was not in the default
config, but was in user overrides. This may indicate a typo.
2019-07-29 18:24:33,075 2cd7e382 MainThread beam_integration_benchmark(1/1) INFO     Provisioning
resources for benchmark beam_integration_benchmark
2019-07-29 18:24:33,077 2cd7e382 MainThread beam_integration_benchmark(1/1) INFO     Preparing
benchmark beam_integration_benchmark
2019-07-29 18:24:33,078 2cd7e382 MainThread beam_integration_benchmark(1/1) INFO     Running
benchmark beam_integration_benchmark
2019-07-29 18:24:33,087 2cd7e382 MainThread beam_integration_benchmark(1/1) INFO     Running:
<https://builds.apache.org/job/beam_PerformanceTests_WordCountIT_Py27/ws/src/gradlew>
:sdks:python:test-suites:dataflow:py2:integrationTest -Dtests=apache_beam.examples.wordcount_it_test:WordCountIT.test_wordcount_it
-Dattr=IT -DpipelineOptions="--project=apache-beam-testing" "--staging_location=gs://temp-storage-for-end-to-end-tests/staging-it"
"--temp_location=gs://temp-storage-for-end-to-end-tests/temp-it" "--input=gs://apache-beam-samples/input_small_files/ascii_sort_1MB_input.0000*"
"--output=gs://temp-storage-for-end-to-end-tests/py-it-cloud/output" "--expect_checksum=ea0ca2e5ee4ea5f218790f28d0b9fe7d09d8d710"
"--num_workers=10" "--autoscaling_algorithm=NONE" "--runner=TestDataflowRunner" "--sdk_location=test-suites/dataflow/py2/build/apache-beam.tar.gz"
--info --scan
2019-07-29 18:24:44,385 2cd7e382 MainThread beam_integration_benchmark(1/1) INFO     Ran:
{<https://builds.apache.org/job/beam_PerformanceTests_WordCountIT_Py27/ws/src/gradlew>
:sdks:python:test-suites:dataflow:py2:integrationTest -Dtests=apache_beam.examples.wordcount_it_test:WordCountIT.test_wordcount_it
-Dattr=IT -DpipelineOptions="--project=apache-beam-testing" "--staging_location=gs://temp-storage-for-end-to-end-tests/staging-it"
"--temp_location=gs://temp-storage-for-end-to-end-tests/temp-it" "--input=gs://apache-beam-samples/input_small_files/ascii_sort_1MB_input.0000*"
"--output=gs://temp-storage-for-end-to-end-tests/py-it-cloud/output" "--expect_checksum=ea0ca2e5ee4ea5f218790f28d0b9fe7d09d8d710"
"--num_workers=10" "--autoscaling_algorithm=NONE" "--runner=TestDataflowRunner" "--sdk_location=test-suites/dataflow/py2/build/apache-beam.tar.gz"
--info --scan}  ReturnCode:1
STDOUT: Initialized native services in: /home/jenkins/.gradle/native
Removing 0 daemon stop events from registry
Starting a Gradle Daemon, 1 busy Daemon could not be reused, use --status for details
Starting process 'Gradle build daemon'. Working directory: /home/jenkins/.gradle/daemon/5.2.1
Command: /usr/lib/jvm/java-8-openjdk-amd64/bin/java -Xss10240k -Dfile.encoding=UTF-8 -Duser.country=US
-Duser.language=en -Duser.variant -cp /home/jenkins/.gradle/wrapper/dists/gradle-5.2.1-all/bviwmvmbexq6idcscbicws5me/gradle-5.2.1/lib/gradle-launcher-5.2.1.jar
org.gradle.launcher.daemon.bootstrap.GradleDaemon 5.2.1
Successfully started process 'Gradle build daemon'
An attempt to start the daemon took 0.884 secs.
The client will now receive all logging from the daemon (pid: 29035). The daemon log file:
/home/jenkins/.gradle/daemon/5.2.1/daemon-29035.out.log
Starting build in new daemon [memory: 24.4 GB]
Using 16 worker leases.
Starting Build
Using local directory build cache for build ':buildSrc' (location = /home/jenkins/.gradle/caches/build-cache-1,
removeUnusedEntriesAfter = 7 days).

> Configure project :buildSrc
Evaluating project ':buildSrc' using build file '<https://builds.apache.org/job/beam_PerformanceTests_WordCountIT_Py27/ws/src/buildSrc/build.gradle'.>
file or directory '<https://builds.apache.org/job/beam_PerformanceTests_WordCountIT_Py27/ws/src/buildSrc/src/test/groovy',>
not found
Selected primary task 'build' from project :
file or directory '<https://builds.apache.org/job/beam_PerformanceTests_WordCountIT_Py27/ws/src/buildSrc/src/test/groovy',>
not found
:buildSrc:compileJava (Thread[Execution worker for ':buildSrc' Thread 5,5,main]) started.

> Task :buildSrc:compileJava NO-SOURCE
file or directory '<https://builds.apache.org/job/beam_PerformanceTests_WordCountIT_Py27/ws/src/buildSrc/src/main/java',>
not found
Skipping task ':buildSrc:compileJava' as it has no source files and no previous output files.
:buildSrc:compileJava (Thread[Execution worker for ':buildSrc' Thread 5,5,main]) completed.
Took 0.039 secs.
:buildSrc:compileGroovy (Thread[Execution worker for ':buildSrc' Thread 5,5,main]) started.

> Task :buildSrc:compileGroovy FROM-CACHE
Build cache key for task ':buildSrc:compileGroovy' is 5d9c169820c0b65f4aeff37d6abb350b
Task ':buildSrc:compileGroovy' is not up-to-date because:
  No history is available.
Origin for org.gradle.api.internal.tasks.execution.ExecuteActionsTaskExecuter$TaskExecution@6bc14953:
{executionTime=2677, hostName=apache-beam-jenkins-6, operatingSystem=Linux, buildInvocationId=xj2itl5pkzbxfmiw24bwuxgiyy,
creationTime=1564265908180, identity=:compileGroovy, type=org.gradle.api.internal.tasks.execution.ExecuteActionsTaskExecuter.TaskExecution,
userName=jenkins, gradleVersion=5.2.1, rootPath=/home/jenkins/jenkins-slave/workspace/beam_PreCommit_RAT_Commit/src/buildSrc}
Unpacked trees for task ':buildSrc:compileGroovy' from cache.
:buildSrc:compileGroovy (Thread[Execution worker for ':buildSrc' Thread 5,5,main]) completed.
Took 0.222 secs.
:buildSrc:pluginDescriptors (Thread[Execution worker for ':buildSrc' Thread 5,5,main]) started.

> Task :buildSrc:pluginDescriptors
Build cache key for task ':buildSrc:pluginDescriptors' is db14b8b6679df7db8b87deb94d04a710
Caching disabled for task ':buildSrc:pluginDescriptors': Caching has not been enabled for
the task
Task ':buildSrc:pluginDescriptors' is not up-to-date because:
  No history is available.
:buildSrc:pluginDescriptors (Thread[Execution worker for ':buildSrc' Thread 5,5,main]) completed.
Took 0.022 secs.
:buildSrc:processResources (Thread[Execution worker for ':buildSrc' Thread 5,5,main]) started.

> Task :buildSrc:processResources
file or directory '<https://builds.apache.org/job/beam_PerformanceTests_WordCountIT_Py27/ws/src/buildSrc/src/main/resources',>
not found
Build cache key for task ':buildSrc:processResources' is d9c17925b763b8381ce3e616f3244816
Caching disabled for task ':buildSrc:processResources': Caching has not been enabled for the
task
Task ':buildSrc:processResources' is not up-to-date because:
  No history is available.
file or directory '<https://builds.apache.org/job/beam_PerformanceTests_WordCountIT_Py27/ws/src/buildSrc/src/main/resources',>
not found
:buildSrc:processResources (Thread[Execution worker for ':buildSrc' Thread 5,5,main]) completed.
Took 0.028 secs.
:buildSrc:classes (Thread[Execution worker for ':buildSrc' Thread 5,5,main]) started.

> Task :buildSrc:classes
Skipping task ':buildSrc:classes' as it has no actions.
:buildSrc:classes (Thread[Execution worker for ':buildSrc' Thread 5,5,main]) completed. Took
0.0 secs.
:buildSrc:jar (Thread[Execution worker for ':buildSrc' Thread 5,5,main]) started.

> Task :buildSrc:jar
Build cache key for task ':buildSrc:jar' is 5e8bf711fef05987f4db1de18da304ef
Caching disabled for task ':buildSrc:jar': Caching has not been enabled for the task
Task ':buildSrc:jar' is not up-to-date because:
  No history is available.
:buildSrc:jar (Thread[Execution worker for ':buildSrc' Thread 5,5,main]) completed. Took 0.221
secs.
:buildSrc:assemble (Thread[Execution worker for ':buildSrc' Thread 5,5,main]) started.

> Task :buildSrc:assemble
Skipping task ':buildSrc:assemble' as it has no actions.
:buildSrc:assemble (Thread[Execution worker for ':buildSrc' Thread 5,5,main]) completed. Took
0.0 secs.
:buildSrc:spotlessGroovy (Thread[Execution worker for ':buildSrc' Thread 5,5,main]) started.

> Task :buildSrc:spotlessGroovy
file or directory '<https://builds.apache.org/job/beam_PerformanceTests_WordCountIT_Py27/ws/src/buildSrc/src/test/groovy',>
not found
file or directory '<https://builds.apache.org/job/beam_PerformanceTests_WordCountIT_Py27/ws/src/buildSrc/src/test/groovy',>
not found
file or directory '<https://builds.apache.org/job/beam_PerformanceTests_WordCountIT_Py27/ws/src/buildSrc/src/test/groovy',>
not found
Caching disabled for task ':buildSrc:spotlessGroovy': Caching has not been enabled for the
task
Task ':buildSrc:spotlessGroovy' is not up-to-date because:
  No history is available.
All input files are considered out-of-date for incremental task ':buildSrc:spotlessGroovy'.
:buildSrc:spotlessGroovy (Thread[Execution worker for ':buildSrc' Thread 5,5,main]) completed.
Took 1.923 secs.
:buildSrc:spotlessGroovyCheck (Thread[Execution worker for ':buildSrc' Thread 5,5,main]) started.

> Task :buildSrc:spotlessGroovyCheck
Skipping task ':buildSrc:spotlessGroovyCheck' as it has no actions.
:buildSrc:spotlessGroovyCheck (Thread[Execution worker for ':buildSrc' Thread 5,5,main]) completed.
Took 0.0 secs.
:buildSrc:spotlessGroovyGradle (Thread[Execution worker for ':buildSrc' Thread 5,5,main])
started.

> Task :buildSrc:spotlessGroovyGradle
Caching disabled for task ':buildSrc:spotlessGroovyGradle': Caching has not been enabled for
the task
Task ':buildSrc:spotlessGroovyGradle' is not up-to-date because:
  No history is available.
All input files are considered out-of-date for incremental task ':buildSrc:spotlessGroovyGradle'.
:buildSrc:spotlessGroovyGradle (Thread[Execution worker for ':buildSrc' Thread 5,5,main])
completed. Took 0.059 secs.
:buildSrc:spotlessGroovyGradleCheck (Thread[Execution worker for ':buildSrc' Thread 5,5,main])
started.

> Task :buildSrc:spotlessGroovyGradleCheck
Skipping task ':buildSrc:spotlessGroovyGradleCheck' as it has no actions.
:buildSrc:spotlessGroovyGradleCheck (Thread[Execution worker for ':buildSrc' Thread 5,5,main])
completed. Took 0.0 secs.
:buildSrc:spotlessCheck (Thread[Execution worker for ':buildSrc' Thread 5,5,main]) started.

> Task :buildSrc:spotlessCheck
Skipping task ':buildSrc:spotlessCheck' as it has no actions.
:buildSrc:spotlessCheck (Thread[Execution worker for ':buildSrc' Thread 5,5,main]) completed.
Took 0.0 secs.
:buildSrc:pluginUnderTestMetadata (Thread[Execution worker for ':buildSrc' Thread 5,5,main])
started.

> Task :buildSrc:pluginUnderTestMetadata
Build cache key for task ':buildSrc:pluginUnderTestMetadata' is daab0c63f29b366c2fa5a971be847338
Caching disabled for task ':buildSrc:pluginUnderTestMetadata': Caching has not been enabled
for the task
Task ':buildSrc:pluginUnderTestMetadata' is not up-to-date because:
  No history is available.
:buildSrc:pluginUnderTestMetadata (Thread[Execution worker for ':buildSrc' Thread 5,5,main])
completed. Took 0.235 secs.
:buildSrc:compileTestJava (Thread[Execution worker for ':buildSrc' Thread 5,5,main]) started.

> Task :buildSrc:compileTestJava NO-SOURCE
file or directory '<https://builds.apache.org/job/beam_PerformanceTests_WordCountIT_Py27/ws/src/buildSrc/src/test/java',>
not found
Skipping task ':buildSrc:compileTestJava' as it has no source files and no previous output
files.
:buildSrc:compileTestJava (Thread[Execution worker for ':buildSrc' Thread 5,5,main]) completed.
Took 0.002 secs.
:buildSrc:compileTestGroovy (Thread[Execution worker for ':buildSrc' Thread 5,5,main]) started.

> Task :buildSrc:compileTestGroovy NO-SOURCE
file or directory '<https://builds.apache.org/job/beam_PerformanceTests_WordCountIT_Py27/ws/src/buildSrc/src/test/groovy',>
not found
Skipping task ':buildSrc:compileTestGroovy' as it has no source files and no previous output
files.
:buildSrc:compileTestGroovy (Thread[Execution worker for ':buildSrc' Thread 5,5,main]) completed.
Took 0.002 secs.
:buildSrc:processTestResources (Thread[Execution worker for ':buildSrc' Thread 5,5,main])
started.

> Task :buildSrc:processTestResources NO-SOURCE
file or directory '<https://builds.apache.org/job/beam_PerformanceTests_WordCountIT_Py27/ws/src/buildSrc/src/test/resources',>
not found
Skipping task ':buildSrc:processTestResources' as it has no source files and no previous output
files.
:buildSrc:processTestResources (Thread[Execution worker for ':buildSrc' Thread 5,5,main])
completed. Took 0.001 secs.
:buildSrc:testClasses (Thread[Execution worker for ':buildSrc' Thread 5,5,main]) started.

> Task :buildSrc:testClasses UP-TO-DATE
Skipping task ':buildSrc:testClasses' as it has no actions.
:buildSrc:testClasses (Thread[Execution worker for ':buildSrc' Thread 5,5,main]) completed.
Took 0.0 secs.
:buildSrc:test (Thread[Execution worker for ':buildSrc' Thread 5,5,main]) started.

> Task :buildSrc:test NO-SOURCE
Skipping task ':buildSrc:test' as it has no source files and no previous output files.
:buildSrc:test (Thread[Execution worker for ':buildSrc' Thread 5,5,main]) completed. Took
0.003 secs.
:buildSrc:validateTaskProperties (Thread[Execution worker for ':buildSrc' Thread 5,5,main])
started.

> Task :buildSrc:validateTaskProperties FROM-CACHE
Build cache key for task ':buildSrc:validateTaskProperties' is c3693b51177605d7fb742ea7486f88cf
Task ':buildSrc:validateTaskProperties' is not up-to-date because:
  No history is available.
Origin for org.gradle.api.internal.tasks.execution.ExecuteActionsTaskExecuter$TaskExecution@deaed06:
{executionTime=187, hostName=apache-beam-jenkins-6, operatingSystem=Linux, buildInvocationId=xj2itl5pkzbxfmiw24bwuxgiyy,
creationTime=1564265910889, identity=:validateTaskProperties, type=org.gradle.api.internal.tasks.execution.ExecuteActionsTaskExecuter.TaskExecution,
userName=jenkins, gradleVersion=5.2.1, rootPath=/home/jenkins/jenkins-slave/workspace/beam_PreCommit_RAT_Commit/src/buildSrc}
Unpacked trees for task ':buildSrc:validateTaskProperties' from cache.
:buildSrc:validateTaskProperties (Thread[Execution worker for ':buildSrc' Thread 5,5,main])
completed. Took 0.011 secs.
:buildSrc:check (Thread[Execution worker for ':buildSrc' Thread 5,5,main]) started.

> Task :buildSrc:check
Skipping task ':buildSrc:check' as it has no actions.
:buildSrc:check (Thread[Execution worker for ':buildSrc' Thread 5,5,main]) completed. Took
0.0 secs.
:buildSrc:build (Thread[Execution worker for ':buildSrc' Thread 5,5,main]) started.

> Task :buildSrc:build
Skipping task ':buildSrc:build' as it has no actions.
:buildSrc:build (Thread[Execution worker for ':buildSrc' Thread 5,5,main]) completed. Took
0.0 secs.
Settings evaluated using settings file '<https://builds.apache.org/job/beam_PerformanceTests_WordCountIT_Py27/ws/src/settings.gradle'.>
Using local directory build cache for the root build (location = /home/jenkins/.gradle/caches/build-cache-1,
removeUnusedEntriesAfter = 7 days).
Projects loaded. Root project using build file '<https://builds.apache.org/job/beam_PerformanceTests_WordCountIT_Py27/ws/src/build.gradle'.>
Included projects: [root project 'beam', project ':beam-test-infra-metrics', project ':beam-test-tools',
project ':examples', project ':model', project ':release', project ':runners', project ':sdks',
project ':vendor', project ':website', project ':examples:java', project ':examples:kotlin',
project ':model:fn-execution', project ':model:job-management', project ':model:pipeline',
project ':runners:apex', project ':runners:core-construction-java', project ':runners:core-java',
project ':runners:direct-java', project ':runners:extensions-java', project ':runners:flink',
project ':runners:gearpump', project ':runners:google-cloud-dataflow-java', project ':runners:java-fn-execution',
project ':runners:jet-experimental', project ':runners:local-java', project ':runners:reference',
project ':runners:samza', project ':runners:spark', project ':sdks:go', project ':sdks:java',
project ':sdks:python', project ':vendor:bytebuddy-1_9_3', project ':vendor:grpc-1_21_0',
project ':vendor:guava-26_0-jre', project ':vendor:sdks-java-extensions-protobuf', project
':runners:extensions-java:metrics', project ':runners:flink:1.5', project ':runners:flink:1.6',
project ':runners:flink:1.7', project ':runners:flink:1.8', project ':runners:google-cloud-dataflow-java:examples',
project ':runners:google-cloud-dataflow-java:examples-streaming', project ':runners:google-cloud-dataflow-java:worker',
project ':runners:reference:java', project ':runners:samza:job-server', project ':runners:spark:job-server',
project ':sdks:go:container', project ':sdks:go:examples', project ':sdks:go:test', project
':sdks:java:bom', project ':sdks:java:build-tools', project ':sdks:java:container', project
':sdks:java:core', project ':sdks:java:extensions', project ':sdks:java:fn-execution', project
':sdks:java:harness', project ':sdks:java:io', project ':sdks:java:javadoc', project ':sdks:java:maven-archetypes',
project ':sdks:java:testing', project ':sdks:python:apache_beam', project ':sdks:python:container',
project ':sdks:python:test-suites', project ':runners:flink:1.5:job-server', project ':runners:flink:1.5:job-server-container',
project ':runners:flink:1.6:job-server', project ':runners:flink:1.6:job-server-container',
project ':runners:flink:1.7:job-server', project ':runners:flink:1.7:job-server-container',
project ':runners:flink:1.8:job-server', project ':runners:flink:1.8:job-server-container',
project ':runners:google-cloud-dataflow-java:worker:legacy-worker', project ':runners:google-cloud-dataflow-java:worker:windmill',
project ':sdks:java:extensions:euphoria', project ':sdks:java:extensions:google-cloud-platform-core',
project ':sdks:java:extensions:jackson', project ':sdks:java:extensions:join-library', project
':sdks:java:extensions:kryo', project ':sdks:java:extensions:protobuf', project ':sdks:java:extensions:sketching',
project ':sdks:java:extensions:sorter', project ':sdks:java:extensions:sql', project ':sdks:java:io:amazon-web-services',
project ':sdks:java:io:amazon-web-services2', project ':sdks:java:io:amqp', project ':sdks:java:io:cassandra',
project ':sdks:java:io:clickhouse', project ':sdks:java:io:common', project ':sdks:java:io:elasticsearch',
project ':sdks:java:io:elasticsearch-tests', project ':sdks:java:io:file-based-io-tests',
project ':sdks:java:io:google-cloud-platform', project ':sdks:java:io:hadoop-common', project
':sdks:java:io:hadoop-file-system', project ':sdks:java:io:hadoop-format', project ':sdks:java:io:hbase',
project ':sdks:java:io:hcatalog', project ':sdks:java:io:jdbc', project ':sdks:java:io:jms',
project ':sdks:java:io:kafka', project ':sdks:java:io:kinesis', project ':sdks:java:io:kudu',
project ':sdks:java:io:mongodb', project ':sdks:java:io:mqtt', project ':sdks:java:io:parquet',
project ':sdks:java:io:rabbitmq', project ':sdks:java:io:redis', project ':sdks:java:io:solr',
project ':sdks:java:io:synthetic', project ':sdks:java:io:tika', project ':sdks:java:io:xml',
project ':sdks:java:maven-archetypes:examples', project ':sdks:java:maven-archetypes:starter',
project ':sdks:java:testing:load-tests', project ':sdks:java:testing:nexmark', project ':sdks:java:testing:test-utils',
project ':sdks:python:apache_beam:testing', project ':sdks:python:container:py3', project
':sdks:python:test-suites:dataflow', project ':sdks:python:test-suites:direct', project ':sdks:python:test-suites:portable',
project ':sdks:python:test-suites:tox', project ':sdks:java:extensions:sql:datacatalog', project
':sdks:java:extensions:sql:hcatalog', project ':sdks:java:extensions:sql:jdbc', project ':sdks:java:extensions:sql:shell',
project ':sdks:java:io:elasticsearch-tests:elasticsearch-tests-2', project ':sdks:java:io:elasticsearch-tests:elasticsearch-tests-5',
project ':sdks:java:io:elasticsearch-tests:elasticsearch-tests-6', project ':sdks:java:io:elasticsearch-tests:elasticsearch-tests-common',
project ':sdks:python:apache_beam:testing:load_tests', project ':sdks:python:test-suites:dataflow:py35',
project ':sdks:python:test-suites:dataflow:py36', project ':sdks:python:test-suites:dataflow:py37',
project ':sdks:python:test-suites:direct:py35', project ':sdks:python:test-suites:direct:py36',
project ':sdks:python:test-suites:direct:py37', project ':sdks:python:test-suites:portable:py35',
project ':sdks:python:test-suites:tox:py35', project ':sdks:python:test-suites:tox:py36',
project ':sdks:python:test-suites:tox:py37']
Configuration on demand is an incubating feature.

> Configure project :
Evaluating root project 'beam' using build file '<https://builds.apache.org/job/beam_PerformanceTests_WordCountIT_Py27/ws/src/build.gradle'.>
Offline dependencies root configured at 'offline-repository'

Deprecated Gradle features were used in this build, making it incompatible with Gradle 6.0.
Use '--warning-mode all' to show the individual deprecation warnings.
See https://docs.gradle.org/5.2.1/userguide/command_line_interface.html#sec:command_line_warnings

Publishing build scan...
https://gradle.com/s/qtcxneueam3ys


STDERR: 
FAILURE: Build failed with an exception.

* What went wrong:
Project 'py2' not found in project ':sdks:python:test-suites:dataflow'.

* Try:
Run with --stacktrace option to get the stack trace. Run with --debug option to get more log
output. Run with --scan to get full insights.

* Get more help at https://help.gradle.org

BUILD FAILED in 9s

2019-07-29 18:24:44,387 2cd7e382 MainThread beam_integration_benchmark(1/1) ERROR    Error
during benchmark beam_integration_benchmark
Traceback (most recent call last):
  File "<https://builds.apache.org/job/beam_PerformanceTests_WordCountIT_Py27/ws/PerfKitBenchmarker/perfkitbenchmarker/pkb.py",>
line 841, in RunBenchmark
    DoRunPhase(spec, collector, detailed_timer)
  File "<https://builds.apache.org/job/beam_PerformanceTests_WordCountIT_Py27/ws/PerfKitBenchmarker/perfkitbenchmarker/pkb.py",>
line 690, in DoRunPhase
    samples = spec.BenchmarkRun(spec)
  File "<https://builds.apache.org/job/beam_PerformanceTests_WordCountIT_Py27/ws/PerfKitBenchmarker/perfkitbenchmarker/linux_benchmarks/beam_integration_benchmark.py",>
line 160, in Run
    job_type=job_type)
  File "<https://builds.apache.org/job/beam_PerformanceTests_WordCountIT_Py27/ws/PerfKitBenchmarker/perfkitbenchmarker/providers/gcp/gcp_dpb_dataflow.py",>
line 90, in SubmitJob
    assert retcode == 0, "Integration Test Failed."
AssertionError: Integration Test Failed.
2019-07-29 18:24:44,388 2cd7e382 MainThread beam_integration_benchmark(1/1) INFO     Cleaning
up benchmark beam_integration_benchmark
2019-07-29 18:24:44,390 2cd7e382 MainThread beam_integration_benchmark(1/1) ERROR    Exception
running benchmark
Traceback (most recent call last):
  File "<https://builds.apache.org/job/beam_PerformanceTests_WordCountIT_Py27/ws/PerfKitBenchmarker/perfkitbenchmarker/pkb.py",>
line 984, in RunBenchmarkTask
    RunBenchmark(spec, collector)
  File "<https://builds.apache.org/job/beam_PerformanceTests_WordCountIT_Py27/ws/PerfKitBenchmarker/perfkitbenchmarker/pkb.py",>
line 841, in RunBenchmark
    DoRunPhase(spec, collector, detailed_timer)
  File "<https://builds.apache.org/job/beam_PerformanceTests_WordCountIT_Py27/ws/PerfKitBenchmarker/perfkitbenchmarker/pkb.py",>
line 690, in DoRunPhase
    samples = spec.BenchmarkRun(spec)
  File "<https://builds.apache.org/job/beam_PerformanceTests_WordCountIT_Py27/ws/PerfKitBenchmarker/perfkitbenchmarker/linux_benchmarks/beam_integration_benchmark.py",>
line 160, in Run
    job_type=job_type)
  File "<https://builds.apache.org/job/beam_PerformanceTests_WordCountIT_Py27/ws/PerfKitBenchmarker/perfkitbenchmarker/providers/gcp/gcp_dpb_dataflow.py",>
line 90, in SubmitJob
    assert retcode == 0, "Integration Test Failed."
AssertionError: Integration Test Failed.
2019-07-29 18:24:44,390 2cd7e382 MainThread beam_integration_benchmark(1/1) ERROR    Benchmark
1/1 beam_integration_benchmark (UID: beam_integration_benchmark0) failed. Execution will continue.
2019-07-29 18:24:44,391 2cd7e382 MainThread beam_integration_benchmark(1/1) INFO     Benchmark
run statuses:
---------------------------------------------------------------------------------
Name                        UID                          Status  Failed Substatus
---------------------------------------------------------------------------------
beam_integration_benchmark  beam_integration_benchmark0  FAILED                  
---------------------------------------------------------------------------------
Success rate: 0.00% (0/1)
2019-07-29 18:24:44,391 2cd7e382 MainThread beam_integration_benchmark(1/1) INFO     Complete
logs can be found at: <https://builds.apache.org/job/beam_PerformanceTests_WordCountIT_Py27/ws/runs/2cd7e382/pkb.log>
2019-07-29 18:24:44,391 2cd7e382 MainThread beam_integration_benchmark(1/1) INFO     Completion
statuses can be found at: <https://builds.apache.org/job/beam_PerformanceTests_WordCountIT_Py27/ws/runs/2cd7e382/completion_statuses.json>
Build step 'Execute shell' marked build as failure

---------------------------------------------------------------------
To unsubscribe, e-mail: builds-unsubscribe@beam.apache.org
For additional commands, e-mail: builds-help@beam.apache.org


Mime
View raw message