beam-builds mailing list archives

Site index · List index
Message view « Date » · « Thread »
Top « Date » · « Thread »
From Apache Jenkins Server <jenk...@builds.apache.org>
Subject Build failed in Jenkins: beam_PerformanceTests_ManyFiles_TextIOIT_HDFS #639
Date Sun, 09 Jun 2019 00:58:00 GMT
See <https://builds.apache.org/job/beam_PerformanceTests_ManyFiles_TextIOIT_HDFS/639/display/redirect?page=changes>

Changes:

[pabloem] BEAM-7475: Update programming guide with stateful and timer example

------------------------------------------
[...truncated 70.95 KB...]

> Task :buildSrc:build UP-TO-DATE
Skipping task ':buildSrc:build' as it has no actions.
:buildSrc:build (Thread[Execution worker for ':buildSrc' Thread 11,5,main]) completed. Took
0.0 secs.
Settings evaluated using settings file '<https://builds.apache.org/job/beam_PerformanceTests_ManyFiles_TextIOIT_HDFS/ws/src/settings.gradle'.>
Using local directory build cache for the root build (location = /home/jenkins/.gradle/caches/build-cache-1,
removeUnusedEntriesAfter = 7 days).
Projects loaded. Root project using build file '<https://builds.apache.org/job/beam_PerformanceTests_ManyFiles_TextIOIT_HDFS/ws/src/build.gradle'.>
Included projects: [root project 'beam', project ':beam-test-infra-metrics', project ':beam-test-tools',
project ':examples', project ':model', project ':release', project ':runners', project ':sdks',
project ':vendor', project ':website', project ':examples:java', project ':examples:kotlin',
project ':model:fn-execution', project ':model:job-management', project ':model:pipeline',
project ':runners:apex', project ':runners:core-construction-java', project ':runners:core-java',
project ':runners:direct-java', project ':runners:extensions-java', project ':runners:flink',
project ':runners:gearpump', project ':runners:google-cloud-dataflow-java', project ':runners:java-fn-execution',
project ':runners:jet-experimental', project ':runners:local-java', project ':runners:reference',
project ':runners:samza', project ':runners:spark', project ':sdks:go', project ':sdks:java',
project ':sdks:python', project ':vendor:bytebuddy-1_9_3', project ':vendor:grpc-1_13_1',
project ':vendor:guava-20_0', project ':vendor:sdks-java-extensions-protobuf', project ':runners:extensions-java:metrics',
project ':runners:flink:1.5', project ':runners:flink:1.6', project ':runners:flink:1.7',
project ':runners:flink:1.8', project ':runners:google-cloud-dataflow-java:examples', project
':runners:google-cloud-dataflow-java:examples-streaming', project ':runners:google-cloud-dataflow-java:worker',
project ':runners:reference:java', project ':runners:samza:job-server', project ':runners:spark:job-server',
project ':sdks:go:container', project ':sdks:go:examples', project ':sdks:go:test', project
':sdks:java:bom', project ':sdks:java:build-tools', project ':sdks:java:container', project
':sdks:java:core', project ':sdks:java:extensions', project ':sdks:java:fn-execution', project
':sdks:java:harness', project ':sdks:java:io', project ':sdks:java:javadoc', project ':sdks:java:maven-archetypes',
project ':sdks:java:testing', project ':sdks:python:apache_beam', project ':sdks:python:container',
project ':sdks:python:test-suites', project ':runners:flink:1.5:job-server', project ':runners:flink:1.5:job-server-container',
project ':runners:flink:1.6:job-server', project ':runners:flink:1.6:job-server-container',
project ':runners:flink:1.7:job-server', project ':runners:flink:1.7:job-server-container',
project ':runners:flink:1.8:job-server', project ':runners:flink:1.8:job-server-container',
project ':runners:google-cloud-dataflow-java:worker:legacy-worker', project ':runners:google-cloud-dataflow-java:worker:windmill',
project ':sdks:java:extensions:euphoria', project ':sdks:java:extensions:google-cloud-platform-core',
project ':sdks:java:extensions:jackson', project ':sdks:java:extensions:join-library', project
':sdks:java:extensions:kryo', project ':sdks:java:extensions:protobuf', project ':sdks:java:extensions:sketching',
project ':sdks:java:extensions:sorter', project ':sdks:java:extensions:sql', project ':sdks:java:io:amazon-web-services',
project ':sdks:java:io:amqp', project ':sdks:java:io:cassandra', project ':sdks:java:io:clickhouse',
project ':sdks:java:io:common', project ':sdks:java:io:elasticsearch', project ':sdks:java:io:elasticsearch-tests',
project ':sdks:java:io:file-based-io-tests', project ':sdks:java:io:google-cloud-platform',
project ':sdks:java:io:hadoop-common', project ':sdks:java:io:hadoop-file-system', project
':sdks:java:io:hadoop-format', project ':sdks:java:io:hbase', project ':sdks:java:io:hcatalog',
project ':sdks:java:io:jdbc', project ':sdks:java:io:jms', project ':sdks:java:io:kafka',
project ':sdks:java:io:kinesis', project ':sdks:java:io:kudu', project ':sdks:java:io:mongodb',
project ':sdks:java:io:mqtt', project ':sdks:java:io:parquet', project ':sdks:java:io:rabbitmq',
project ':sdks:java:io:redis', project ':sdks:java:io:solr', project ':sdks:java:io:synthetic',
project ':sdks:java:io:tika', project ':sdks:java:io:xml', project ':sdks:java:maven-archetypes:examples',
project ':sdks:java:maven-archetypes:starter', project ':sdks:java:testing:load-tests', project
':sdks:java:testing:nexmark', project ':sdks:java:testing:test-utils', project ':sdks:python:apache_beam:testing',
project ':sdks:python:container:py3', project ':sdks:python:test-suites:dataflow', project
':sdks:python:test-suites:direct', project ':sdks:python:test-suites:tox', project ':sdks:java:extensions:sql:datacatalog',
project ':sdks:java:extensions:sql:hcatalog', project ':sdks:java:extensions:sql:jdbc', project
':sdks:java:extensions:sql:shell', project ':sdks:java:io:elasticsearch-tests:elasticsearch-tests-2',
project ':sdks:java:io:elasticsearch-tests:elasticsearch-tests-5', project ':sdks:java:io:elasticsearch-tests:elasticsearch-tests-6',
project ':sdks:java:io:elasticsearch-tests:elasticsearch-tests-common', project ':sdks:python:apache_beam:testing:load_tests',
project ':sdks:python:test-suites:dataflow:py35', project ':sdks:python:test-suites:dataflow:py36',
project ':sdks:python:test-suites:dataflow:py37', project ':sdks:python:test-suites:direct:py35',
project ':sdks:python:test-suites:direct:py36', project ':sdks:python:test-suites:direct:py37',
project ':sdks:python:test-suites:tox:py35', project ':sdks:python:test-suites:tox:py36',
project ':sdks:python:test-suites:tox:py37']
Configuration on demand is an incubating feature.

> Configure project :
Evaluating root project 'beam' using build file '<https://builds.apache.org/job/beam_PerformanceTests_ManyFiles_TextIOIT_HDFS/ws/src/build.gradle'.>
Offline dependencies root configured at 'offline-repository'

> Configure project :sdks:java:io:file-based-io-tests
Evaluating project ':sdks:java:io:file-based-io-tests' using build file '<https://builds.apache.org/job/beam_PerformanceTests_ManyFiles_TextIOIT_HDFS/ws/src/sdks/java/io/file-based-io-tests/build.gradle'.>
Offline dependencies root configured at 'offline-repository'
Apply OSS Index Plugin
file or directory '<https://builds.apache.org/job/beam_PerformanceTests_ManyFiles_TextIOIT_HDFS/ws/src/sdks/java/io/file-based-io-tests/src/main/java',>
not found

Deprecated Gradle features were used in this build, making it incompatible with Gradle 6.0.
Use '--warning-mode all' to show the individual deprecation warnings.
See https://docs.gradle.org/5.2.1/userguide/command_line_interface.html#sec:command_line_warnings

Publishing build scan...
https://gradle.com/s/w3rgqkv52bdka


STDERR: 
FAILURE: Build failed with an exception.

* Where:
Build file '<https://builds.apache.org/job/beam_PerformanceTests_ManyFiles_TextIOIT_HDFS/ws/src/sdks/java/io/file-based-io-tests/build.gradle'>
line: 21

* What went wrong:
A problem occurred evaluating project ':sdks:java:io:file-based-io-tests'.
> Could not find method shadow() for arguments [DefaultProjectDependency{dependencyProject='project
':runners:google-cloud-dataflow-java:worker:legacy-worker'', configuration='shadow'}] on object
of type org.gradle.api.internal.artifacts.dsl.dependencies.DefaultDependencyHandler.

* Try:
Run with --debug option to get more log output. Run with --scan to get full insights.

* Exception is:
org.gradle.api.GradleScriptException: A problem occurred evaluating project ':sdks:java:io:file-based-io-tests'.
	at org.gradle.groovy.scripts.internal.DefaultScriptRunnerFactory$ScriptRunnerImpl.run(DefaultScriptRunnerFactory.java:92)
	at org.gradle.configuration.DefaultScriptPluginFactory$ScriptPluginImpl$2.run(DefaultScriptPluginFactory.java:206)
	at org.gradle.configuration.ProjectScriptTarget.addConfiguration(ProjectScriptTarget.java:77)
	at org.gradle.configuration.DefaultScriptPluginFactory$ScriptPluginImpl.apply(DefaultScriptPluginFactory.java:211)
	at org.gradle.configuration.BuildOperationScriptPlugin$1$1.run(BuildOperationScriptPlugin.java:69)
	at org.gradle.internal.operations.DefaultBuildOperationExecutor$RunnableBuildOperationWorker.execute(DefaultBuildOperationExecutor.java:402)
	at org.gradle.internal.operations.DefaultBuildOperationExecutor$RunnableBuildOperationWorker.execute(DefaultBuildOperationExecutor.java:394)
	at org.gradle.internal.operations.DefaultBuildOperationExecutor$1.execute(DefaultBuildOperationExecutor.java:165)
	at org.gradle.internal.operations.DefaultBuildOperationExecutor.execute(DefaultBuildOperationExecutor.java:250)
	at org.gradle.internal.operations.DefaultBuildOperationExecutor.execute(DefaultBuildOperationExecutor.java:158)
	at org.gradle.internal.operations.DefaultBuildOperationExecutor.run(DefaultBuildOperationExecutor.java:92)
	at org.gradle.internal.operations.DelegatingBuildOperationExecutor.run(DelegatingBuildOperationExecutor.java:31)
	at org.gradle.configuration.BuildOperationScriptPlugin$1.execute(BuildOperationScriptPlugin.java:66)
	at org.gradle.configuration.BuildOperationScriptPlugin$1.execute(BuildOperationScriptPlugin.java:63)
	at org.gradle.configuration.internal.DefaultUserCodeApplicationContext.apply(DefaultUserCodeApplicationContext.java:48)
	at org.gradle.configuration.BuildOperationScriptPlugin.apply(BuildOperationScriptPlugin.java:63)
	at org.gradle.configuration.project.BuildScriptProcessor$1.run(BuildScriptProcessor.java:44)
	at org.gradle.internal.Factories$1.create(Factories.java:25)
	at org.gradle.api.internal.project.DefaultProjectStateRegistry$ProjectStateImpl.withMutableState(DefaultProjectStateRegistry.java:192)
	at org.gradle.api.internal.project.DefaultProjectStateRegistry$ProjectStateImpl.withMutableState(DefaultProjectStateRegistry.java:186)
	at org.gradle.configuration.project.BuildScriptProcessor.execute(BuildScriptProcessor.java:41)
	at org.gradle.configuration.project.BuildScriptProcessor.execute(BuildScriptProcessor.java:26)
	at org.gradle.configuration.project.ConfigureActionsProjectEvaluator.evaluate(ConfigureActionsProjectEvaluator.java:34)
	at org.gradle.configuration.project.LifecycleProjectEvaluator$EvaluateProject$1.run(LifecycleProjectEvaluator.java:106)
	at org.gradle.internal.Factories$1.create(Factories.java:25)
	at org.gradle.api.internal.project.DefaultProjectStateRegistry$ProjectStateImpl.withMutableState(DefaultProjectStateRegistry.java:192)
	at org.gradle.api.internal.project.DefaultProjectStateRegistry$ProjectStateImpl.withMutableState(DefaultProjectStateRegistry.java:186)
	at org.gradle.configuration.project.LifecycleProjectEvaluator$EvaluateProject.run(LifecycleProjectEvaluator.java:95)
	at org.gradle.internal.operations.DefaultBuildOperationExecutor$RunnableBuildOperationWorker.execute(DefaultBuildOperationExecutor.java:402)
	at org.gradle.internal.operations.DefaultBuildOperationExecutor$RunnableBuildOperationWorker.execute(DefaultBuildOperationExecutor.java:394)
	at org.gradle.internal.operations.DefaultBuildOperationExecutor$1.execute(DefaultBuildOperationExecutor.java:165)
	at org.gradle.internal.operations.DefaultBuildOperationExecutor.execute(DefaultBuildOperationExecutor.java:250)
	at org.gradle.internal.operations.DefaultBuildOperationExecutor.execute(DefaultBuildOperationExecutor.java:158)
	at org.gradle.internal.operations.DefaultBuildOperationExecutor.run(DefaultBuildOperationExecutor.java:92)
	at org.gradle.internal.operations.DelegatingBuildOperationExecutor.run(DelegatingBuildOperationExecutor.java:31)
	at org.gradle.configuration.project.LifecycleProjectEvaluator.evaluate(LifecycleProjectEvaluator.java:67)
	at org.gradle.api.internal.project.DefaultProject.evaluate(DefaultProject.java:695)
	at org.gradle.api.internal.project.DefaultProject.evaluate(DefaultProject.java:143)
	at org.gradle.execution.TaskPathProjectEvaluator.configure(TaskPathProjectEvaluator.java:35)
	at org.gradle.execution.TaskPathProjectEvaluator.configureHierarchy(TaskPathProjectEvaluator.java:60)
	at org.gradle.execution.TaskSelector.getSelection(TaskSelector.java:100)
	at org.gradle.execution.TaskSelector.getSelection(TaskSelector.java:81)
	at org.gradle.execution.commandline.CommandLineTaskParser.parseTasks(CommandLineTaskParser.java:42)
	at org.gradle.execution.TaskNameResolvingBuildConfigurationAction.configure(TaskNameResolvingBuildConfigurationAction.java:45)
	at org.gradle.execution.DefaultBuildConfigurationActionExecuter.configure(DefaultBuildConfigurationActionExecuter.java:57)
	at org.gradle.execution.DefaultBuildConfigurationActionExecuter.access$200(DefaultBuildConfigurationActionExecuter.java:26)
	at org.gradle.execution.DefaultBuildConfigurationActionExecuter$2.proceed(DefaultBuildConfigurationActionExecuter.java:63)
	at org.gradle.execution.DefaultTasksBuildExecutionAction.configure(DefaultTasksBuildExecutionAction.java:44)
	at org.gradle.execution.DefaultBuildConfigurationActionExecuter.configure(DefaultBuildConfigurationActionExecuter.java:57)
	at org.gradle.execution.DefaultBuildConfigurationActionExecuter.access$200(DefaultBuildConfigurationActionExecuter.java:26)
	at org.gradle.execution.DefaultBuildConfigurationActionExecuter$2.proceed(DefaultBuildConfigurationActionExecuter.java:63)
	at org.gradle.execution.ExcludedTaskFilteringBuildConfigurationAction.configure(ExcludedTaskFilteringBuildConfigurationAction.java:47)
	at org.gradle.execution.DefaultBuildConfigurationActionExecuter.configure(DefaultBuildConfigurationActionExecuter.java:57)
	at org.gradle.execution.DefaultBuildConfigurationActionExecuter.access$200(DefaultBuildConfigurationActionExecuter.java:26)
	at org.gradle.execution.DefaultBuildConfigurationActionExecuter$1.run(DefaultBuildConfigurationActionExecuter.java:43)
	at org.gradle.internal.Factories$1.create(Factories.java:25)
	at org.gradle.api.internal.project.DefaultProjectStateRegistry.withLenientState(DefaultProjectStateRegistry.java:132)
	at org.gradle.api.internal.project.DefaultProjectStateRegistry.withLenientState(DefaultProjectStateRegistry.java:124)
	at org.gradle.execution.DefaultBuildConfigurationActionExecuter.select(DefaultBuildConfigurationActionExecuter.java:39)
	at org.gradle.initialization.DefaultGradleLauncher$CalculateTaskGraph.run(DefaultGradleLauncher.java:333)
	at org.gradle.internal.operations.DefaultBuildOperationExecutor$RunnableBuildOperationWorker.execute(DefaultBuildOperationExecutor.java:402)
	at org.gradle.internal.operations.DefaultBuildOperationExecutor$RunnableBuildOperationWorker.execute(DefaultBuildOperationExecutor.java:394)
	at org.gradle.internal.operations.DefaultBuildOperationExecutor$1.execute(DefaultBuildOperationExecutor.java:165)
	at org.gradle.internal.operations.DefaultBuildOperationExecutor.execute(DefaultBuildOperationExecutor.java:250)
	at org.gradle.internal.operations.DefaultBuildOperationExecutor.execute(DefaultBuildOperationExecutor.java:158)
	at org.gradle.internal.operations.DefaultBuildOperationExecutor.run(DefaultBuildOperationExecutor.java:92)
	at org.gradle.internal.operations.DelegatingBuildOperationExecutor.run(DelegatingBuildOperationExecutor.java:31)
	at org.gradle.initialization.DefaultGradleLauncher.constructTaskGraph(DefaultGradleLauncher.java:218)
	at org.gradle.initialization.DefaultGradleLauncher.doBuildStages(DefaultGradleLauncher.java:155)
	at org.gradle.initialization.DefaultGradleLauncher.executeTasks(DefaultGradleLauncher.java:134)
	at org.gradle.internal.invocation.GradleBuildController$1.execute(GradleBuildController.java:58)
	at org.gradle.internal.invocation.GradleBuildController$1.execute(GradleBuildController.java:55)
	at org.gradle.internal.invocation.GradleBuildController$3.create(GradleBuildController.java:82)
	at org.gradle.internal.invocation.GradleBuildController$3.create(GradleBuildController.java:75)
	at org.gradle.internal.work.DefaultWorkerLeaseService.withLocks(DefaultWorkerLeaseService.java:183)
	at org.gradle.internal.work.StopShieldingWorkerLeaseService.withLocks(StopShieldingWorkerLeaseService.java:40)
	at org.gradle.internal.invocation.GradleBuildController.doBuild(GradleBuildController.java:75)
	at org.gradle.internal.invocation.GradleBuildController.run(GradleBuildController.java:55)
	at org.gradle.tooling.internal.provider.ExecuteBuildActionRunner.run(ExecuteBuildActionRunner.java:31)
	at org.gradle.launcher.exec.ChainingBuildActionRunner.run(ChainingBuildActionRunner.java:35)
	at org.gradle.launcher.exec.BuildOutcomeReportingBuildActionRunner.run(BuildOutcomeReportingBuildActionRunner.java:58)
	at org.gradle.tooling.internal.provider.ValidatingBuildActionRunner.run(ValidatingBuildActionRunner.java:32)
	at org.gradle.launcher.exec.BuildCompletionNotifyingBuildActionRunner.run(BuildCompletionNotifyingBuildActionRunner.java:39)
	at org.gradle.launcher.exec.RunAsBuildOperationBuildActionRunner$3.call(RunAsBuildOperationBuildActionRunner.java:49)
	at org.gradle.launcher.exec.RunAsBuildOperationBuildActionRunner$3.call(RunAsBuildOperationBuildActionRunner.java:44)
	at org.gradle.internal.operations.DefaultBuildOperationExecutor$CallableBuildOperationWorker.execute(DefaultBuildOperationExecutor.java:416)
	at org.gradle.internal.operations.DefaultBuildOperationExecutor$CallableBuildOperationWorker.execute(DefaultBuildOperationExecutor.java:406)
	at org.gradle.internal.operations.DefaultBuildOperationExecutor$1.execute(DefaultBuildOperationExecutor.java:165)
	at org.gradle.internal.operations.DefaultBuildOperationExecutor.execute(DefaultBuildOperationExecutor.java:250)
	at org.gradle.internal.operations.DefaultBuildOperationExecutor.execute(DefaultBuildOperationExecutor.java:158)
	at org.gradle.internal.operations.DefaultBuildOperationExecutor.call(DefaultBuildOperationExecutor.java:102)
	at org.gradle.internal.operations.DelegatingBuildOperationExecutor.call(DelegatingBuildOperationExecutor.java:36)
	at org.gradle.launcher.exec.RunAsBuildOperationBuildActionRunner.run(RunAsBuildOperationBuildActionRunner.java:44)
	at org.gradle.launcher.exec.InProcessBuildActionExecuter$1.transform(InProcessBuildActionExecuter.java:49)
	at org.gradle.launcher.exec.InProcessBuildActionExecuter$1.transform(InProcessBuildActionExecuter.java:46)
	at org.gradle.composite.internal.DefaultRootBuildState.run(DefaultRootBuildState.java:78)
	at org.gradle.launcher.exec.InProcessBuildActionExecuter.execute(InProcessBuildActionExecuter.java:46)
	at org.gradle.launcher.exec.InProcessBuildActionExecuter.execute(InProcessBuildActionExecuter.java:31)
	at org.gradle.launcher.exec.BuildTreeScopeBuildActionExecuter.execute(BuildTreeScopeBuildActionExecuter.java:42)
	at org.gradle.launcher.exec.BuildTreeScopeBuildActionExecuter.execute(BuildTreeScopeBuildActionExecuter.java:28)
	at org.gradle.tooling.internal.provider.ContinuousBuildActionExecuter.execute(ContinuousBuildActionExecuter.java:78)
	at org.gradle.tooling.internal.provider.ContinuousBuildActionExecuter.execute(ContinuousBuildActionExecuter.java:52)
	at org.gradle.tooling.internal.provider.SubscribableBuildActionExecuter.execute(SubscribableBuildActionExecuter.java:59)
	at org.gradle.tooling.internal.provider.SubscribableBuildActionExecuter.execute(SubscribableBuildActionExecuter.java:36)
	at org.gradle.tooling.internal.provider.SessionScopeBuildActionExecuter.execute(SessionScopeBuildActionExecuter.java:68)
	at org.gradle.tooling.internal.provider.SessionScopeBuildActionExecuter.execute(SessionScopeBuildActionExecuter.java:38)
	at org.gradle.tooling.internal.provider.GradleThreadBuildActionExecuter.execute(GradleThreadBuildActionExecuter.java:37)
	at org.gradle.tooling.internal.provider.GradleThreadBuildActionExecuter.execute(GradleThreadBuildActionExecuter.java:26)
	at org.gradle.tooling.internal.provider.ParallelismConfigurationBuildActionExecuter.execute(ParallelismConfigurationBuildActionExecuter.java:43)
	at org.gradle.tooling.internal.provider.ParallelismConfigurationBuildActionExecuter.execute(ParallelismConfigurationBuildActionExecuter.java:29)
	at org.gradle.tooling.internal.provider.StartParamsValidatingActionExecuter.execute(StartParamsValidatingActionExecuter.java:60)
	at org.gradle.tooling.internal.provider.StartParamsValidatingActionExecuter.execute(StartParamsValidatingActionExecuter.java:32)
	at org.gradle.tooling.internal.provider.SessionFailureReportingActionExecuter.execute(SessionFailureReportingActionExecuter.java:55)
	at org.gradle.tooling.internal.provider.SessionFailureReportingActionExecuter.execute(SessionFailureReportingActionExecuter.java:41)
	at org.gradle.tooling.internal.provider.SetupLoggingActionExecuter.execute(SetupLoggingActionExecuter.java:48)
	at org.gradle.tooling.internal.provider.SetupLoggingActionExecuter.execute(SetupLoggingActionExecuter.java:32)
	at org.gradle.launcher.daemon.server.exec.ExecuteBuild.doBuild(ExecuteBuild.java:67)
	at org.gradle.launcher.daemon.server.exec.BuildCommandOnly.execute(BuildCommandOnly.java:36)
	at org.gradle.launcher.daemon.server.api.DaemonCommandExecution.proceed(DaemonCommandExecution.java:104)
	at org.gradle.launcher.daemon.server.exec.WatchForDisconnection.execute(WatchForDisconnection.java:37)
	at org.gradle.launcher.daemon.server.api.DaemonCommandExecution.proceed(DaemonCommandExecution.java:104)
	at org.gradle.launcher.daemon.server.exec.ResetDeprecationLogger.execute(ResetDeprecationLogger.java:26)
	at org.gradle.launcher.daemon.server.api.DaemonCommandExecution.proceed(DaemonCommandExecution.java:104)
	at org.gradle.launcher.daemon.server.exec.RequestStopIfSingleUsedDaemon.execute(RequestStopIfSingleUsedDaemon.java:34)
	at org.gradle.launcher.daemon.server.api.DaemonCommandExecution.proceed(DaemonCommandExecution.java:104)
	at org.gradle.launcher.daemon.server.exec.ForwardClientInput$2.call(ForwardClientInput.java:74)
	at org.gradle.launcher.daemon.server.exec.ForwardClientInput$2.call(ForwardClientInput.java:72)
	at org.gradle.util.Swapper.swap(Swapper.java:38)
	at org.gradle.launcher.daemon.server.exec.ForwardClientInput.execute(ForwardClientInput.java:72)
	at org.gradle.launcher.daemon.server.api.DaemonCommandExecution.proceed(DaemonCommandExecution.java:104)
	at org.gradle.launcher.daemon.server.exec.LogAndCheckHealth.execute(LogAndCheckHealth.java:55)
	at org.gradle.launcher.daemon.server.api.DaemonCommandExecution.proceed(DaemonCommandExecution.java:104)
	at org.gradle.launcher.daemon.server.exec.LogToClient.doBuild(LogToClient.java:62)
	at org.gradle.launcher.daemon.server.exec.BuildCommandOnly.execute(BuildCommandOnly.java:36)
	at org.gradle.launcher.daemon.server.api.DaemonCommandExecution.proceed(DaemonCommandExecution.java:104)
	at org.gradle.launcher.daemon.server.exec.EstablishBuildEnvironment.doBuild(EstablishBuildEnvironment.java:81)
	at org.gradle.launcher.daemon.server.exec.BuildCommandOnly.execute(BuildCommandOnly.java:36)
	at org.gradle.launcher.daemon.server.api.DaemonCommandExecution.proceed(DaemonCommandExecution.java:104)
	at org.gradle.launcher.daemon.server.exec.StartBuildOrRespondWithBusy$1.run(StartBuildOrRespondWithBusy.java:50)
	at org.gradle.launcher.daemon.server.DaemonStateCoordinator$1.run(DaemonStateCoordinator.java:295)
	at org.gradle.internal.concurrent.ExecutorPolicy$CatchAndRecordFailures.onExecute(ExecutorPolicy.java:63)
	at org.gradle.internal.concurrent.ManagedExecutorImpl$1.run(ManagedExecutorImpl.java:46)
	at org.gradle.internal.concurrent.ThreadFactoryImpl$ManagedThreadRunnable.run(ThreadFactoryImpl.java:55)
Caused by: org.gradle.internal.metaobject.AbstractDynamicObject$CustomMessageMissingMethodException:
Could not find method shadow() for arguments [DefaultProjectDependency{dependencyProject='project
':runners:google-cloud-dataflow-java:worker:legacy-worker'', configuration='shadow'}] on object
of type org.gradle.api.internal.artifacts.dsl.dependencies.DefaultDependencyHandler.
	at org.gradle.internal.metaobject.AbstractDynamicObject.methodMissingException(AbstractDynamicObject.java:179)
	at org.gradle.internal.metaobject.ConfigureDelegate.invokeMethod(ConfigureDelegate.java:86)
	at org.apache.beam.gradle.BeamModulePlugin$_apply_closure8$_closure98.doCall(BeamModulePlugin.groovy:1302)
	at org.gradle.util.ClosureBackedAction.execute(ClosureBackedAction.java:70)
	at org.gradle.util.ConfigureUtil.configureTarget(ConfigureUtil.java:154)
	at org.gradle.util.ConfigureUtil.configure(ConfigureUtil.java:105)
	at org.gradle.api.internal.project.DefaultProject.dependencies(DefaultProject.java:1190)
	at org.gradle.api.Project$dependencies$7.call(Unknown Source)
	at org.apache.beam.gradle.BeamModulePlugin$_apply_closure8.doCall(BeamModulePlugin.groovy:1294)
	at org.apache.beam.gradle.BeamModulePlugin$_apply_closure8.doCall(BeamModulePlugin.groovy)
	at org.gradle.internal.metaobject.BeanDynamicObject$MetaClassAdapter.invokeMethod(BeanDynamicObject.java:479)
	at org.gradle.internal.metaobject.BeanDynamicObject.tryInvokeMethod(BeanDynamicObject.java:191)
	at org.gradle.internal.extensibility.MixInClosurePropertiesAsMethodsDynamicObject.tryInvokeMethod(MixInClosurePropertiesAsMethodsDynamicObject.java:45)
	at org.gradle.groovy.scripts.BasicScript$ScriptDynamicObject.tryInvokeMethod(BasicScript.java:133)
	at org.gradle.internal.metaobject.AbstractDynamicObject.invokeMethod(AbstractDynamicObject.java:160)
	at org.gradle.groovy.scripts.BasicScript.invokeMethod(BasicScript.java:82)
	at build_3tgvwy00nzsareujcrk14x24b.run(<https://builds.apache.org/job/beam_PerformanceTests_ManyFiles_TextIOIT_HDFS/ws/src/sdks/java/io/file-based-io-tests/build.gradle>:21)
	at org.gradle.groovy.scripts.internal.DefaultScriptRunnerFactory$ScriptRunnerImpl.run(DefaultScriptRunnerFactory.java:90)
	... 142 more


* Get more help at https://help.gradle.org

BUILD FAILED in 1s

2019-06-09 00:57:26,892 e9c12c58 MainThread beam_integration_benchmark(1/1) ERROR    Error
during benchmark beam_integration_benchmark
Traceback (most recent call last):
  File "<https://builds.apache.org/job/beam_PerformanceTests_ManyFiles_TextIOIT_HDFS/ws/PerfKitBenchmarker/perfkitbenchmarker/pkb.py",>
line 760, in RunBenchmark
    DoRunPhase(spec, collector, detailed_timer)
  File "<https://builds.apache.org/job/beam_PerformanceTests_ManyFiles_TextIOIT_HDFS/ws/PerfKitBenchmarker/perfkitbenchmarker/pkb.py",>
line 609, in DoRunPhase
    samples = spec.BenchmarkRun(spec)
  File "<https://builds.apache.org/job/beam_PerformanceTests_ManyFiles_TextIOIT_HDFS/ws/PerfKitBenchmarker/perfkitbenchmarker/linux_benchmarks/beam_integration_benchmark.py",>
line 160, in Run
    job_type=job_type)
  File "<https://builds.apache.org/job/beam_PerformanceTests_ManyFiles_TextIOIT_HDFS/ws/PerfKitBenchmarker/perfkitbenchmarker/providers/gcp/gcp_dpb_dataflow.py",>
line 90, in SubmitJob
    assert retcode == 0, "Integration Test Failed."
AssertionError: Integration Test Failed.
2019-06-09 00:57:26,893 e9c12c58 MainThread beam_integration_benchmark(1/1) INFO     Cleaning
up benchmark beam_integration_benchmark
2019-06-09 00:57:26,894 e9c12c58 MainThread beam_integration_benchmark(1/1) INFO     Running:
kubectl --kubeconfig=<https://builds.apache.org/job/beam_PerformanceTests_ManyFiles_TextIOIT_HDFS/ws/config-beam-performancetests-manyfiles-textioit-hdfs-639>
delete -f <https://builds.apache.org/job/beam_PerformanceTests_ManyFiles_TextIOIT_HDFS/ws/src/.test-infra/kubernetes/hadoop/LargeITCluster/hdfs-multi-datanode-cluster.yml>
--ignore-not-found
2019-06-09 00:57:58,673 e9c12c58 MainThread beam_integration_benchmark(1/1) ERROR    Exception
running benchmark
Traceback (most recent call last):
  File "<https://builds.apache.org/job/beam_PerformanceTests_ManyFiles_TextIOIT_HDFS/ws/PerfKitBenchmarker/perfkitbenchmarker/pkb.py",>
line 903, in RunBenchmarkTask
    RunBenchmark(spec, collector)
  File "<https://builds.apache.org/job/beam_PerformanceTests_ManyFiles_TextIOIT_HDFS/ws/PerfKitBenchmarker/perfkitbenchmarker/pkb.py",>
line 760, in RunBenchmark
    DoRunPhase(spec, collector, detailed_timer)
  File "<https://builds.apache.org/job/beam_PerformanceTests_ManyFiles_TextIOIT_HDFS/ws/PerfKitBenchmarker/perfkitbenchmarker/pkb.py",>
line 609, in DoRunPhase
    samples = spec.BenchmarkRun(spec)
  File "<https://builds.apache.org/job/beam_PerformanceTests_ManyFiles_TextIOIT_HDFS/ws/PerfKitBenchmarker/perfkitbenchmarker/linux_benchmarks/beam_integration_benchmark.py",>
line 160, in Run
    job_type=job_type)
  File "<https://builds.apache.org/job/beam_PerformanceTests_ManyFiles_TextIOIT_HDFS/ws/PerfKitBenchmarker/perfkitbenchmarker/providers/gcp/gcp_dpb_dataflow.py",>
line 90, in SubmitJob
    assert retcode == 0, "Integration Test Failed."
AssertionError: Integration Test Failed.
2019-06-09 00:57:58,674 e9c12c58 MainThread beam_integration_benchmark(1/1) ERROR    Benchmark
1/1 beam_integration_benchmark (UID: beam_integration_benchmark0) failed. Execution will continue.
2019-06-09 00:57:58,674 e9c12c58 MainThread beam_integration_benchmark(1/1) INFO     Benchmark
run statuses:
---------------------------------------------------------------------------------
Name                        UID                          Status  Failed Substatus
---------------------------------------------------------------------------------
beam_integration_benchmark  beam_integration_benchmark0  FAILED                  
---------------------------------------------------------------------------------
Success rate: 0.00% (0/1)
2019-06-09 00:57:58,674 e9c12c58 MainThread beam_integration_benchmark(1/1) INFO     Complete
logs can be found at: <https://builds.apache.org/job/beam_PerformanceTests_ManyFiles_TextIOIT_HDFS/ws/runs/e9c12c58/pkb.log>
2019-06-09 00:57:58,675 e9c12c58 MainThread beam_integration_benchmark(1/1) INFO     Completion
statuses can be found at: <https://builds.apache.org/job/beam_PerformanceTests_ManyFiles_TextIOIT_HDFS/ws/runs/e9c12c58/completion_statuses.json>
Build step 'Execute shell' marked build as failure

---------------------------------------------------------------------
To unsubscribe, e-mail: builds-unsubscribe@beam.apache.org
For additional commands, e-mail: builds-help@beam.apache.org


Mime
View raw message