beam-builds mailing list archives

Site index · List index
Message view « Date » · « Thread »
Top « Date » · « Thread »
From Apache Jenkins Server <jenk...@builds.apache.org>
Subject Build failed in Jenkins: beam_PostCommit_Java_ValidatesRunner_Spark #4268
Date Wed, 05 Jun 2019 00:16:08 GMT
See <https://builds.apache.org/job/beam_PostCommit_Java_ValidatesRunner_Spark/4268/display/redirect>

------------------------------------------
[...truncated 5.96 KB...]
> Task :buildSrc:pluginUnderTestMetadata
> Task :buildSrc:compileTestJava NO-SOURCE
> Task :buildSrc:compileTestGroovy NO-SOURCE
> Task :buildSrc:processTestResources NO-SOURCE
> Task :buildSrc:testClasses UP-TO-DATE
> Task :buildSrc:test NO-SOURCE
> Task :buildSrc:validateTaskProperties FROM-CACHE
> Task :buildSrc:check
> Task :buildSrc:build
Configuration on demand is an incubating feature.
> Task :sdks:java:core:generateAvroProtocol NO-SOURCE
> Task :vendor:sdks-java-extensions-protobuf:processResources NO-SOURCE
> Task :runners:core-java:processResources NO-SOURCE
> Task :sdks:java:extensions:google-cloud-platform-core:processResources NO-SOURCE
> Task :sdks:java:fn-execution:processResources NO-SOURCE
> Task :sdks:java:io:google-cloud-platform:processResources NO-SOURCE
> Task :examples:java:processResources NO-SOURCE
> Task :runners:core-construction-java:processResources NO-SOURCE
> Task :sdks:java:core:generateAvroJava NO-SOURCE
> Task :sdks:java:harness:processResources NO-SOURCE
> Task :runners:java-fn-execution:processResources NO-SOURCE
> Task :runners:core-java:processTestResources NO-SOURCE
> Task :sdks:java:extensions:protobuf:extractProto
> Task :model:fn-execution:extractProto
> Task :model:job-management:extractProto
> Task :runners:spark:processResources NO-SOURCE
> Task :runners:direct-java:processResources NO-SOURCE
> Task :examples:java:processTestResources
> Task :sdks:java:extensions:protobuf:processResources NO-SOURCE
> Task :sdks:java:io:hadoop-format:processResources NO-SOURCE
> Task :sdks:java:io:hadoop-common:processResources NO-SOURCE
> Task :sdks:java:io:kafka:processResources NO-SOURCE
> Task :runners:local-java:processResources NO-SOURCE
> Task :sdks:java:io:jdbc:processResources NO-SOURCE
> Task :sdks:java:testing:test-utils:processResources NO-SOURCE
> Task :sdks:java:core:generateGrammarSource FROM-CACHE
> Task :sdks:java:io:common:compileJava NO-SOURCE
> Task :runners:spark:processTestResources
> Task :model:job-management:processResources
> Task :sdks:java:testing:test-utils:processTestResources NO-SOURCE
> Task :sdks:java:io:common:processResources NO-SOURCE
> Task :sdks:java:io:common:classes UP-TO-DATE
> Task :sdks:java:io:hadoop-format:processTestResources
> Task :model:fn-execution:processResources
> Task :sdks:java:core:processResources
> Task :sdks:java:core:generateTestAvroProtocol NO-SOURCE
> Task :sdks:java:io:common:shadowJar
> Task :sdks:java:io:common:processTestResources NO-SOURCE
> Task :model:pipeline:extractIncludeProto
> Task :model:pipeline:extractProto
> Task :sdks:java:core:generateTestAvroJava
> Task :sdks:java:core:generateTestGrammarSource NO-SOURCE
> Task :sdks:java:core:processTestResources
> Task :model:pipeline:generateProto
> Task :model:pipeline:compileJava FROM-CACHE
> Task :model:pipeline:processResources
> Task :model:pipeline:classes
> Task :model:pipeline:jar
> Task :model:job-management:extractIncludeProto
> Task :model:fn-execution:extractIncludeProto
> Task :model:job-management:generateProto
> Task :model:fn-execution:generateProto
> Task :model:job-management:compileJava FROM-CACHE
> Task :model:job-management:classes
> Task :model:fn-execution:compileJava FROM-CACHE
> Task :model:fn-execution:classes
> Task :model:pipeline:shadowJar
> Task :model:job-management:shadowJar
> Task :model:fn-execution:shadowJar
> Task :sdks:java:core:compileJava FROM-CACHE
> Task :sdks:java:core:classes
> Task :sdks:java:core:shadowJar
> Task :sdks:java:extensions:protobuf:extractIncludeProto
> Task :sdks:java:extensions:protobuf:generateProto NO-SOURCE
> Task :sdks:java:io:jdbc:compileJava FROM-CACHE
> Task :sdks:java:io:jdbc:classes UP-TO-DATE
> Task :sdks:java:extensions:google-cloud-platform-core:compileJava FROM-CACHE
> Task :sdks:java:extensions:google-cloud-platform-core:classes UP-TO-DATE
> Task :runners:core-construction-java:compileJava FROM-CACHE
> Task :runners:core-construction-java:classes UP-TO-DATE
> Task :sdks:java:io:common:compileTestJava FROM-CACHE
> Task :sdks:java:io:jdbc:shadowJar
> Task :sdks:java:io:common:testClasses UP-TO-DATE
> Task :sdks:java:fn-execution:compileJava FROM-CACHE
> Task :sdks:java:fn-execution:classes UP-TO-DATE
> Task :vendor:sdks-java-extensions-protobuf:compileJava FROM-CACHE
> Task :vendor:sdks-java-extensions-protobuf:classes UP-TO-DATE
> Task :sdks:java:io:kafka:compileJava FROM-CACHE
> Task :sdks:java:io:kafka:classes UP-TO-DATE
> Task :sdks:java:io:common:shadowTestJar
> Task :sdks:java:core:compileTestJava FROM-CACHE
> Task :sdks:java:core:testClasses
> Task :runners:local-java:compileJava FROM-CACHE
> Task :runners:local-java:classes UP-TO-DATE
> Task :runners:local-java:shadowJar
> Task :sdks:java:io:hadoop-common:compileJava FROM-CACHE
> Task :sdks:java:io:hadoop-common:classes UP-TO-DATE
> Task :sdks:java:fn-execution:shadowJar
> Task :sdks:java:extensions:protobuf:compileJava FROM-CACHE
> Task :sdks:java:extensions:protobuf:classes UP-TO-DATE
> Task :sdks:java:io:hadoop-common:shadowJar
> Task :sdks:java:extensions:protobuf:shadowJar
> Task :sdks:java:io:kafka:shadowJar
> Task :sdks:java:io:hadoop-format:compileJava FROM-CACHE
> Task :sdks:java:io:hadoop-format:classes UP-TO-DATE
> Task :sdks:java:io:hadoop-format:shadowJar
> Task :runners:core-construction-java:shadowJar
> Task :runners:core-java:compileJava FROM-CACHE
> Task :runners:core-java:classes UP-TO-DATE
> Task :runners:core-java:shadowJar
> Task :vendor:sdks-java-extensions-protobuf:shadowJar
> Task :sdks:java:extensions:google-cloud-platform-core:shadowJar
> Task :sdks:java:testing:test-utils:compileJava FROM-CACHE
> Task :sdks:java:testing:test-utils:classes UP-TO-DATE
> Task :sdks:java:harness:compileJava FROM-CACHE
> Task :sdks:java:harness:classes UP-TO-DATE
> Task :sdks:java:harness:jar
> Task :sdks:java:io:google-cloud-platform:compileJava FROM-CACHE
> Task :sdks:java:io:google-cloud-platform:classes UP-TO-DATE
> Task :sdks:java:io:google-cloud-platform:shadowJar
> Task :examples:java:compileJava FROM-CACHE
> Task :examples:java:classes UP-TO-DATE
> Task :examples:java:compileTestJava FROM-CACHE
> Task :examples:java:testClasses
> Task :sdks:java:testing:test-utils:shadowJar
> Task :sdks:java:testing:test-utils:compileTestJava FROM-CACHE
> Task :sdks:java:testing:test-utils:testClasses UP-TO-DATE
> Task :sdks:java:testing:test-utils:shadowTestJar
> Task :sdks:java:core:shadowTestJar
> Task :runners:core-java:compileTestJava FROM-CACHE
> Task :runners:core-java:testClasses UP-TO-DATE
> Task :runners:core-java:shadowTestJar
> Task :sdks:java:harness:shadowJar
> Task :runners:java-fn-execution:compileJava FROM-CACHE
> Task :runners:java-fn-execution:classes UP-TO-DATE
> Task :runners:java-fn-execution:shadowJar
> Task :runners:direct-java:compileJava FROM-CACHE
> Task :runners:direct-java:classes UP-TO-DATE
> Task :runners:spark:compileJava FROM-CACHE
> Task :runners:spark:classes UP-TO-DATE
> Task :runners:direct-java:shadowJar
> Task :runners:spark:shadowJar
> Task :runners:spark:compileTestJava FROM-CACHE
> Task :runners:spark:testClasses
> Task :examples:java:shadowJar
> Task :runners:spark:shadowTestJar
> Task :examples:java:shadowTestJar
> Task :sdks:java:io:hadoop-format:compileTestJava FROM-CACHE
> Task :sdks:java:io:hadoop-format:testClasses
> Task :sdks:java:io:hadoop-format:shadowTestJar
> Task :runners:spark:validatesRunnerBatch

org.apache.beam.sdk.transforms.ParDoTest$TimerTests > testEventTimeTimerMultipleKeys FAILED
    org.apache.beam.sdk.Pipeline$PipelineExecutionException at ParDoTest.java:2825
        Caused by: java.io.FileNotFoundException

org.apache.beam.sdk.transforms.ParDoTest$TimerTests > testPipelineOptionsParameterOnTimer
FAILED
    org.apache.beam.sdk.Pipeline$PipelineExecutionException at ParDoTest.java:3184
        Caused by: java.io.FileNotFoundException

org.apache.beam.sdk.transforms.ParDoLifecycleTest > testFnCallSequence FAILED
    org.apache.beam.sdk.Pipeline$PipelineExecutionException at ParDoLifecycleTest.java:71
        Caused by: java.io.IOException

org.apache.beam.sdk.transforms.ParDoLifecycleTest > testTeardownCalledAfterExceptionInFinishBundle
FAILED
    java.lang.AssertionError at ParDoLifecycleTest.java:258

org.apache.beam.sdk.transforms.ParDoLifecycleTest > testTeardownCalledAfterExceptionInFinishBundleStateful
FAILED
    java.lang.AssertionError at ParDoLifecycleTest.java:258

org.apache.beam.sdk.transforms.ReshuffleTest > testReshuffleAfterSessionsAndGroupByKey
FAILED
    org.apache.beam.sdk.Pipeline$PipelineExecutionException at ReshuffleTest.java:169
        Caused by: java.io.IOException

org.apache.beam.sdk.transforms.ParDoLifecycleTest > testFnCallSequenceMulti FAILED
    org.apache.beam.sdk.Pipeline$PipelineExecutionException at ParDoLifecycleTest.java:84
        Caused by: java.io.IOException

org.apache.beam.sdk.transforms.ParDoLifecycleTest > testTeardownCalledAfterExceptionInProcessElementStateful
FAILED
    java.lang.AssertionError at ParDoLifecycleTest.java:258

org.apache.beam.sdk.transforms.ParDoLifecycleTest > testFnCallSequenceStateful FAILED
    org.apache.beam.sdk.Pipeline$PipelineExecutionException at ParDoLifecycleTest.java:99
        Caused by: java.io.IOException

org.apache.beam.sdk.transforms.ReshuffleTest > testReshuffleAfterFixedWindows FAILED
    org.apache.beam.sdk.Pipeline$PipelineExecutionException at ReshuffleTest.java:231
        Caused by: java.io.IOException

org.apache.beam.sdk.transforms.ParDoLifecycleTest > testTeardownCalledAfterExceptionInSetup
FAILED
    java.lang.AssertionError at ParDoLifecycleTest.java:258

org.apache.beam.sdk.transforms.ParDoLifecycleTest > testTeardownCalledAfterExceptionInStartBundleStateful
FAILED
    java.lang.AssertionError at ParDoLifecycleTest.java:258

org.apache.beam.sdk.transforms.ParDoLifecycleTest > testTeardownCalledAfterExceptionInStartBundle
FAILED
    java.lang.AssertionError at ParDoLifecycleTest.java:258

org.apache.beam.sdk.transforms.ParDoLifecycleTest > testTeardownCalledAfterExceptionInSetupStateful
FAILED
    java.lang.AssertionError at ParDoLifecycleTest.java:258

org.apache.beam.sdk.transforms.ReshuffleTest > testReshuffleAfterFixedWindowsAndGroupByKey
FAILED
    org.apache.beam.sdk.Pipeline$PipelineExecutionException at ReshuffleTest.java:190
        Caused by: java.io.IOException

org.apache.beam.sdk.transforms.ReshuffleTest > testReshuffleAfterSlidingWindows FAILED
    org.apache.beam.sdk.Pipeline$PipelineExecutionException at ReshuffleTest.java:251
        Caused by: java.io.IOException

org.apache.beam.sdk.transforms.ReshuffleTest > testReshufflePreservesTimestamps FAILED
    org.apache.beam.sdk.Pipeline$PipelineExecutionException at ReshuffleTest.java:148
        Caused by: java.io.IOException

org.apache.beam.sdk.transforms.ReshuffleTest > testReshuffleAfterSlidingWindowsAndGroupByKey
FAILED
    org.apache.beam.sdk.Pipeline$PipelineExecutionException at ReshuffleTest.java:211
        Caused by: java.io.IOException

org.apache.beam.sdk.transforms.ReshuffleTest > testJustReshuffle FAILED
    org.apache.beam.sdk.Pipeline$PipelineExecutionException at ReshuffleTest.java:102
        Caused by: java.io.IOException

239 tests completed, 19 failed, 2 skipped

> Task :runners:spark:validatesRunnerBatch FAILED
> Task :runners:spark:validatesRunnerStreaming

FAILURE: Build failed with an exception.

* What went wrong:
Execution failed for task ':runners:spark:validatesRunnerBatch'.
> There were failing tests. See the report at: file://<https://builds.apache.org/job/beam_PostCommit_Java_ValidatesRunner_Spark/ws/src/runners/spark/build/reports/tests/validatesRunnerBatch/index.html>

* Try:
Run with --stacktrace option to get the stack trace. Run with --info or --debug option to
get more log output. Run with --scan to get full insights.

* Get more help at https://help.gradle.org

Deprecated Gradle features were used in this build, making it incompatible with Gradle 6.0.
Use '--warning-mode all' to show the individual deprecation warnings.
See https://docs.gradle.org/5.2.1/userguide/command_line_interface.html#sec:command_line_warnings

BUILD FAILED in 15m 54s
84 actionable tasks: 54 executed, 30 from cache

Publishing build scan...
https://gradle.com/s/lszgn3vuljsge

Build step 'Invoke Gradle script' changed build result to FAILURE
Build step 'Invoke Gradle script' marked build as failure

---------------------------------------------------------------------
To unsubscribe, e-mail: builds-unsubscribe@beam.apache.org
For additional commands, e-mail: builds-help@beam.apache.org


Mime
View raw message