beam-builds mailing list archives

Site index · List index
Message view « Date » · « Thread »
Top « Date » · « Thread »
From Apache Jenkins Server <jenk...@builds.apache.org>
Subject Build failed in Jenkins: beam_PostCommit_Py_ValCont #3554
Date Fri, 14 Jun 2019 09:43:06 GMT
See <https://builds.apache.org/job/beam_PostCommit_Py_ValCont/3554/display/redirect?page=changes>

Changes:

[thw] [BEAM-7126] Fix StateRequestHandler type variables to allow for proper

------------------------------------------
[...truncated 204.06 KB...]
copying apache_beam/utils/windowed_value_test.py -> apache-beam-2.14.0.dev0/apache_beam/utils
Writing apache-beam-2.14.0.dev0/setup.cfg
creating dist
Creating tar archive
removing 'apache-beam-2.14.0.dev0' (and everything under it)
SDK_LOCATION=$(find dist/apache-beam-*.tar.gz)
find dist/apache-beam-*.tar.gz

# Run ValidatesRunner tests on Google Cloud Dataflow service
echo ">>> RUNNING DATAFLOW RUNNER VALIDATESCONTAINER TEST"
>>> RUNNING DATAFLOW RUNNER VALIDATESCONTAINER TEST
python setup.py nosetests \
  --attr ValidatesContainer \
  --nologcapture \
  --processes=1 \
  --process-timeout=900 \
  --test-pipeline-options=" \
    --runner=TestDataflowRunner \
    --project=$PROJECT \
    --worker_harness_container_image=$CONTAINER:$TAG \
    --staging_location=$GCS_LOCATION/staging-validatesrunner-test \
    --temp_location=$GCS_LOCATION/temp-validatesrunner-test \
    --output=$GCS_LOCATION/output \
    --sdk_location=$SDK_LOCATION \
    --num_workers=1"
<https://builds.apache.org/job/beam_PostCommit_Py_ValCont/ws/src/sdks/python/container/venv/python/local/lib/python2.7/site-packages/setuptools/dist.py>:472:
UserWarning: Normalizing '2.14.0.dev' to '2.14.0.dev0'
  normalized_version,
running nosetests
running egg_info
<https://builds.apache.org/job/beam_PostCommit_Py_ValCont/ws/src/sdks/python/gen_protos.py>:57:
UserWarning: Installing grpcio-tools is recommended for development.
  warnings.warn('Installing grpcio-tools is recommended for development.')
writing requirements to apache_beam.egg-info/requires.txt
writing apache_beam.egg-info/PKG-INFO
writing top-level names to apache_beam.egg-info/top_level.txt
writing dependency_links to apache_beam.egg-info/dependency_links.txt
writing entry points to apache_beam.egg-info/entry_points.txt
reading manifest file 'apache_beam.egg-info/SOURCES.txt'
reading manifest template 'MANIFEST.in'
warning: no files found matching 'README.md'
warning: no files found matching 'NOTICE'
warning: no files found matching 'LICENSE'
writing manifest file 'apache_beam.egg-info/SOURCES.txt'
WARNING:root:Using deprecated Datastore client.
This client will be removed in Beam 3.0 (next Beam major release).
Please migrate to apache_beam.io.gcp.datastore.v1new.datastoreio.
WARNING:root:python-snappy is not installed; some tests will be skipped.
WARNING:root:Tensorflow is not installed, so skipping some tests.
test_wordcount_fnapi_it (apache_beam.examples.wordcount_it_test.WordCountIT) ... ERROR
test_metrics_fnapi_it (apache_beam.runners.dataflow.dataflow_exercise_metrics_pipeline_test.ExerciseMetricsPipelineTest)
... ERROR

======================================================================
ERROR: test_wordcount_fnapi_it (apache_beam.examples.wordcount_it_test.WordCountIT)
----------------------------------------------------------------------
Traceback (most recent call last):
  File "<https://builds.apache.org/job/beam_PostCommit_Py_ValCont/ws/src/sdks/python/container/venv/python/local/lib/python2.7/site-packages/nose/plugins/multiprocess.py",>
line 812, in run
    test(orig)
  File "<https://builds.apache.org/job/beam_PostCommit_Py_ValCont/ws/src/sdks/python/container/venv/python/local/lib/python2.7/site-packages/nose/case.py",>
line 45, in __call__
    return self.run(*arg, **kwarg)
  File "<https://builds.apache.org/job/beam_PostCommit_Py_ValCont/ws/src/sdks/python/container/venv/python/local/lib/python2.7/site-packages/nose/case.py",>
line 133, in run
    self.runTest(result)
  File "<https://builds.apache.org/job/beam_PostCommit_Py_ValCont/ws/src/sdks/python/container/venv/python/local/lib/python2.7/site-packages/nose/case.py",>
line 151, in runTest
    test(result)
  File "/usr/lib/python2.7/unittest/case.py", line 393, in __call__
    return self.run(*args, **kwds)
  File "/usr/lib/python2.7/unittest/case.py", line 329, in run
    testMethod()
  File "<https://builds.apache.org/job/beam_PostCommit_Py_ValCont/ws/src/sdks/python/apache_beam/examples/wordcount_it_test.py",>
line 52, in test_wordcount_fnapi_it
    self._run_wordcount_it(wordcount.run, experiment='beam_fn_api')
  File "<https://builds.apache.org/job/beam_PostCommit_Py_ValCont/ws/src/sdks/python/apache_beam/examples/wordcount_it_test.py",>
line 84, in _run_wordcount_it
    run_wordcount(test_pipeline.get_full_options_as_args(**extra_opts))
  File "<https://builds.apache.org/job/beam_PostCommit_Py_ValCont/ws/src/sdks/python/apache_beam/examples/wordcount.py",>
line 114, in run
    result = p.run()
  File "<https://builds.apache.org/job/beam_PostCommit_Py_ValCont/ws/src/sdks/python/apache_beam/pipeline.py",>
line 406, in run
    self._options).run(False)
  File "<https://builds.apache.org/job/beam_PostCommit_Py_ValCont/ws/src/sdks/python/apache_beam/pipeline.py",>
line 419, in run
    return self.runner.run_pipeline(self, self._options)
  File "<https://builds.apache.org/job/beam_PostCommit_Py_ValCont/ws/src/sdks/python/apache_beam/runners/dataflow/test_dataflow_runner.py",>
line 71, in run_pipeline
    self.result.cancel()
  File "<https://builds.apache.org/job/beam_PostCommit_Py_ValCont/ws/src/sdks/python/apache_beam/runners/dataflow/dataflow_runner.py",>
line 1360, in cancel
    return self.state
  File "<https://builds.apache.org/job/beam_PostCommit_Py_ValCont/ws/src/sdks/python/apache_beam/runners/dataflow/dataflow_runner.py",>
line 1300, in state
    self._update_job()
  File "<https://builds.apache.org/job/beam_PostCommit_Py_ValCont/ws/src/sdks/python/apache_beam/runners/dataflow/dataflow_runner.py",>
line 1256, in _update_job
    self._job = self._runner.dataflow_client.get_job(self.job_id())
  File "<https://builds.apache.org/job/beam_PostCommit_Py_ValCont/ws/src/sdks/python/apache_beam/utils/retry.py",>
line 197, in wrapper
    return fun(*args, **kwargs)
  File "<https://builds.apache.org/job/beam_PostCommit_Py_ValCont/ws/src/sdks/python/apache_beam/runners/dataflow/internal/apiclient.py",>
line 661, in get_job
    response = self._client.projects_locations_jobs.Get(request)
  File "<https://builds.apache.org/job/beam_PostCommit_Py_ValCont/ws/src/sdks/python/apache_beam/runners/dataflow/internal/clients/dataflow/dataflow_v1b3_client.py",>
line 689, in Get
    config, request, global_params=global_params)
  File "<https://builds.apache.org/job/beam_PostCommit_Py_ValCont/ws/src/sdks/python/container/venv/python/local/lib/python2.7/site-packages/apitools/base/py/base_api.py",>
line 729, in _RunMethod
    http, http_request, **opts)
  File "<https://builds.apache.org/job/beam_PostCommit_Py_ValCont/ws/src/sdks/python/container/venv/python/local/lib/python2.7/site-packages/apitools/base/py/http_wrapper.py",>
line 346, in MakeRequest
    check_response_func=check_response_func)
  File "<https://builds.apache.org/job/beam_PostCommit_Py_ValCont/ws/src/sdks/python/container/venv/python/local/lib/python2.7/site-packages/apitools/base/py/http_wrapper.py",>
line 396, in _MakeRequestNoRetry
    redirections=redirections, connection_type=connection_type)
  File "<https://builds.apache.org/job/beam_PostCommit_Py_ValCont/ws/src/sdks/python/container/venv/python/local/lib/python2.7/site-packages/oauth2client/transport.py",>
line 169, in new_request
    redirections, connection_type)
  File "<https://builds.apache.org/job/beam_PostCommit_Py_ValCont/ws/src/sdks/python/container/venv/python/local/lib/python2.7/site-packages/oauth2client/transport.py",>
line 169, in new_request
    redirections, connection_type)
  File "<https://builds.apache.org/job/beam_PostCommit_Py_ValCont/ws/src/sdks/python/container/venv/python/local/lib/python2.7/site-packages/httplib2/__init__.py",>
line 2133, in request
    cachekey,
  File "<https://builds.apache.org/job/beam_PostCommit_Py_ValCont/ws/src/sdks/python/container/venv/python/local/lib/python2.7/site-packages/httplib2/__init__.py",>
line 1796, in _request
    conn, request_uri, method, body, headers
  File "<https://builds.apache.org/job/beam_PostCommit_Py_ValCont/ws/src/sdks/python/container/venv/python/local/lib/python2.7/site-packages/httplib2/__init__.py",>
line 1737, in _conn_request
    response = conn.getresponse()
  File "/usr/lib/python2.7/httplib.py", line 1136, in getresponse
    response.begin()
  File "/usr/lib/python2.7/httplib.py", line 453, in begin
    version, status, reason = self._read_status()
  File "/usr/lib/python2.7/httplib.py", line 409, in _read_status
    line = self.fp.readline(_MAXLINE + 1)
  File "/usr/lib/python2.7/socket.py", line 480, in readline
    data = self._sock.recv(self._rbufsize)
  File "/usr/lib/python2.7/ssl.py", line 756, in recv
    return self.read(buflen)
  File "/usr/lib/python2.7/ssl.py", line 643, in read
    v = self._sslobj.read(len)
  File "<https://builds.apache.org/job/beam_PostCommit_Py_ValCont/ws/src/sdks/python/container/venv/python/local/lib/python2.7/site-packages/nose/plugins/multiprocess.py",>
line 276, in signalhandler
    raise TimedOutException()
TimedOutException: 'test_wordcount_fnapi_it (apache_beam.examples.wordcount_it_test.WordCountIT)'

======================================================================
ERROR: test_metrics_fnapi_it (apache_beam.runners.dataflow.dataflow_exercise_metrics_pipeline_test.ExerciseMetricsPipelineTest)
----------------------------------------------------------------------
Traceback (most recent call last):
  File "<https://builds.apache.org/job/beam_PostCommit_Py_ValCont/ws/src/sdks/python/container/venv/python/local/lib/python2.7/site-packages/nose/plugins/multiprocess.py",>
line 812, in run
    test(orig)
  File "<https://builds.apache.org/job/beam_PostCommit_Py_ValCont/ws/src/sdks/python/container/venv/python/local/lib/python2.7/site-packages/nose/case.py",>
line 45, in __call__
    return self.run(*arg, **kwarg)
  File "<https://builds.apache.org/job/beam_PostCommit_Py_ValCont/ws/src/sdks/python/container/venv/python/local/lib/python2.7/site-packages/nose/case.py",>
line 133, in run
    self.runTest(result)
  File "<https://builds.apache.org/job/beam_PostCommit_Py_ValCont/ws/src/sdks/python/container/venv/python/local/lib/python2.7/site-packages/nose/case.py",>
line 151, in runTest
    test(result)
  File "/usr/lib/python2.7/unittest/case.py", line 393, in __call__
    return self.run(*args, **kwds)
  File "/usr/lib/python2.7/unittest/case.py", line 329, in run
    testMethod()
  File "<https://builds.apache.org/job/beam_PostCommit_Py_ValCont/ws/src/sdks/python/apache_beam/runners/dataflow/dataflow_exercise_metrics_pipeline_test.py",>
line 60, in test_metrics_fnapi_it
    result = self.run_pipeline(experiment='beam_fn_api')
  File "<https://builds.apache.org/job/beam_PostCommit_Py_ValCont/ws/src/sdks/python/apache_beam/runners/dataflow/dataflow_exercise_metrics_pipeline_test.py",>
line 48, in run_pipeline
    return dataflow_exercise_metrics_pipeline.apply_and_run(p)
  File "<https://builds.apache.org/job/beam_PostCommit_Py_ValCont/ws/src/sdks/python/apache_beam/runners/dataflow/dataflow_exercise_metrics_pipeline.py",>
line 197, in apply_and_run
    result = pipeline.run()
  File "<https://builds.apache.org/job/beam_PostCommit_Py_ValCont/ws/src/sdks/python/apache_beam/pipeline.py",>
line 402, in run
    if test_runner_api and self._verify_runner_api_compatible():
  File "<https://builds.apache.org/job/beam_PostCommit_Py_ValCont/ws/src/sdks/python/apache_beam/pipeline.py",>
line 607, in _verify_runner_api_compatible
    self.visit(Visitor())
  File "<https://builds.apache.org/job/beam_PostCommit_Py_ValCont/ws/src/sdks/python/apache_beam/pipeline.py",>
line 447, in visit
    self._root_transform().visit(visitor, self, visited)
  File "<https://builds.apache.org/job/beam_PostCommit_Py_ValCont/ws/src/sdks/python/apache_beam/pipeline.py",>
line 824, in visit
    part.visit(visitor, pipeline, visited)
  File "<https://builds.apache.org/job/beam_PostCommit_Py_ValCont/ws/src/sdks/python/apache_beam/pipeline.py",>
line 824, in visit
    part.visit(visitor, pipeline, visited)
  File "<https://builds.apache.org/job/beam_PostCommit_Py_ValCont/ws/src/sdks/python/apache_beam/pipeline.py",>
line 824, in visit
    part.visit(visitor, pipeline, visited)
  File "<https://builds.apache.org/job/beam_PostCommit_Py_ValCont/ws/src/sdks/python/apache_beam/pipeline.py",>
line 824, in visit
    part.visit(visitor, pipeline, visited)
  File "<https://builds.apache.org/job/beam_PostCommit_Py_ValCont/ws/src/sdks/python/apache_beam/pipeline.py",>
line 827, in visit
    visitor.visit_transform(self)
  File "<https://builds.apache.org/job/beam_PostCommit_Py_ValCont/ws/src/sdks/python/apache_beam/pipeline.py",>
line 598, in visit_transform
    enable_trace=False),
  File "<https://builds.apache.org/job/beam_PostCommit_Py_ValCont/ws/src/sdks/python/apache_beam/internal/pickler.py",>
line 226, in dumps
    s = dill.dumps(o)
  File "<https://builds.apache.org/job/beam_PostCommit_Py_ValCont/ws/src/sdks/python/container/venv/python/local/lib/python2.7/site-packages/dill/_dill.py",>
line 294, in dumps
    dump(obj, file, protocol, byref, fmode, recurse)#, strictio)
  File "<https://builds.apache.org/job/beam_PostCommit_Py_ValCont/ws/src/sdks/python/container/venv/python/local/lib/python2.7/site-packages/dill/_dill.py",>
line 287, in dump
    pik.dump(obj)
  File "/usr/lib/python2.7/pickle.py", line 224, in dump
    self.save(obj)
  File "/usr/lib/python2.7/pickle.py", line 331, in save
    self.save_reduce(obj=obj, *rv)
  File "/usr/lib/python2.7/pickle.py", line 425, in save_reduce
    save(state)
  File "/usr/lib/python2.7/pickle.py", line 286, in save
    f(self, obj) # Call unbound method with explicit self
  File "<https://builds.apache.org/job/beam_PostCommit_Py_ValCont/ws/src/sdks/python/apache_beam/internal/pickler.py",>
line 198, in new_save_module_dict
    return old_save_module_dict(pickler, obj)
  File "<https://builds.apache.org/job/beam_PostCommit_Py_ValCont/ws/src/sdks/python/container/venv/python/local/lib/python2.7/site-packages/dill/_dill.py",>
line 902, in save_module_dict
    StockPickler.save_dict(pickler, obj)
  File "/usr/lib/python2.7/pickle.py", line 655, in save_dict
    self._batch_setitems(obj.iteritems())
  File "/usr/lib/python2.7/pickle.py", line 687, in _batch_setitems
    save(v)
  File "/usr/lib/python2.7/pickle.py", line 331, in save
    self.save_reduce(obj=obj, *rv)
  File "/usr/lib/python2.7/pickle.py", line 425, in save_reduce
    save(state)
  File "/usr/lib/python2.7/pickle.py", line 286, in save
    f(self, obj) # Call unbound method with explicit self
  File "<https://builds.apache.org/job/beam_PostCommit_Py_ValCont/ws/src/sdks/python/apache_beam/internal/pickler.py",>
line 198, in new_save_module_dict
    return old_save_module_dict(pickler, obj)
  File "<https://builds.apache.org/job/beam_PostCommit_Py_ValCont/ws/src/sdks/python/container/venv/python/local/lib/python2.7/site-packages/dill/_dill.py",>
line 902, in save_module_dict
    StockPickler.save_dict(pickler, obj)
  File "/usr/lib/python2.7/pickle.py", line 655, in save_dict
    self._batch_setitems(obj.iteritems())
  File "/usr/lib/python2.7/pickle.py", line 687, in _batch_setitems
    save(v)
  File "/usr/lib/python2.7/pickle.py", line 331, in save
    self.save_reduce(obj=obj, *rv)
  File "/usr/lib/python2.7/pickle.py", line 425, in save_reduce
    save(state)
  File "/usr/lib/python2.7/pickle.py", line 286, in save
    f(self, obj) # Call unbound method with explicit self
  File "<https://builds.apache.org/job/beam_PostCommit_Py_ValCont/ws/src/sdks/python/apache_beam/internal/pickler.py",>
line 198, in new_save_module_dict
    return old_save_module_dict(pickler, obj)
  File "<https://builds.apache.org/job/beam_PostCommit_Py_ValCont/ws/src/sdks/python/container/venv/python/local/lib/python2.7/site-packages/dill/_dill.py",>
line 902, in save_module_dict
    StockPickler.save_dict(pickler, obj)
  File "/usr/lib/python2.7/pickle.py", line 655, in save_dict
    self._batch_setitems(obj.iteritems())
  File "/usr/lib/python2.7/pickle.py", line 684, in _batch_setitems
    write(MARK)
  File "<https://builds.apache.org/job/beam_PostCommit_Py_ValCont/ws/src/sdks/python/container/venv/python/local/lib/python2.7/site-packages/nose/plugins/multiprocess.py",>
line 276, in signalhandler
    raise TimedOutException()
TimedOutException: 'test_metrics_fnapi_it (apache_beam.runners.dataflow.dataflow_exercise_metrics_pipeline_test.ExerciseMetricsPipelineTest)'

----------------------------------------------------------------------
XML: <https://builds.apache.org/job/beam_PostCommit_Py_ValCont/ws/src/sdks/python/nosetests.xml>
----------------------------------------------------------------------
Ran 2 tests in 903.105s

FAILED (errors=2)
cleanup_container
Untagged: us.gcr.io/apache-beam-testing/jenkins/python:20190614-092032
Untagged: us.gcr.io/apache-beam-testing/jenkins/python@sha256:d797aea5788fda9b7cb326d4f2d2e4964cd7e0cca56a7ca67554b13597ac3005
Deleted: sha256:0df08d7f24916d95f8c71dff744e26f9afe868c28e3fe1f2f1ee37d5ceb39a28
Deleted: sha256:b5b385aab1d9cf5a50c517b2a0b59771e37c3e58a76a0de62c1f12a657f82601
Deleted: sha256:1b4d9b7fdbbfb8d01c3391440021677935c61c7e7e8a75f57627e1b432a73d64
Deleted: sha256:3c9b8c21d5ce7128373972a7bca28c7ab0cca8910fe0453cd4bab906ab5af3bb
Deleted: sha256:5571933e99da2b60f6a9b636174faf8272e6b901640975f4761fb54339ad185e
Deleted: sha256:5e7423a9e5c8521e7986cac03dfc580f1ca0d5a152631db3611261a11babee70
Deleted: sha256:17f413630385dd3c008f36724935965a8b2206395e1d11005b1b4bd39e0d4506
Deleted: sha256:abd240d1a2e9a397af4125a941bc35436ae0d8d62225d6b314921f68d985f398
Deleted: sha256:d20650b6d315510849dc3aca0a5db81a60495a53dd1aea0b99274cd0fd827dcd
Deleted: sha256:d7cb6be9de3c985bc72af7fc31e9a30687a605f6a7e5b5316f7e0f25256078aa
Deleted: sha256:150eaa627c37846a7217c6815ba7611742faaeac026f57f3915baa39d897f51c
Deleted: sha256:1745bb8b0da040e2360506ba88d4c9f96d76336ee2ffa11ab60ea024dc949fe5
Deleted: sha256:ad92ee7f783696e0dc9ae4ea9ac38847757c04bc94b62e5617a1d7b762a9ce53
Deleted: sha256:473217eac5d49fdaaf9de02a5425671c4b6f95a4c885ef5749bb3a7b3d231871
Digests:
- us.gcr.io/apache-beam-testing/jenkins/python@sha256:d797aea5788fda9b7cb326d4f2d2e4964cd7e0cca56a7ca67554b13597ac3005
  Associated tags:
 - 20190614-092032
Tags:
- us.gcr.io/apache-beam-testing/jenkins/python:20190614-092032
Deleted [us.gcr.io/apache-beam-testing/jenkins/python:20190614-092032].
Deleted [us.gcr.io/apache-beam-testing/jenkins/python@sha256:d797aea5788fda9b7cb326d4f2d2e4964cd7e0cca56a7ca67554b13597ac3005].
Removed the container
Build step 'Execute shell' marked build as failure

---------------------------------------------------------------------
To unsubscribe, e-mail: builds-unsubscribe@beam.apache.org
For additional commands, e-mail: builds-help@beam.apache.org


Mime
View raw message