beam-builds mailing list archives

Site index · List index
Message view « Date » · « Thread »
Top « Date » · « Thread »
From Apache Jenkins Server <jenk...@builds.apache.org>
Subject Build failed in Jenkins: beam_PostCommit_Py_ValCont #3447
Date Wed, 05 Jun 2019 01:20:51 GMT
See <https://builds.apache.org/job/beam_PostCommit_Py_ValCont/3447/display/redirect?page=changes>

Changes:

[juta.staes] [BEAM-7351] increment ack deadline for flaky pubsub test

------------------------------------------
[...truncated 199.76 KB...]
copying apache_beam/transforms/cy_dataflow_distribution_counter.pyx -> apache-beam-2.14.0.dev0/apache_beam/transforms
copying apache_beam/transforms/dataflow_distribution_counter_test.py -> apache-beam-2.14.0.dev0/apache_beam/transforms
copying apache_beam/transforms/display.py -> apache-beam-2.14.0.dev0/apache_beam/transforms
copying apache_beam/transforms/display_test.py -> apache-beam-2.14.0.dev0/apache_beam/transforms
copying apache_beam/transforms/dofn_lifecycle_test.py -> apache-beam-2.14.0.dev0/apache_beam/transforms
copying apache_beam/transforms/external.py -> apache-beam-2.14.0.dev0/apache_beam/transforms
copying apache_beam/transforms/external_test.py -> apache-beam-2.14.0.dev0/apache_beam/transforms
copying apache_beam/transforms/external_test_it.py -> apache-beam-2.14.0.dev0/apache_beam/transforms
copying apache_beam/transforms/ptransform.py -> apache-beam-2.14.0.dev0/apache_beam/transforms
copying apache_beam/transforms/ptransform_test.py -> apache-beam-2.14.0.dev0/apache_beam/transforms
copying apache_beam/transforms/py_dataflow_distribution_counter.py -> apache-beam-2.14.0.dev0/apache_beam/transforms
copying apache_beam/transforms/sideinputs.py -> apache-beam-2.14.0.dev0/apache_beam/transforms
copying apache_beam/transforms/sideinputs_test.py -> apache-beam-2.14.0.dev0/apache_beam/transforms
copying apache_beam/transforms/stats.py -> apache-beam-2.14.0.dev0/apache_beam/transforms
copying apache_beam/transforms/stats_test.py -> apache-beam-2.14.0.dev0/apache_beam/transforms
copying apache_beam/transforms/timeutil.py -> apache-beam-2.14.0.dev0/apache_beam/transforms
copying apache_beam/transforms/trigger.py -> apache-beam-2.14.0.dev0/apache_beam/transforms
copying apache_beam/transforms/trigger_test.py -> apache-beam-2.14.0.dev0/apache_beam/transforms
copying apache_beam/transforms/userstate.py -> apache-beam-2.14.0.dev0/apache_beam/transforms
copying apache_beam/transforms/userstate_test.py -> apache-beam-2.14.0.dev0/apache_beam/transforms
copying apache_beam/transforms/util.py -> apache-beam-2.14.0.dev0/apache_beam/transforms
copying apache_beam/transforms/util_test.py -> apache-beam-2.14.0.dev0/apache_beam/transforms
copying apache_beam/transforms/window.py -> apache-beam-2.14.0.dev0/apache_beam/transforms
copying apache_beam/transforms/window_test.py -> apache-beam-2.14.0.dev0/apache_beam/transforms
copying apache_beam/transforms/write_ptransform_test.py -> apache-beam-2.14.0.dev0/apache_beam/transforms
copying apache_beam/typehints/__init__.py -> apache-beam-2.14.0.dev0/apache_beam/typehints
copying apache_beam/typehints/decorators.py -> apache-beam-2.14.0.dev0/apache_beam/typehints
copying apache_beam/typehints/native_type_compatibility.py -> apache-beam-2.14.0.dev0/apache_beam/typehints
copying apache_beam/typehints/native_type_compatibility_test.py -> apache-beam-2.14.0.dev0/apache_beam/typehints
copying apache_beam/typehints/opcodes.py -> apache-beam-2.14.0.dev0/apache_beam/typehints
copying apache_beam/typehints/trivial_inference.py -> apache-beam-2.14.0.dev0/apache_beam/typehints
copying apache_beam/typehints/trivial_inference_test.py -> apache-beam-2.14.0.dev0/apache_beam/typehints
copying apache_beam/typehints/typecheck.py -> apache-beam-2.14.0.dev0/apache_beam/typehints
copying apache_beam/typehints/typed_pipeline_test.py -> apache-beam-2.14.0.dev0/apache_beam/typehints
copying apache_beam/typehints/typehints.py -> apache-beam-2.14.0.dev0/apache_beam/typehints
copying apache_beam/typehints/typehints_test.py -> apache-beam-2.14.0.dev0/apache_beam/typehints
copying apache_beam/utils/__init__.py -> apache-beam-2.14.0.dev0/apache_beam/utils
copying apache_beam/utils/annotations.py -> apache-beam-2.14.0.dev0/apache_beam/utils
copying apache_beam/utils/annotations_test.py -> apache-beam-2.14.0.dev0/apache_beam/utils
copying apache_beam/utils/counters.pxd -> apache-beam-2.14.0.dev0/apache_beam/utils
copying apache_beam/utils/counters.py -> apache-beam-2.14.0.dev0/apache_beam/utils
copying apache_beam/utils/counters_test.py -> apache-beam-2.14.0.dev0/apache_beam/utils
copying apache_beam/utils/plugin.py -> apache-beam-2.14.0.dev0/apache_beam/utils
copying apache_beam/utils/processes.py -> apache-beam-2.14.0.dev0/apache_beam/utils
copying apache_beam/utils/processes_test.py -> apache-beam-2.14.0.dev0/apache_beam/utils
copying apache_beam/utils/profiler.py -> apache-beam-2.14.0.dev0/apache_beam/utils
copying apache_beam/utils/proto_utils.py -> apache-beam-2.14.0.dev0/apache_beam/utils
copying apache_beam/utils/retry.py -> apache-beam-2.14.0.dev0/apache_beam/utils
copying apache_beam/utils/retry_test.py -> apache-beam-2.14.0.dev0/apache_beam/utils
copying apache_beam/utils/timestamp.py -> apache-beam-2.14.0.dev0/apache_beam/utils
copying apache_beam/utils/timestamp_test.py -> apache-beam-2.14.0.dev0/apache_beam/utils
copying apache_beam/utils/urns.py -> apache-beam-2.14.0.dev0/apache_beam/utils
copying apache_beam/utils/windowed_value.pxd -> apache-beam-2.14.0.dev0/apache_beam/utils
copying apache_beam/utils/windowed_value.py -> apache-beam-2.14.0.dev0/apache_beam/utils
copying apache_beam/utils/windowed_value_test.py -> apache-beam-2.14.0.dev0/apache_beam/utils
Writing apache-beam-2.14.0.dev0/setup.cfg
creating dist
Creating tar archive
removing 'apache-beam-2.14.0.dev0' (and everything under it)
SDK_LOCATION=$(find dist/apache-beam-*.tar.gz)
find dist/apache-beam-*.tar.gz

# Run ValidatesRunner tests on Google Cloud Dataflow service
echo ">>> RUNNING DATAFLOW RUNNER VALIDATESCONTAINER TEST"
>>> RUNNING DATAFLOW RUNNER VALIDATESCONTAINER TEST
python setup.py nosetests \
  --attr ValidatesContainer \
  --nologcapture \
  --processes=1 \
  --process-timeout=900 \
  --test-pipeline-options=" \
    --runner=TestDataflowRunner \
    --project=$PROJECT \
    --worker_harness_container_image=$CONTAINER:$TAG \
    --staging_location=$GCS_LOCATION/staging-validatesrunner-test \
    --temp_location=$GCS_LOCATION/temp-validatesrunner-test \
    --output=$GCS_LOCATION/output \
    --sdk_location=$SDK_LOCATION \
    --num_workers=1"
<https://builds.apache.org/job/beam_PostCommit_Py_ValCont/ws/src/sdks/python/container/venv/python/local/lib/python2.7/site-packages/setuptools/dist.py>:472:
UserWarning: Normalizing '2.14.0.dev' to '2.14.0.dev0'
  normalized_version,
running nosetests
running egg_info
<https://builds.apache.org/job/beam_PostCommit_Py_ValCont/ws/src/sdks/python/gen_protos.py>:57:
UserWarning: Installing grpcio-tools is recommended for development.
  warnings.warn('Installing grpcio-tools is recommended for development.')
writing requirements to apache_beam.egg-info/requires.txt
writing apache_beam.egg-info/PKG-INFO
writing top-level names to apache_beam.egg-info/top_level.txt
writing dependency_links to apache_beam.egg-info/dependency_links.txt
writing entry points to apache_beam.egg-info/entry_points.txt
reading manifest file 'apache_beam.egg-info/SOURCES.txt'
reading manifest template 'MANIFEST.in'
warning: no files found matching 'README.md'
warning: no files found matching 'NOTICE'
warning: no files found matching 'LICENSE'
writing manifest file 'apache_beam.egg-info/SOURCES.txt'
WARNING:root:Using deprecated Datastore client.
This client will be removed in Beam 3.0 (next Beam major release).
Please migrate to apache_beam.io.gcp.datastore.v1new.datastoreio.
WARNING:root:python-snappy is not installed; some tests will be skipped.
WARNING:root:Tensorflow is not installed, so skipping some tests.
test_wordcount_fnapi_it (apache_beam.examples.wordcount_it_test.WordCountIT) ... ERROR
test_metrics_fnapi_it (apache_beam.runners.dataflow.dataflow_exercise_metrics_pipeline_test.ExerciseMetricsPipelineTest)
... ERROR

======================================================================
ERROR: test_wordcount_fnapi_it (apache_beam.examples.wordcount_it_test.WordCountIT)
----------------------------------------------------------------------
Traceback (most recent call last):
  File "<https://builds.apache.org/job/beam_PostCommit_Py_ValCont/ws/src/sdks/python/container/venv/python/local/lib/python2.7/site-packages/nose/plugins/multiprocess.py",>
line 812, in run
    test(orig)
  File "<https://builds.apache.org/job/beam_PostCommit_Py_ValCont/ws/src/sdks/python/container/venv/python/local/lib/python2.7/site-packages/nose/case.py",>
line 45, in __call__
    return self.run(*arg, **kwarg)
  File "<https://builds.apache.org/job/beam_PostCommit_Py_ValCont/ws/src/sdks/python/container/venv/python/local/lib/python2.7/site-packages/nose/case.py",>
line 133, in run
    self.runTest(result)
  File "<https://builds.apache.org/job/beam_PostCommit_Py_ValCont/ws/src/sdks/python/container/venv/python/local/lib/python2.7/site-packages/nose/case.py",>
line 151, in runTest
    test(result)
  File "/usr/lib/python2.7/unittest/case.py", line 393, in __call__
    return self.run(*args, **kwds)
  File "/usr/lib/python2.7/unittest/case.py", line 329, in run
    testMethod()
  File "<https://builds.apache.org/job/beam_PostCommit_Py_ValCont/ws/src/sdks/python/apache_beam/examples/wordcount_it_test.py",>
line 52, in test_wordcount_fnapi_it
    self._run_wordcount_it(wordcount.run, experiment='beam_fn_api')
  File "<https://builds.apache.org/job/beam_PostCommit_Py_ValCont/ws/src/sdks/python/apache_beam/examples/wordcount_it_test.py",>
line 84, in _run_wordcount_it
    run_wordcount(test_pipeline.get_full_options_as_args(**extra_opts))
  File "<https://builds.apache.org/job/beam_PostCommit_Py_ValCont/ws/src/sdks/python/apache_beam/examples/wordcount.py",>
line 114, in run
    result = p.run()
  File "<https://builds.apache.org/job/beam_PostCommit_Py_ValCont/ws/src/sdks/python/apache_beam/pipeline.py",>
line 406, in run
    self._options).run(False)
  File "<https://builds.apache.org/job/beam_PostCommit_Py_ValCont/ws/src/sdks/python/apache_beam/pipeline.py",>
line 419, in run
    return self.runner.run_pipeline(self, self._options)
  File "<https://builds.apache.org/job/beam_PostCommit_Py_ValCont/ws/src/sdks/python/apache_beam/runners/dataflow/test_dataflow_runner.py",>
line 71, in run_pipeline
    self.result.cancel()
  File "<https://builds.apache.org/job/beam_PostCommit_Py_ValCont/ws/src/sdks/python/apache_beam/runners/dataflow/dataflow_runner.py",>
line 1353, in cancel
    self.job_id(), 'JOB_STATE_CANCELLED'):
  File "<https://builds.apache.org/job/beam_PostCommit_Py_ValCont/ws/src/sdks/python/apache_beam/utils/retry.py",>
line 197, in wrapper
    return fun(*args, **kwargs)
  File "<https://builds.apache.org/job/beam_PostCommit_Py_ValCont/ws/src/sdks/python/apache_beam/runners/dataflow/internal/apiclient.py",>
line 639, in modify_job_state
    self._client.projects_locations_jobs.Update(request)
  File "<https://builds.apache.org/job/beam_PostCommit_Py_ValCont/ws/src/sdks/python/apache_beam/runners/dataflow/internal/clients/dataflow/dataflow_v1b3_client.py",>
line 812, in Update
    config, request, global_params=global_params)
  File "<https://builds.apache.org/job/beam_PostCommit_Py_ValCont/ws/src/sdks/python/container/venv/python/local/lib/python2.7/site-packages/apitools/base/py/base_api.py",>
line 729, in _RunMethod
    http, http_request, **opts)
  File "<https://builds.apache.org/job/beam_PostCommit_Py_ValCont/ws/src/sdks/python/container/venv/python/local/lib/python2.7/site-packages/apitools/base/py/http_wrapper.py",>
line 346, in MakeRequest
    check_response_func=check_response_func)
  File "<https://builds.apache.org/job/beam_PostCommit_Py_ValCont/ws/src/sdks/python/container/venv/python/local/lib/python2.7/site-packages/apitools/base/py/http_wrapper.py",>
line 396, in _MakeRequestNoRetry
    redirections=redirections, connection_type=connection_type)
  File "<https://builds.apache.org/job/beam_PostCommit_Py_ValCont/ws/src/sdks/python/container/venv/python/local/lib/python2.7/site-packages/oauth2client/transport.py",>
line 169, in new_request
    redirections, connection_type)
  File "<https://builds.apache.org/job/beam_PostCommit_Py_ValCont/ws/src/sdks/python/container/venv/python/local/lib/python2.7/site-packages/oauth2client/transport.py",>
line 169, in new_request
    redirections, connection_type)
  File "<https://builds.apache.org/job/beam_PostCommit_Py_ValCont/ws/src/sdks/python/container/venv/python/local/lib/python2.7/site-packages/httplib2/__init__.py",>
line 2133, in request
    cachekey,
  File "<https://builds.apache.org/job/beam_PostCommit_Py_ValCont/ws/src/sdks/python/container/venv/python/local/lib/python2.7/site-packages/httplib2/__init__.py",>
line 1796, in _request
    conn, request_uri, method, body, headers
  File "<https://builds.apache.org/job/beam_PostCommit_Py_ValCont/ws/src/sdks/python/container/venv/python/local/lib/python2.7/site-packages/httplib2/__init__.py",>
line 1737, in _conn_request
    response = conn.getresponse()
  File "/usr/lib/python2.7/httplib.py", line 1136, in getresponse
    response.begin()
  File "/usr/lib/python2.7/httplib.py", line 453, in begin
    version, status, reason = self._read_status()
  File "/usr/lib/python2.7/httplib.py", line 409, in _read_status
    line = self.fp.readline(_MAXLINE + 1)
  File "/usr/lib/python2.7/socket.py", line 480, in readline
    data = self._sock.recv(self._rbufsize)
  File "/usr/lib/python2.7/ssl.py", line 756, in recv
    return self.read(buflen)
  File "/usr/lib/python2.7/ssl.py", line 643, in read
    v = self._sslobj.read(len)
  File "<https://builds.apache.org/job/beam_PostCommit_Py_ValCont/ws/src/sdks/python/container/venv/python/local/lib/python2.7/site-packages/nose/plugins/multiprocess.py",>
line 276, in signalhandler
    raise TimedOutException()
TimedOutException: 'test_wordcount_fnapi_it (apache_beam.examples.wordcount_it_test.WordCountIT)'

======================================================================
ERROR: test_metrics_fnapi_it (apache_beam.runners.dataflow.dataflow_exercise_metrics_pipeline_test.ExerciseMetricsPipelineTest)
----------------------------------------------------------------------
Traceback (most recent call last):
  File "<https://builds.apache.org/job/beam_PostCommit_Py_ValCont/ws/src/sdks/python/container/venv/python/local/lib/python2.7/site-packages/nose/plugins/multiprocess.py",>
line 812, in run
    test(orig)
  File "<https://builds.apache.org/job/beam_PostCommit_Py_ValCont/ws/src/sdks/python/container/venv/python/local/lib/python2.7/site-packages/nose/case.py",>
line 45, in __call__
    return self.run(*arg, **kwarg)
  File "<https://builds.apache.org/job/beam_PostCommit_Py_ValCont/ws/src/sdks/python/container/venv/python/local/lib/python2.7/site-packages/nose/case.py",>
line 133, in run
    self.runTest(result)
  File "<https://builds.apache.org/job/beam_PostCommit_Py_ValCont/ws/src/sdks/python/container/venv/python/local/lib/python2.7/site-packages/nose/case.py",>
line 151, in runTest
    test(result)
  File "/usr/lib/python2.7/unittest/case.py", line 393, in __call__
    return self.run(*args, **kwds)
  File "/usr/lib/python2.7/unittest/case.py", line 329, in run
    testMethod()
  File "<https://builds.apache.org/job/beam_PostCommit_Py_ValCont/ws/src/sdks/python/apache_beam/runners/dataflow/dataflow_exercise_metrics_pipeline_test.py",>
line 60, in test_metrics_fnapi_it
    result = self.run_pipeline(experiment='beam_fn_api')
  File "<https://builds.apache.org/job/beam_PostCommit_Py_ValCont/ws/src/sdks/python/apache_beam/runners/dataflow/dataflow_exercise_metrics_pipeline_test.py",>
line 48, in run_pipeline
    return dataflow_exercise_metrics_pipeline.apply_and_run(p)
  File "<https://builds.apache.org/job/beam_PostCommit_Py_ValCont/ws/src/sdks/python/apache_beam/runners/dataflow/dataflow_exercise_metrics_pipeline.py",>
line 197, in apply_and_run
    result = pipeline.run()
  File "<https://builds.apache.org/job/beam_PostCommit_Py_ValCont/ws/src/sdks/python/apache_beam/pipeline.py",>
line 404, in run
    self.to_runner_api(use_fake_coders=True),
  File "<https://builds.apache.org/job/beam_PostCommit_Py_ValCont/ws/src/sdks/python/apache_beam/pipeline.py",>
line 656, in to_runner_api
    root_transform_id = context.transforms.get_id(self._root_transform())
  File "<https://builds.apache.org/job/beam_PostCommit_Py_ValCont/ws/src/sdks/python/apache_beam/runners/pipeline_context.py",>
line 84, in get_id
    self._id_to_proto[id] = obj.to_runner_api(self._pipeline_context)
  File "<https://builds.apache.org/job/beam_PostCommit_Py_ValCont/ws/src/sdks/python/apache_beam/pipeline.py",>
line 877, in to_runner_api
    for part in self.parts],
  File "<https://builds.apache.org/job/beam_PostCommit_Py_ValCont/ws/src/sdks/python/apache_beam/runners/pipeline_context.py",>
line 84, in get_id
    self._id_to_proto[id] = obj.to_runner_api(self._pipeline_context)
  File "<https://builds.apache.org/job/beam_PostCommit_Py_ValCont/ws/src/sdks/python/apache_beam/pipeline.py",>
line 877, in to_runner_api
    for part in self.parts],
  File "<https://builds.apache.org/job/beam_PostCommit_Py_ValCont/ws/src/sdks/python/apache_beam/runners/pipeline_context.py",>
line 84, in get_id
    self._id_to_proto[id] = obj.to_runner_api(self._pipeline_context)
  File "<https://builds.apache.org/job/beam_PostCommit_Py_ValCont/ws/src/sdks/python/apache_beam/pipeline.py",>
line 883, in to_runner_api
    display_data=None)
  File "<https://builds.apache.org/job/beam_PostCommit_Py_ValCont/ws/src/sdks/python/container/venv/python/local/lib/python2.7/site-packages/google/protobuf/internal/containers.py",>
line 152, in update
    def update(*args, **kwds):
  File "<https://builds.apache.org/job/beam_PostCommit_Py_ValCont/ws/src/sdks/python/container/venv/python/local/lib/python2.7/site-packages/nose/plugins/multiprocess.py",>
line 276, in signalhandler
    raise TimedOutException()
TimedOutException: 'test_metrics_fnapi_it (apache_beam.runners.dataflow.dataflow_exercise_metrics_pipeline_test.ExerciseMetricsPipelineTest)'

----------------------------------------------------------------------
XML: <https://builds.apache.org/job/beam_PostCommit_Py_ValCont/ws/src/sdks/python/nosetests.xml>
----------------------------------------------------------------------
Ran 2 tests in 903.202s

FAILED (errors=2)
cleanup_container
Untagged: us.gcr.io/apache-beam-testing/jenkins/python:20190605-005735
Untagged: us.gcr.io/apache-beam-testing/jenkins/python@sha256:1828ee71bcbee3b1526c71cd1931aba7a2b9b7fe820cd5445ca312b99e7d6987
Deleted: sha256:5a69c9e003bee488a874529b96e6a689e38aa17f1c89bf0688b5f2678556ba74
Deleted: sha256:1cc00c529d895580d6fe5bd63c994567d2dd4fa34eceb35ed413531cbae33129
Deleted: sha256:8fd6f9b043637dce23f725727d3e525c8ffb36bb3124f2164872c8a63d58ac55
Deleted: sha256:9b9f4f74772889cc4a54ac9b3630d3fba1700597bc435f74afcd55f80ad4b6cd
Deleted: sha256:aa43f6cc3027df55f2c00402d1026c2cc96a20ad2cbabc5eaf36f7e9c05ebfa6
Deleted: sha256:2a30757406b34de102e1f875b64ced8c47bb221c4952c12ef38b67c394ab8fa9
Deleted: sha256:34c470c023507bc929680db12db36dc97839ddad5d46eec7895c85525096daa8
Deleted: sha256:af5f88624d55fb650eb5afa2c4027a78337a1a58095265643edae10fb0377421
Deleted: sha256:9cbb848a0e364aea6e4e93592dd6fc16aaeac6dbceccb954f740f0c9e115b5db
Deleted: sha256:0e14390c35e56a27382821e6eeb69aa9e4c0e9040f7f0bcba01ae7cef293176a
Deleted: sha256:677811f9139d162863fa2c22f137a8f61a4fb7b7ecf8e7f8467de851f359f5c8
Deleted: sha256:933f36604cdfac3689da2ee6b32849685da6575d408b9aac79b62676c4f8863b
Deleted: sha256:e53c9883bc762f133d5dbe9303c96e1ffecf7b06a2a1e8b561fdf4690e75055d
Deleted: sha256:8c0cea3be1ed834a8a034b8718b76b8188d6c9a2c56ad5e059d483e8d82f98ca
Digests:
- us.gcr.io/apache-beam-testing/jenkins/python@sha256:1828ee71bcbee3b1526c71cd1931aba7a2b9b7fe820cd5445ca312b99e7d6987
  Associated tags:
 - 20190605-005735
Tags:
- us.gcr.io/apache-beam-testing/jenkins/python:20190605-005735
Deleted [us.gcr.io/apache-beam-testing/jenkins/python:20190605-005735].
Deleted [us.gcr.io/apache-beam-testing/jenkins/python@sha256:1828ee71bcbee3b1526c71cd1931aba7a2b9b7fe820cd5445ca312b99e7d6987].
Removed the container
Build step 'Execute shell' marked build as failure

---------------------------------------------------------------------
To unsubscribe, e-mail: builds-unsubscribe@beam.apache.org
For additional commands, e-mail: builds-help@beam.apache.org


Mime
View raw message