beam-builds mailing list archives

Site index · List index
Message view « Date » · « Thread »
Top « Date » · « Thread »
From Apache Jenkins Server <jenk...@builds.apache.org>
Subject Build failed in Jenkins: beam_PostCommit_Python_VR_Spark #259
Date Sun, 30 Jun 2019 18:04:31 GMT
See <https://builds.apache.org/job/beam_PostCommit_Python_VR_Spark/259/display/redirect>

------------------------------------------
[...truncated 578.46 KB...]
----------------------------------------------------------------------
Traceback (most recent call last):
  File "apache_beam/runners/portability/fn_api_runner_test.py", line 267, in test_multimap_side_input_type_coercion
    equal_to([('a', [1, 3]), ('b', [2])]))
  File "apache_beam/pipeline.py", line 426, in __exit__
    self.run().wait_until_finish()
  File "apache_beam/runners/portability/portable_runner.py", line 454, in wait_until_finish
    self._job_id, self._state, self._last_error_message()))
RuntimeError: Pipeline test_multimap_side_input_type_coercion_1561917856.85_842c62e8-37f1-4fd3-bf70-5b6db6524981
failed in state FAILED: java.lang.ClassCastException: org.apache.beam.sdk.coders.LengthPrefixCoder
cannot be cast to org.apache.beam.sdk.coders.KvCoder

======================================================================
ERROR: test_pardo (__main__.SparkRunnerTest)
----------------------------------------------------------------------
Traceback (most recent call last):
  File "apache_beam/runners/portability/fn_api_runner_test.py", line 104, in test_pardo
    assert_that(res, equal_to(['aax', 'bcbcx']))
  File "apache_beam/pipeline.py", line 426, in __exit__
    self.run().wait_until_finish()
  File "apache_beam/runners/portability/portable_runner.py", line 454, in wait_until_finish
    self._job_id, self._state, self._last_error_message()))
RuntimeError: Pipeline test_pardo_1561917861.77_b30f2be8-54d7-44e9-bc51-d83c0c13ee8a failed
in state FAILED: java.lang.ClassCastException: org.apache.beam.sdk.coders.LengthPrefixCoder
cannot be cast to org.apache.beam.sdk.coders.KvCoder

======================================================================
ERROR: test_pardo_side_and_main_outputs (__main__.SparkRunnerTest)
----------------------------------------------------------------------
Traceback (most recent call last):
  File "apache_beam/runners/portability/fn_api_runner_test.py", line 176, in test_pardo_side_and_main_outputs
    assert_that(unnamed.odd, equal_to([1, 3]), label='unnamed.odd')
  File "apache_beam/pipeline.py", line 426, in __exit__
    self.run().wait_until_finish()
  File "apache_beam/runners/portability/portable_runner.py", line 454, in wait_until_finish
    self._job_id, self._state, self._last_error_message()))
RuntimeError: Pipeline test_pardo_side_and_main_outputs_1561917862.37_8311e077-2de5-4329-8fb6-6cfe936d4af9
failed in state FAILED: java.lang.ClassCastException: org.apache.beam.sdk.coders.LengthPrefixCoder
cannot be cast to org.apache.beam.sdk.coders.KvCoder

======================================================================
ERROR: test_pardo_side_inputs (__main__.SparkRunnerTest)
----------------------------------------------------------------------
Traceback (most recent call last):
  File "apache_beam/runners/portability/fn_api_runner_test.py", line 187, in test_pardo_side_inputs
    ('a', 'y'), ('b', 'y'), ('c', 'y')]))
  File "apache_beam/pipeline.py", line 426, in __exit__
    self.run().wait_until_finish()
  File "apache_beam/runners/portability/portable_runner.py", line 454, in wait_until_finish
    self._job_id, self._state, self._last_error_message()))
RuntimeError: Pipeline test_pardo_side_inputs_1561917863.58_12246877-b268-4d28-bd67-32474b8e19e0
failed in state FAILED: java.lang.ClassCastException: org.apache.beam.sdk.coders.LengthPrefixCoder
cannot be cast to org.apache.beam.sdk.coders.KvCoder

======================================================================
ERROR: test_pardo_side_outputs (__main__.SparkRunnerTest)
----------------------------------------------------------------------
Traceback (most recent call last):
  File "apache_beam/runners/portability/fn_api_runner_test.py", line 158, in test_pardo_side_outputs
    assert_that(xy.y, equal_to(['y', 'xy']), label='y')
  File "apache_beam/pipeline.py", line 426, in __exit__
    self.run().wait_until_finish()
  File "apache_beam/runners/portability/portable_runner.py", line 454, in wait_until_finish
    self._job_id, self._state, self._last_error_message()))
RuntimeError: Pipeline test_pardo_side_outputs_1561917864.08_9f218ea8-f344-43fd-85f1-5b490552f0a5
failed in state FAILED: java.lang.ClassCastException: org.apache.beam.sdk.coders.LengthPrefixCoder
cannot be cast to org.apache.beam.sdk.coders.KvCoder

======================================================================
ERROR: test_pardo_state_only (__main__.SparkRunnerTest)
----------------------------------------------------------------------
Traceback (most recent call last):
  File "apache_beam/runners/portability/fn_api_runner_test.py", line 308, in test_pardo_state_only
    equal_to(expected))
  File "apache_beam/pipeline.py", line 426, in __exit__
    self.run().wait_until_finish()
  File "apache_beam/runners/portability/portable_runner.py", line 454, in wait_until_finish
    self._job_id, self._state, self._last_error_message()))
RuntimeError: Pipeline test_pardo_state_only_1561917864.61_c0024d79-a691-48d7-a7e1-cca80220c62e
failed in state FAILED: java.lang.ClassCastException: org.apache.beam.sdk.coders.LengthPrefixCoder
cannot be cast to org.apache.beam.sdk.coders.KvCoder

======================================================================
ERROR: test_pardo_state_timers (__main__.SparkRunnerTest)
----------------------------------------------------------------------
Traceback (most recent call last):
  File "apache_beam/runners/portability/fn_api_runner_test.py", line 401, in test_pardo_state_timers
    self._run_pardo_state_timers(False)
  File "apache_beam/runners/portability/fn_api_runner_test.py", line 461, in _run_pardo_state_timers
    assert_that(actual, is_buffered_correctly)
  File "apache_beam/pipeline.py", line 426, in __exit__
    self.run().wait_until_finish()
  File "apache_beam/runners/portability/portable_runner.py", line 454, in wait_until_finish
    self._job_id, self._state, self._last_error_message()))
RuntimeError: Pipeline test_pardo_state_timers_1561917864.99_ba35f2b5-d811-43b7-9a9b-d319368fda9f
failed in state FAILED: java.lang.ClassCastException: org.apache.beam.sdk.coders.LengthPrefixCoder
cannot be cast to org.apache.beam.sdk.coders.KvCoder

======================================================================
ERROR: test_pardo_timers (__main__.SparkRunnerTest)
----------------------------------------------------------------------
Traceback (most recent call last):
  File "apache_beam/runners/portability/fn_api_runner_test.py", line 361, in test_pardo_timers
    assert_that(actual, equal_to(expected))
  File "apache_beam/pipeline.py", line 426, in __exit__
    self.run().wait_until_finish()
  File "apache_beam/runners/portability/portable_runner.py", line 454, in wait_until_finish
    self._job_id, self._state, self._last_error_message()))
RuntimeError: Pipeline test_pardo_timers_1561917865.49_689e09ac-f0fb-4a95-86eb-95bef7b7bbf6
failed in state FAILED: java.lang.ClassCastException: org.apache.beam.sdk.coders.LengthPrefixCoder
cannot be cast to org.apache.beam.sdk.coders.KvCoder

======================================================================
ERROR: test_pardo_unfusable_side_inputs (__main__.SparkRunnerTest)
----------------------------------------------------------------------
Traceback (most recent call last):
  File "apache_beam/runners/portability/fn_api_runner_test.py", line 277, in test_pardo_unfusable_side_inputs
    equal_to([('a', 'a'), ('a', 'b'), ('b', 'a'), ('b', 'b')]))
  File "apache_beam/pipeline.py", line 426, in __exit__
    self.run().wait_until_finish()
  File "apache_beam/runners/portability/portable_runner.py", line 454, in wait_until_finish
    self._job_id, self._state, self._last_error_message()))
RuntimeError: Pipeline test_pardo_unfusable_side_inputs_1561917865.88_2d78a58d-5eff-41f0-890f-ebdf1dc2cc84
failed in state FAILED: java.lang.ClassCastException: org.apache.beam.sdk.coders.LengthPrefixCoder
cannot be cast to org.apache.beam.sdk.coders.KvCoder

======================================================================
ERROR: test_pardo_windowed_side_inputs (__main__.SparkRunnerTest)
----------------------------------------------------------------------
Traceback (most recent call last):
  File "apache_beam/runners/portability/fn_api_runner_test.py", line 214, in test_pardo_windowed_side_inputs
    label='windowed')
  File "apache_beam/pipeline.py", line 426, in __exit__
    self.run().wait_until_finish()
  File "apache_beam/runners/portability/portable_runner.py", line 454, in wait_until_finish
    self._job_id, self._state, self._last_error_message()))
RuntimeError: Pipeline test_pardo_windowed_side_inputs_1561917866.28_14bb7f08-4f33-466b-9317-b25f9922f42a
failed in state FAILED: java.lang.ClassCastException: org.apache.beam.sdk.coders.LengthPrefixCoder
cannot be cast to org.apache.beam.sdk.coders.KvCoder

======================================================================
ERROR: test_read (__main__.SparkRunnerTest)
----------------------------------------------------------------------
Traceback (most recent call last):
  File "apache_beam/runners/portability/fn_api_runner_test.py", line 592, in test_read
    equal_to(['a', 'b', 'c']))
  File "apache_beam/pipeline.py", line 426, in __exit__
    self.run().wait_until_finish()
  File "apache_beam/runners/portability/portable_runner.py", line 454, in wait_until_finish
    self._job_id, self._state, self._last_error_message()))
RuntimeError: Pipeline test_read_1561917866.68_e0537317-8d0b-4c9c-8f6d-8867341f4874 failed
in state FAILED: java.lang.ClassCastException: org.apache.beam.sdk.coders.LengthPrefixCoder
cannot be cast to org.apache.beam.sdk.coders.KvCoder

======================================================================
ERROR: test_reshuffle (__main__.SparkRunnerTest)
----------------------------------------------------------------------
Traceback (most recent call last):
  File "apache_beam/runners/portability/fn_api_runner_test.py", line 562, in test_reshuffle
    equal_to([1, 2, 3]))
  File "apache_beam/pipeline.py", line 426, in __exit__
    self.run().wait_until_finish()
  File "apache_beam/runners/portability/portable_runner.py", line 454, in wait_until_finish
    self._job_id, self._state, self._last_error_message()))
RuntimeError: Pipeline test_reshuffle_1561917867.04_471665a4-89a2-4af5-8955-277b42fd960c failed
in state FAILED: java.lang.ClassCastException: org.apache.beam.sdk.coders.LengthPrefixCoder
cannot be cast to org.apache.beam.sdk.coders.KvCoder

======================================================================
ERROR: test_sdf_wrap_range_source (__main__.SparkRunnerTest)
----------------------------------------------------------------------
Traceback (most recent call last):
  File "apache_beam/runners/portability/fn_api_runner_test.py", line 548, in test_sdf_wrap_range_source
    self._run_sdf_wrapper_pipeline(RangeSource(0, 4), [0, 1, 2, 3])
  File "apache_beam/runners/portability/fn_api_runner_test.py", line 534, in _run_sdf_wrapper_pipeline
    p | beam.io.Read(source)
  File "apache_beam/pipeline.py", line 426, in __exit__
    self.run().wait_until_finish()
  File "apache_beam/runners/portability/portable_runner.py", line 454, in wait_until_finish
    self._job_id, self._state, self._last_error_message()))
RuntimeError: Pipeline test_sdf_wrap_range_source_1561917867.47_8a55416c-7ddb-4b51-b6ea-50120ba90e28
failed in state FAILED: java.lang.ClassCastException: org.apache.beam.sdk.coders.LengthPrefixCoder
cannot be cast to org.apache.beam.sdk.coders.KvCoder

======================================================================
ERROR: test_sdf_wrapper_overrides_read (__main__.SparkRunnerTest)
----------------------------------------------------------------------
Traceback (most recent call last):
  File "<https://builds.apache.org/job/beam_PostCommit_Python_VR_Spark/ws/src/build/gradleenv/1922375555/local/lib/python2.7/site-packages/mock-2.0.0-py2.7.egg/mock/mock.py",>
line 1305, in patched
    return func(*args, **keywargs)
  File "apache_beam/runners/portability/fn_api_runner_test.py", line 545, in test_sdf_wrapper_overrides_read
    self._run_sdf_wrapper_pipeline(RangeSource(0, 4), ['1'])
  File "apache_beam/runners/portability/fn_api_runner_test.py", line 534, in _run_sdf_wrapper_pipeline
    p | beam.io.Read(source)
  File "apache_beam/pipeline.py", line 426, in __exit__
    self.run().wait_until_finish()
  File "apache_beam/runners/portability/portable_runner.py", line 454, in wait_until_finish
    self._job_id, self._state, self._last_error_message()))
RuntimeError: Pipeline test_sdf_wrapper_overrides_read_1561917867.66_ab8ce47a-10f6-41e5-9680-4a35ed21dfa0
failed in state FAILED: java.lang.ClassCastException: org.apache.beam.sdk.coders.LengthPrefixCoder
cannot be cast to org.apache.beam.sdk.coders.KvCoder

======================================================================
ERROR: test_windowed_pardo_state_timers (__main__.SparkRunnerTest)
----------------------------------------------------------------------
Traceback (most recent call last):
  File "apache_beam/runners/portability/fn_api_runner_test.py", line 404, in test_windowed_pardo_state_timers
    self._run_pardo_state_timers(True)
  File "apache_beam/runners/portability/fn_api_runner_test.py", line 461, in _run_pardo_state_timers
    assert_that(actual, is_buffered_correctly)
  File "apache_beam/pipeline.py", line 426, in __exit__
    self.run().wait_until_finish()
  File "apache_beam/runners/portability/portable_runner.py", line 454, in wait_until_finish
    self._job_id, self._state, self._last_error_message()))
RuntimeError: Pipeline test_windowed_pardo_state_timers_1561917867.85_64794f89-d853-4ca7-9d74-69cd6792455b
failed in state FAILED: java.lang.ClassCastException: org.apache.beam.sdk.coders.LengthPrefixCoder
cannot be cast to org.apache.beam.sdk.coders.KvCoder

======================================================================
ERROR: test_windowing (__main__.SparkRunnerTest)
----------------------------------------------------------------------
Traceback (most recent call last):
  File "apache_beam/runners/portability/fn_api_runner_test.py", line 604, in test_windowing
    assert_that(res, equal_to([('k', [1, 2]), ('k', [100, 101, 102])]))
  File "apache_beam/pipeline.py", line 426, in __exit__
    self.run().wait_until_finish()
  File "apache_beam/runners/portability/portable_runner.py", line 454, in wait_until_finish
    self._job_id, self._state, self._last_error_message()))
RuntimeError: Pipeline test_windowing_1561917868.27_1e4afce6-dc66-476a-97b4-06b65b29564a failed
in state FAILED: java.lang.ClassCastException: org.apache.beam.sdk.coders.LengthPrefixCoder
cannot be cast to org.apache.beam.sdk.coders.KvCoder

======================================================================
FAIL: test_assert_that (__main__.SparkRunnerTest)
----------------------------------------------------------------------
Traceback (most recent call last):
  File "apache_beam/runners/portability/fn_api_runner_test.py", line 92, in test_assert_that
    assert_that(p | beam.Create(['a', 'b']), equal_to(['a']))
AssertionError: "Failed assert" does not match "Pipeline test_assert_that_1561917823.82_844ed819-7968-4ab5-98d6-c1338b7c14d3
failed in state FAILED: java.lang.ClassCastException: org.apache.beam.sdk.coders.LengthPrefixCoder
cannot be cast to org.apache.beam.sdk.coders.KvCoder"

======================================================================
FAIL: test_error_message_includes_stage (__main__.SparkRunnerTest)
----------------------------------------------------------------------
Traceback (most recent call last):
  File "apache_beam/runners/portability/fn_api_runner_test.py", line 638, in test_error_message_includes_stage
    self.assertIn('StageC', message)
AssertionError: 'StageC' not found in u'Pipeline test_error_message_includes_stage_1561917830.61_6615bd20-88f7-4a3a-b2ff-d68535214e30
failed in state FAILED: java.lang.ClassCastException: org.apache.beam.sdk.coders.LengthPrefixCoder
cannot be cast to org.apache.beam.sdk.coders.KvCoder'

----------------------------------------------------------------------
Ran 38 tests in 45.083s

FAILED (failures=2, errors=22, skipped=10)

> Task :sdks:python:sparkValidatesRunner FAILED

FAILURE: Build failed with an exception.

* Where:
Build file '<https://builds.apache.org/job/beam_PostCommit_Python_VR_Spark/ws/src/sdks/python/build.gradle'>
line: 251

* What went wrong:
Execution failed for task ':sdks:python:sparkValidatesRunner'.
> Process 'command 'sh'' finished with non-zero exit value 1

* Try:
Run with --stacktrace option to get the stack trace. Run with --info or --debug option to
get more log output. Run with --scan to get full insights.

* Get more help at https://help.gradle.org

Deprecated Gradle features were used in this build, making it incompatible with Gradle 6.0.
Use '--warning-mode all' to show the individual deprecation warnings.
See https://docs.gradle.org/5.2.1/userguide/command_line_interface.html#sec:command_line_warnings

BUILD FAILED in 3m 15s
60 actionable tasks: 47 executed, 13 from cache

Publishing build scan...
https://gradle.com/s/qgkc3wspogitu

Build step 'Invoke Gradle script' changed build result to FAILURE
Build step 'Invoke Gradle script' marked build as failure

---------------------------------------------------------------------
To unsubscribe, e-mail: builds-unsubscribe@beam.apache.org
For additional commands, e-mail: builds-help@beam.apache.org


Mime
View raw message