beam-builds mailing list archives

Site index · List index
Message view « Date » · « Thread »
Top « Date » · « Thread »
From Apache Jenkins Server <jenk...@builds.apache.org>
Subject Build failed in Jenkins: beam_PostCommit_Py_ValCont #3497
Date Sun, 09 Jun 2019 06:23:49 GMT
See <https://builds.apache.org/job/beam_PostCommit_Py_ValCont/3497/display/redirect>

------------------------------------------
[...truncated 201.58 KB...]
copying apache_beam/transforms/trigger.py -> apache-beam-2.14.0.dev0/apache_beam/transforms
copying apache_beam/transforms/trigger_test.py -> apache-beam-2.14.0.dev0/apache_beam/transforms
copying apache_beam/transforms/userstate.py -> apache-beam-2.14.0.dev0/apache_beam/transforms
copying apache_beam/transforms/userstate_test.py -> apache-beam-2.14.0.dev0/apache_beam/transforms
copying apache_beam/transforms/util.py -> apache-beam-2.14.0.dev0/apache_beam/transforms
copying apache_beam/transforms/util_test.py -> apache-beam-2.14.0.dev0/apache_beam/transforms
copying apache_beam/transforms/window.py -> apache-beam-2.14.0.dev0/apache_beam/transforms
copying apache_beam/transforms/window_test.py -> apache-beam-2.14.0.dev0/apache_beam/transforms
copying apache_beam/transforms/write_ptransform_test.py -> apache-beam-2.14.0.dev0/apache_beam/transforms
copying apache_beam/typehints/__init__.py -> apache-beam-2.14.0.dev0/apache_beam/typehints
copying apache_beam/typehints/decorators.py -> apache-beam-2.14.0.dev0/apache_beam/typehints
copying apache_beam/typehints/native_type_compatibility.py -> apache-beam-2.14.0.dev0/apache_beam/typehints
copying apache_beam/typehints/native_type_compatibility_test.py -> apache-beam-2.14.0.dev0/apache_beam/typehints
copying apache_beam/typehints/opcodes.py -> apache-beam-2.14.0.dev0/apache_beam/typehints
copying apache_beam/typehints/trivial_inference.py -> apache-beam-2.14.0.dev0/apache_beam/typehints
copying apache_beam/typehints/trivial_inference_test.py -> apache-beam-2.14.0.dev0/apache_beam/typehints
copying apache_beam/typehints/typecheck.py -> apache-beam-2.14.0.dev0/apache_beam/typehints
copying apache_beam/typehints/typed_pipeline_test.py -> apache-beam-2.14.0.dev0/apache_beam/typehints
copying apache_beam/typehints/typehints.py -> apache-beam-2.14.0.dev0/apache_beam/typehints
copying apache_beam/typehints/typehints_test.py -> apache-beam-2.14.0.dev0/apache_beam/typehints
copying apache_beam/utils/__init__.py -> apache-beam-2.14.0.dev0/apache_beam/utils
copying apache_beam/utils/annotations.py -> apache-beam-2.14.0.dev0/apache_beam/utils
copying apache_beam/utils/annotations_test.py -> apache-beam-2.14.0.dev0/apache_beam/utils
copying apache_beam/utils/counters.pxd -> apache-beam-2.14.0.dev0/apache_beam/utils
copying apache_beam/utils/counters.py -> apache-beam-2.14.0.dev0/apache_beam/utils
copying apache_beam/utils/counters_test.py -> apache-beam-2.14.0.dev0/apache_beam/utils
copying apache_beam/utils/plugin.py -> apache-beam-2.14.0.dev0/apache_beam/utils
copying apache_beam/utils/processes.py -> apache-beam-2.14.0.dev0/apache_beam/utils
copying apache_beam/utils/processes_test.py -> apache-beam-2.14.0.dev0/apache_beam/utils
copying apache_beam/utils/profiler.py -> apache-beam-2.14.0.dev0/apache_beam/utils
copying apache_beam/utils/proto_utils.py -> apache-beam-2.14.0.dev0/apache_beam/utils
copying apache_beam/utils/retry.py -> apache-beam-2.14.0.dev0/apache_beam/utils
copying apache_beam/utils/retry_test.py -> apache-beam-2.14.0.dev0/apache_beam/utils
copying apache_beam/utils/timestamp.py -> apache-beam-2.14.0.dev0/apache_beam/utils
copying apache_beam/utils/timestamp_test.py -> apache-beam-2.14.0.dev0/apache_beam/utils
copying apache_beam/utils/urns.py -> apache-beam-2.14.0.dev0/apache_beam/utils
copying apache_beam/utils/windowed_value.pxd -> apache-beam-2.14.0.dev0/apache_beam/utils
copying apache_beam/utils/windowed_value.py -> apache-beam-2.14.0.dev0/apache_beam/utils
copying apache_beam/utils/windowed_value_test.py -> apache-beam-2.14.0.dev0/apache_beam/utils
Writing apache-beam-2.14.0.dev0/setup.cfg
creating dist
Creating tar archive
removing 'apache-beam-2.14.0.dev0' (and everything under it)
SDK_LOCATION=$(find dist/apache-beam-*.tar.gz)
find dist/apache-beam-*.tar.gz

# Run ValidatesRunner tests on Google Cloud Dataflow service
echo ">>> RUNNING DATAFLOW RUNNER VALIDATESCONTAINER TEST"
>>> RUNNING DATAFLOW RUNNER VALIDATESCONTAINER TEST
python setup.py nosetests \
  --attr ValidatesContainer \
  --nologcapture \
  --processes=1 \
  --process-timeout=900 \
  --test-pipeline-options=" \
    --runner=TestDataflowRunner \
    --project=$PROJECT \
    --worker_harness_container_image=$CONTAINER:$TAG \
    --staging_location=$GCS_LOCATION/staging-validatesrunner-test \
    --temp_location=$GCS_LOCATION/temp-validatesrunner-test \
    --output=$GCS_LOCATION/output \
    --sdk_location=$SDK_LOCATION \
    --num_workers=1"
<https://builds.apache.org/job/beam_PostCommit_Py_ValCont/ws/src/sdks/python/container/venv/python/local/lib/python2.7/site-packages/setuptools/dist.py>:472:
UserWarning: Normalizing '2.14.0.dev' to '2.14.0.dev0'
  normalized_version,
running nosetests
running egg_info
<https://builds.apache.org/job/beam_PostCommit_Py_ValCont/ws/src/sdks/python/gen_protos.py>:57:
UserWarning: Installing grpcio-tools is recommended for development.
  warnings.warn('Installing grpcio-tools is recommended for development.')
writing requirements to apache_beam.egg-info/requires.txt
writing apache_beam.egg-info/PKG-INFO
writing top-level names to apache_beam.egg-info/top_level.txt
writing dependency_links to apache_beam.egg-info/dependency_links.txt
writing entry points to apache_beam.egg-info/entry_points.txt
reading manifest file 'apache_beam.egg-info/SOURCES.txt'
reading manifest template 'MANIFEST.in'
warning: no files found matching 'README.md'
warning: no files found matching 'NOTICE'
warning: no files found matching 'LICENSE'
writing manifest file 'apache_beam.egg-info/SOURCES.txt'
WARNING:root:Using deprecated Datastore client.
This client will be removed in Beam 3.0 (next Beam major release).
Please migrate to apache_beam.io.gcp.datastore.v1new.datastoreio.
WARNING:root:python-snappy is not installed; some tests will be skipped.
WARNING:root:Tensorflow is not installed, so skipping some tests.
test_wordcount_fnapi_it (apache_beam.examples.wordcount_it_test.WordCountIT) ... ERROR
test_metrics_fnapi_it (apache_beam.runners.dataflow.dataflow_exercise_metrics_pipeline_test.ExerciseMetricsPipelineTest)
... ERROR

======================================================================
ERROR: test_wordcount_fnapi_it (apache_beam.examples.wordcount_it_test.WordCountIT)
----------------------------------------------------------------------
Traceback (most recent call last):
  File "<https://builds.apache.org/job/beam_PostCommit_Py_ValCont/ws/src/sdks/python/container/venv/python/local/lib/python2.7/site-packages/nose/plugins/multiprocess.py",>
line 812, in run
    test(orig)
  File "<https://builds.apache.org/job/beam_PostCommit_Py_ValCont/ws/src/sdks/python/container/venv/python/local/lib/python2.7/site-packages/nose/case.py",>
line 45, in __call__
    return self.run(*arg, **kwarg)
  File "<https://builds.apache.org/job/beam_PostCommit_Py_ValCont/ws/src/sdks/python/container/venv/python/local/lib/python2.7/site-packages/nose/case.py",>
line 133, in run
    self.runTest(result)
  File "<https://builds.apache.org/job/beam_PostCommit_Py_ValCont/ws/src/sdks/python/container/venv/python/local/lib/python2.7/site-packages/nose/case.py",>
line 151, in runTest
    test(result)
  File "/usr/lib/python2.7/unittest/case.py", line 393, in __call__
    return self.run(*args, **kwds)
  File "/usr/lib/python2.7/unittest/case.py", line 329, in run
    testMethod()
  File "<https://builds.apache.org/job/beam_PostCommit_Py_ValCont/ws/src/sdks/python/apache_beam/examples/wordcount_it_test.py",>
line 52, in test_wordcount_fnapi_it
    self._run_wordcount_it(wordcount.run, experiment='beam_fn_api')
  File "<https://builds.apache.org/job/beam_PostCommit_Py_ValCont/ws/src/sdks/python/apache_beam/examples/wordcount_it_test.py",>
line 84, in _run_wordcount_it
    run_wordcount(test_pipeline.get_full_options_as_args(**extra_opts))
  File "<https://builds.apache.org/job/beam_PostCommit_Py_ValCont/ws/src/sdks/python/apache_beam/examples/wordcount.py",>
line 114, in run
    result = p.run()
  File "<https://builds.apache.org/job/beam_PostCommit_Py_ValCont/ws/src/sdks/python/apache_beam/pipeline.py",>
line 406, in run
    self._options).run(False)
  File "<https://builds.apache.org/job/beam_PostCommit_Py_ValCont/ws/src/sdks/python/apache_beam/pipeline.py",>
line 419, in run
    return self.runner.run_pipeline(self, self._options)
  File "<https://builds.apache.org/job/beam_PostCommit_Py_ValCont/ws/src/sdks/python/apache_beam/runners/dataflow/test_dataflow_runner.py",>
line 71, in run_pipeline
    self.result.cancel()
  File "<https://builds.apache.org/job/beam_PostCommit_Py_ValCont/ws/src/sdks/python/apache_beam/runners/dataflow/dataflow_runner.py",>
line 1360, in cancel
    return self.state
  File "<https://builds.apache.org/job/beam_PostCommit_Py_ValCont/ws/src/sdks/python/apache_beam/runners/dataflow/dataflow_runner.py",>
line 1300, in state
    self._update_job()
  File "<https://builds.apache.org/job/beam_PostCommit_Py_ValCont/ws/src/sdks/python/apache_beam/runners/dataflow/dataflow_runner.py",>
line 1256, in _update_job
    self._job = self._runner.dataflow_client.get_job(self.job_id())
  File "<https://builds.apache.org/job/beam_PostCommit_Py_ValCont/ws/src/sdks/python/apache_beam/utils/retry.py",>
line 197, in wrapper
    return fun(*args, **kwargs)
  File "<https://builds.apache.org/job/beam_PostCommit_Py_ValCont/ws/src/sdks/python/apache_beam/runners/dataflow/internal/apiclient.py",>
line 668, in get_job
    response = self._client.projects_locations_jobs.Get(request)
  File "<https://builds.apache.org/job/beam_PostCommit_Py_ValCont/ws/src/sdks/python/apache_beam/runners/dataflow/internal/clients/dataflow/dataflow_v1b3_client.py",>
line 689, in Get
    config, request, global_params=global_params)
  File "<https://builds.apache.org/job/beam_PostCommit_Py_ValCont/ws/src/sdks/python/container/venv/python/local/lib/python2.7/site-packages/apitools/base/py/base_api.py",>
line 729, in _RunMethod
    http, http_request, **opts)
  File "<https://builds.apache.org/job/beam_PostCommit_Py_ValCont/ws/src/sdks/python/container/venv/python/local/lib/python2.7/site-packages/apitools/base/py/http_wrapper.py",>
line 346, in MakeRequest
    check_response_func=check_response_func)
  File "<https://builds.apache.org/job/beam_PostCommit_Py_ValCont/ws/src/sdks/python/container/venv/python/local/lib/python2.7/site-packages/apitools/base/py/http_wrapper.py",>
line 396, in _MakeRequestNoRetry
    redirections=redirections, connection_type=connection_type)
  File "<https://builds.apache.org/job/beam_PostCommit_Py_ValCont/ws/src/sdks/python/container/venv/python/local/lib/python2.7/site-packages/oauth2client/transport.py",>
line 169, in new_request
    redirections, connection_type)
  File "<https://builds.apache.org/job/beam_PostCommit_Py_ValCont/ws/src/sdks/python/container/venv/python/local/lib/python2.7/site-packages/oauth2client/transport.py",>
line 169, in new_request
    redirections, connection_type)
  File "<https://builds.apache.org/job/beam_PostCommit_Py_ValCont/ws/src/sdks/python/container/venv/python/local/lib/python2.7/site-packages/httplib2/__init__.py",>
line 2133, in request
    cachekey,
  File "<https://builds.apache.org/job/beam_PostCommit_Py_ValCont/ws/src/sdks/python/container/venv/python/local/lib/python2.7/site-packages/httplib2/__init__.py",>
line 1796, in _request
    conn, request_uri, method, body, headers
  File "<https://builds.apache.org/job/beam_PostCommit_Py_ValCont/ws/src/sdks/python/container/venv/python/local/lib/python2.7/site-packages/httplib2/__init__.py",>
line 1737, in _conn_request
    response = conn.getresponse()
  File "/usr/lib/python2.7/httplib.py", line 1136, in getresponse
    response.begin()
  File "/usr/lib/python2.7/httplib.py", line 485, in begin
    self.msg = HTTPMessage(self.fp, 0)
  File "/usr/lib/python2.7/mimetools.py", line 25, in __init__
    rfc822.Message.__init__(self, fp, seekable)
  File "/usr/lib/python2.7/rfc822.py", line 108, in __init__
    self.readheaders()
  File "/usr/lib/python2.7/httplib.py", line 319, in readheaders
    line = self.fp.readline(_MAXLINE + 1)
  File "/usr/lib/python2.7/socket.py", line 480, in readline
    data = self._sock.recv(self._rbufsize)
  File "/usr/lib/python2.7/ssl.py", line 756, in recv
    return self.read(buflen)
  File "/usr/lib/python2.7/ssl.py", line 632, in read
    def read(self, len=1024, buffer=None):
  File "<https://builds.apache.org/job/beam_PostCommit_Py_ValCont/ws/src/sdks/python/container/venv/python/local/lib/python2.7/site-packages/nose/plugins/multiprocess.py",>
line 276, in signalhandler
    raise TimedOutException()
TimedOutException: 'test_wordcount_fnapi_it (apache_beam.examples.wordcount_it_test.WordCountIT)'

======================================================================
ERROR: test_metrics_fnapi_it (apache_beam.runners.dataflow.dataflow_exercise_metrics_pipeline_test.ExerciseMetricsPipelineTest)
----------------------------------------------------------------------
Traceback (most recent call last):
  File "<https://builds.apache.org/job/beam_PostCommit_Py_ValCont/ws/src/sdks/python/container/venv/python/local/lib/python2.7/site-packages/nose/plugins/multiprocess.py",>
line 812, in run
    test(orig)
  File "<https://builds.apache.org/job/beam_PostCommit_Py_ValCont/ws/src/sdks/python/container/venv/python/local/lib/python2.7/site-packages/nose/case.py",>
line 45, in __call__
    return self.run(*arg, **kwarg)
  File "<https://builds.apache.org/job/beam_PostCommit_Py_ValCont/ws/src/sdks/python/container/venv/python/local/lib/python2.7/site-packages/nose/case.py",>
line 133, in run
    self.runTest(result)
  File "<https://builds.apache.org/job/beam_PostCommit_Py_ValCont/ws/src/sdks/python/container/venv/python/local/lib/python2.7/site-packages/nose/case.py",>
line 151, in runTest
    test(result)
  File "/usr/lib/python2.7/unittest/case.py", line 393, in __call__
    return self.run(*args, **kwds)
  File "/usr/lib/python2.7/unittest/case.py", line 329, in run
    testMethod()
  File "<https://builds.apache.org/job/beam_PostCommit_Py_ValCont/ws/src/sdks/python/apache_beam/runners/dataflow/dataflow_exercise_metrics_pipeline_test.py",>
line 60, in test_metrics_fnapi_it
    result = self.run_pipeline(experiment='beam_fn_api')
  File "<https://builds.apache.org/job/beam_PostCommit_Py_ValCont/ws/src/sdks/python/apache_beam/runners/dataflow/dataflow_exercise_metrics_pipeline_test.py",>
line 48, in run_pipeline
    return dataflow_exercise_metrics_pipeline.apply_and_run(p)
  File "<https://builds.apache.org/job/beam_PostCommit_Py_ValCont/ws/src/sdks/python/apache_beam/runners/dataflow/dataflow_exercise_metrics_pipeline.py",>
line 197, in apply_and_run
    result = pipeline.run()
  File "<https://builds.apache.org/job/beam_PostCommit_Py_ValCont/ws/src/sdks/python/apache_beam/pipeline.py",>
line 404, in run
    self.to_runner_api(use_fake_coders=True),
  File "<https://builds.apache.org/job/beam_PostCommit_Py_ValCont/ws/src/sdks/python/apache_beam/pipeline.py",>
line 656, in to_runner_api
    root_transform_id = context.transforms.get_id(self._root_transform())
  File "<https://builds.apache.org/job/beam_PostCommit_Py_ValCont/ws/src/sdks/python/apache_beam/runners/pipeline_context.py",>
line 84, in get_id
    self._id_to_proto[id] = obj.to_runner_api(self._pipeline_context)
  File "<https://builds.apache.org/job/beam_PostCommit_Py_ValCont/ws/src/sdks/python/apache_beam/pipeline.py",>
line 877, in to_runner_api
    for part in self.parts],
  File "<https://builds.apache.org/job/beam_PostCommit_Py_ValCont/ws/src/sdks/python/apache_beam/runners/pipeline_context.py",>
line 84, in get_id
    self._id_to_proto[id] = obj.to_runner_api(self._pipeline_context)
  File "<https://builds.apache.org/job/beam_PostCommit_Py_ValCont/ws/src/sdks/python/apache_beam/pipeline.py",>
line 877, in to_runner_api
    for part in self.parts],
  File "<https://builds.apache.org/job/beam_PostCommit_Py_ValCont/ws/src/sdks/python/apache_beam/runners/pipeline_context.py",>
line 84, in get_id
    self._id_to_proto[id] = obj.to_runner_api(self._pipeline_context)
  File "<https://builds.apache.org/job/beam_PostCommit_Py_ValCont/ws/src/sdks/python/apache_beam/pipeline.py",>
line 881, in to_runner_api
    for tag, out in sorted(self.named_outputs().items())},
  File "<https://builds.apache.org/job/beam_PostCommit_Py_ValCont/ws/src/sdks/python/apache_beam/pipeline.py",>
line 881, in <dictcomp>
    for tag, out in sorted(self.named_outputs().items())},
  File "<https://builds.apache.org/job/beam_PostCommit_Py_ValCont/ws/src/sdks/python/apache_beam/runners/pipeline_context.py",>
line 84, in get_id
    self._id_to_proto[id] = obj.to_runner_api(self._pipeline_context)
  File "<https://builds.apache.org/job/beam_PostCommit_Py_ValCont/ws/src/sdks/python/apache_beam/pvalue.py",>
line 151, in to_runner_api
    self.windowing))
  File "<https://builds.apache.org/job/beam_PostCommit_Py_ValCont/ws/src/sdks/python/apache_beam/runners/pipeline_context.py",>
line 84, in get_id
    self._id_to_proto[id] = obj.to_runner_api(self._pipeline_context)
  File "<https://builds.apache.org/job/beam_PostCommit_Py_ValCont/ws/src/sdks/python/apache_beam/transforms/core.py",>
line 2017, in to_runner_api
    def to_runner_api(self, context):
  File "<https://builds.apache.org/job/beam_PostCommit_Py_ValCont/ws/src/sdks/python/container/venv/python/local/lib/python2.7/site-packages/nose/plugins/multiprocess.py",>
line 276, in signalhandler
    raise TimedOutException()
TimedOutException: 'test_metrics_fnapi_it (apache_beam.runners.dataflow.dataflow_exercise_metrics_pipeline_test.ExerciseMetricsPipelineTest)'

----------------------------------------------------------------------
XML: <https://builds.apache.org/job/beam_PostCommit_Py_ValCont/ws/src/sdks/python/nosetests.xml>
----------------------------------------------------------------------
Ran 2 tests in 903.128s

FAILED (errors=2)
cleanup_container
Untagged: us.gcr.io/apache-beam-testing/jenkins/python:20190609-060011
Untagged: us.gcr.io/apache-beam-testing/jenkins/python@sha256:2f762c17f19dd37631b1adcbc658e830e895c849c712f395eae13b5f07a4c52d
Deleted: sha256:470ac1dd868beb08a44b283e5f8976d6bd49b2bbf763f5829f6c36afa466d7a7
Deleted: sha256:f7edada9566f3d2bcf1df05144b14b294f61ae9b0c57f7215ed4796a6bdcce67
Deleted: sha256:93a3c41b72a4e8fe71da7fc2b3756e6511c53b66900998675e210f324ed616b0
Deleted: sha256:a532b7dc19746e236b7d27b108200347924375bd31c016e9123928127b3131e3
Deleted: sha256:7cccf06eae1bd5408755593708eaf67260af023e7bc9436ebb46835383b88271
Deleted: sha256:81c758d02f8340ad95c78582c3669df942f44f3adb8e5fc0b20baefc6e1bbe45
Deleted: sha256:7d77f334381e02255ba63e0a9f30c3b88518e2143b4be6e049732e196a4f5506
Deleted: sha256:04a395fbb8fd0cc12713963a18d001898721f4033519bc71a63b7c5a3ff96251
Deleted: sha256:61e681ede6aba9b412d6a41971e3d2a92036b77e9c7439ccee2165d5cee82c2e
Deleted: sha256:03637bdbd3c99d5b4ff0185ccb221f2646a717124821e43ef2c9af1e1ceb5289
Deleted: sha256:4ac39b4866943b3a3fa85eadee2d1963cdd03d1f00e05b8e8e96c06c65b889a5
Deleted: sha256:7f3be155d28dcde1fd276b1e42b4f295f13bd851acc58711e7248b459c22bddb
Deleted: sha256:7d83980479c206a3a8528fff3e8d78174114f64d33ebba6ccae8c82c363173ce
Deleted: sha256:8b58217671a65b7f20f12ed2061b8d34ae4bd5536c5889e7a2ff0cc92493f54f
Digests:
- us.gcr.io/apache-beam-testing/jenkins/python@sha256:2f762c17f19dd37631b1adcbc658e830e895c849c712f395eae13b5f07a4c52d
  Associated tags:
 - 20190609-060011
Tags:
- us.gcr.io/apache-beam-testing/jenkins/python:20190609-060011
Deleted [us.gcr.io/apache-beam-testing/jenkins/python:20190609-060011].
Deleted [us.gcr.io/apache-beam-testing/jenkins/python@sha256:2f762c17f19dd37631b1adcbc658e830e895c849c712f395eae13b5f07a4c52d].
Removed the container
Build step 'Execute shell' marked build as failure

---------------------------------------------------------------------
To unsubscribe, e-mail: builds-unsubscribe@beam.apache.org
For additional commands, e-mail: builds-help@beam.apache.org


Mime
View raw message