beam-builds mailing list archives

Site index · List index
Message view « Date » · « Thread »
Top « Date » · « Thread »
From Apache Jenkins Server <jenk...@builds.apache.org>
Subject Build failed in Jenkins: beam_PostCommit_Python_VR_Spark #258
Date Sun, 30 Jun 2019 12:03:32 GMT
See <https://builds.apache.org/job/beam_PostCommit_Python_VR_Spark/258/display/redirect>

------------------------------------------
[...truncated 578.44 KB...]
----------------------------------------------------------------------
Traceback (most recent call last):
  File "apache_beam/runners/portability/fn_api_runner_test.py", line 267, in test_multimap_side_input_type_coercion
    equal_to([('a', [1, 3]), ('b', [2])]))
  File "apache_beam/pipeline.py", line 426, in __exit__
    self.run().wait_until_finish()
  File "apache_beam/runners/portability/portable_runner.py", line 454, in wait_until_finish
    self._job_id, self._state, self._last_error_message()))
RuntimeError: Pipeline test_multimap_side_input_type_coercion_1561896199.24_b6424dee-d9e4-4214-9e2f-02429ae76920
failed in state FAILED: java.lang.ClassCastException: org.apache.beam.sdk.coders.LengthPrefixCoder
cannot be cast to org.apache.beam.sdk.coders.KvCoder

======================================================================
ERROR: test_pardo (__main__.SparkRunnerTest)
----------------------------------------------------------------------
Traceback (most recent call last):
  File "apache_beam/runners/portability/fn_api_runner_test.py", line 104, in test_pardo
    assert_that(res, equal_to(['aax', 'bcbcx']))
  File "apache_beam/pipeline.py", line 426, in __exit__
    self.run().wait_until_finish()
  File "apache_beam/runners/portability/portable_runner.py", line 454, in wait_until_finish
    self._job_id, self._state, self._last_error_message()))
RuntimeError: Pipeline test_pardo_1561896203.76_3313bfc1-8790-4423-8fb1-e2d1c0a3f4ce failed
in state FAILED: java.lang.ClassCastException: org.apache.beam.sdk.coders.LengthPrefixCoder
cannot be cast to org.apache.beam.sdk.coders.KvCoder

======================================================================
ERROR: test_pardo_side_and_main_outputs (__main__.SparkRunnerTest)
----------------------------------------------------------------------
Traceback (most recent call last):
  File "apache_beam/runners/portability/fn_api_runner_test.py", line 176, in test_pardo_side_and_main_outputs
    assert_that(unnamed.odd, equal_to([1, 3]), label='unnamed.odd')
  File "apache_beam/pipeline.py", line 426, in __exit__
    self.run().wait_until_finish()
  File "apache_beam/runners/portability/portable_runner.py", line 454, in wait_until_finish
    self._job_id, self._state, self._last_error_message()))
RuntimeError: Pipeline test_pardo_side_and_main_outputs_1561896204.31_3669b4d7-8684-4609-adb2-693ec5b0f4ad
failed in state FAILED: java.lang.ClassCastException: org.apache.beam.sdk.coders.LengthPrefixCoder
cannot be cast to org.apache.beam.sdk.coders.KvCoder

======================================================================
ERROR: test_pardo_side_inputs (__main__.SparkRunnerTest)
----------------------------------------------------------------------
Traceback (most recent call last):
  File "apache_beam/runners/portability/fn_api_runner_test.py", line 187, in test_pardo_side_inputs
    ('a', 'y'), ('b', 'y'), ('c', 'y')]))
  File "apache_beam/pipeline.py", line 426, in __exit__
    self.run().wait_until_finish()
  File "apache_beam/runners/portability/portable_runner.py", line 454, in wait_until_finish
    self._job_id, self._state, self._last_error_message()))
RuntimeError: Pipeline test_pardo_side_inputs_1561896205.66_30684908-9a12-4850-a9db-8f0e09d4300d
failed in state FAILED: java.lang.ClassCastException: org.apache.beam.sdk.coders.LengthPrefixCoder
cannot be cast to org.apache.beam.sdk.coders.KvCoder

======================================================================
ERROR: test_pardo_side_outputs (__main__.SparkRunnerTest)
----------------------------------------------------------------------
Traceback (most recent call last):
  File "apache_beam/runners/portability/fn_api_runner_test.py", line 158, in test_pardo_side_outputs
    assert_that(xy.y, equal_to(['y', 'xy']), label='y')
  File "apache_beam/pipeline.py", line 426, in __exit__
    self.run().wait_until_finish()
  File "apache_beam/runners/portability/portable_runner.py", line 454, in wait_until_finish
    self._job_id, self._state, self._last_error_message()))
RuntimeError: Pipeline test_pardo_side_outputs_1561896206.16_f3a99206-511d-4265-b540-8334b45e149f
failed in state FAILED: java.lang.ClassCastException: org.apache.beam.sdk.coders.LengthPrefixCoder
cannot be cast to org.apache.beam.sdk.coders.KvCoder

======================================================================
ERROR: test_pardo_state_only (__main__.SparkRunnerTest)
----------------------------------------------------------------------
Traceback (most recent call last):
  File "apache_beam/runners/portability/fn_api_runner_test.py", line 308, in test_pardo_state_only
    equal_to(expected))
  File "apache_beam/pipeline.py", line 426, in __exit__
    self.run().wait_until_finish()
  File "apache_beam/runners/portability/portable_runner.py", line 454, in wait_until_finish
    self._job_id, self._state, self._last_error_message()))
RuntimeError: Pipeline test_pardo_state_only_1561896206.67_842e412a-e762-4aa4-a7a4-932790a77575
failed in state FAILED: java.lang.ClassCastException: org.apache.beam.sdk.coders.LengthPrefixCoder
cannot be cast to org.apache.beam.sdk.coders.KvCoder

======================================================================
ERROR: test_pardo_state_timers (__main__.SparkRunnerTest)
----------------------------------------------------------------------
Traceback (most recent call last):
  File "apache_beam/runners/portability/fn_api_runner_test.py", line 401, in test_pardo_state_timers
    self._run_pardo_state_timers(False)
  File "apache_beam/runners/portability/fn_api_runner_test.py", line 461, in _run_pardo_state_timers
    assert_that(actual, is_buffered_correctly)
  File "apache_beam/pipeline.py", line 426, in __exit__
    self.run().wait_until_finish()
  File "apache_beam/runners/portability/portable_runner.py", line 454, in wait_until_finish
    self._job_id, self._state, self._last_error_message()))
RuntimeError: Pipeline test_pardo_state_timers_1561896207.04_58602f18-c4ff-4ac3-9814-7d94c57fe31d
failed in state FAILED: java.lang.ClassCastException: org.apache.beam.sdk.coders.LengthPrefixCoder
cannot be cast to org.apache.beam.sdk.coders.KvCoder

======================================================================
ERROR: test_pardo_timers (__main__.SparkRunnerTest)
----------------------------------------------------------------------
Traceback (most recent call last):
  File "apache_beam/runners/portability/fn_api_runner_test.py", line 361, in test_pardo_timers
    assert_that(actual, equal_to(expected))
  File "apache_beam/pipeline.py", line 426, in __exit__
    self.run().wait_until_finish()
  File "apache_beam/runners/portability/portable_runner.py", line 454, in wait_until_finish
    self._job_id, self._state, self._last_error_message()))
RuntimeError: Pipeline test_pardo_timers_1561896207.52_f08fb113-e499-4b56-bcf9-1bc163bff045
failed in state FAILED: java.lang.ClassCastException: org.apache.beam.sdk.coders.LengthPrefixCoder
cannot be cast to org.apache.beam.sdk.coders.KvCoder

======================================================================
ERROR: test_pardo_unfusable_side_inputs (__main__.SparkRunnerTest)
----------------------------------------------------------------------
Traceback (most recent call last):
  File "apache_beam/runners/portability/fn_api_runner_test.py", line 277, in test_pardo_unfusable_side_inputs
    equal_to([('a', 'a'), ('a', 'b'), ('b', 'a'), ('b', 'b')]))
  File "apache_beam/pipeline.py", line 426, in __exit__
    self.run().wait_until_finish()
  File "apache_beam/runners/portability/portable_runner.py", line 454, in wait_until_finish
    self._job_id, self._state, self._last_error_message()))
RuntimeError: Pipeline test_pardo_unfusable_side_inputs_1561896207.89_4f182e93-5c7a-4ca6-820f-324460367a09
failed in state FAILED: java.lang.ClassCastException: org.apache.beam.sdk.coders.LengthPrefixCoder
cannot be cast to org.apache.beam.sdk.coders.KvCoder

======================================================================
ERROR: test_pardo_windowed_side_inputs (__main__.SparkRunnerTest)
----------------------------------------------------------------------
Traceback (most recent call last):
  File "apache_beam/runners/portability/fn_api_runner_test.py", line 214, in test_pardo_windowed_side_inputs
    label='windowed')
  File "apache_beam/pipeline.py", line 426, in __exit__
    self.run().wait_until_finish()
  File "apache_beam/runners/portability/portable_runner.py", line 454, in wait_until_finish
    self._job_id, self._state, self._last_error_message()))
RuntimeError: Pipeline test_pardo_windowed_side_inputs_1561896208.25_e9a1e307-96dd-438c-a1bf-54151e806272
failed in state FAILED: java.lang.ClassCastException: org.apache.beam.sdk.coders.LengthPrefixCoder
cannot be cast to org.apache.beam.sdk.coders.KvCoder

======================================================================
ERROR: test_read (__main__.SparkRunnerTest)
----------------------------------------------------------------------
Traceback (most recent call last):
  File "apache_beam/runners/portability/fn_api_runner_test.py", line 592, in test_read
    equal_to(['a', 'b', 'c']))
  File "apache_beam/pipeline.py", line 426, in __exit__
    self.run().wait_until_finish()
  File "apache_beam/runners/portability/portable_runner.py", line 454, in wait_until_finish
    self._job_id, self._state, self._last_error_message()))
RuntimeError: Pipeline test_read_1561896208.64_860d306b-8763-448f-ac0f-2cf5063e8d89 failed
in state FAILED: java.lang.ClassCastException: org.apache.beam.sdk.coders.LengthPrefixCoder
cannot be cast to org.apache.beam.sdk.coders.KvCoder

======================================================================
ERROR: test_reshuffle (__main__.SparkRunnerTest)
----------------------------------------------------------------------
Traceback (most recent call last):
  File "apache_beam/runners/portability/fn_api_runner_test.py", line 562, in test_reshuffle
    equal_to([1, 2, 3]))
  File "apache_beam/pipeline.py", line 426, in __exit__
    self.run().wait_until_finish()
  File "apache_beam/runners/portability/portable_runner.py", line 454, in wait_until_finish
    self._job_id, self._state, self._last_error_message()))
RuntimeError: Pipeline test_reshuffle_1561896208.98_a5294164-bac6-45ae-bb8d-b177c76d3353 failed
in state FAILED: java.lang.ClassCastException: org.apache.beam.sdk.coders.LengthPrefixCoder
cannot be cast to org.apache.beam.sdk.coders.KvCoder

======================================================================
ERROR: test_sdf_wrap_range_source (__main__.SparkRunnerTest)
----------------------------------------------------------------------
Traceback (most recent call last):
  File "apache_beam/runners/portability/fn_api_runner_test.py", line 548, in test_sdf_wrap_range_source
    self._run_sdf_wrapper_pipeline(RangeSource(0, 4), [0, 1, 2, 3])
  File "apache_beam/runners/portability/fn_api_runner_test.py", line 534, in _run_sdf_wrapper_pipeline
    p | beam.io.Read(source)
  File "apache_beam/pipeline.py", line 426, in __exit__
    self.run().wait_until_finish()
  File "apache_beam/runners/portability/portable_runner.py", line 454, in wait_until_finish
    self._job_id, self._state, self._last_error_message()))
RuntimeError: Pipeline test_sdf_wrap_range_source_1561896209.39_ae10107a-e642-440f-aad1-8f8db4510e6d
failed in state FAILED: java.lang.ClassCastException: org.apache.beam.sdk.coders.LengthPrefixCoder
cannot be cast to org.apache.beam.sdk.coders.KvCoder

======================================================================
ERROR: test_sdf_wrapper_overrides_read (__main__.SparkRunnerTest)
----------------------------------------------------------------------
Traceback (most recent call last):
  File "<https://builds.apache.org/job/beam_PostCommit_Python_VR_Spark/ws/src/build/gradleenv/1922375555/local/lib/python2.7/site-packages/mock-2.0.0-py2.7.egg/mock/mock.py",>
line 1305, in patched
    return func(*args, **keywargs)
  File "apache_beam/runners/portability/fn_api_runner_test.py", line 545, in test_sdf_wrapper_overrides_read
    self._run_sdf_wrapper_pipeline(RangeSource(0, 4), ['1'])
  File "apache_beam/runners/portability/fn_api_runner_test.py", line 534, in _run_sdf_wrapper_pipeline
    p | beam.io.Read(source)
  File "apache_beam/pipeline.py", line 426, in __exit__
    self.run().wait_until_finish()
  File "apache_beam/runners/portability/portable_runner.py", line 454, in wait_until_finish
    self._job_id, self._state, self._last_error_message()))
RuntimeError: Pipeline test_sdf_wrapper_overrides_read_1561896209.57_55f2dfdd-3f25-4a30-862d-d7752b8db45f
failed in state FAILED: java.lang.ClassCastException: org.apache.beam.sdk.coders.LengthPrefixCoder
cannot be cast to org.apache.beam.sdk.coders.KvCoder

======================================================================
ERROR: test_windowed_pardo_state_timers (__main__.SparkRunnerTest)
----------------------------------------------------------------------
Traceback (most recent call last):
  File "apache_beam/runners/portability/fn_api_runner_test.py", line 404, in test_windowed_pardo_state_timers
    self._run_pardo_state_timers(True)
  File "apache_beam/runners/portability/fn_api_runner_test.py", line 461, in _run_pardo_state_timers
    assert_that(actual, is_buffered_correctly)
  File "apache_beam/pipeline.py", line 426, in __exit__
    self.run().wait_until_finish()
  File "apache_beam/runners/portability/portable_runner.py", line 454, in wait_until_finish
    self._job_id, self._state, self._last_error_message()))
RuntimeError: Pipeline test_windowed_pardo_state_timers_1561896209.75_b286c6b8-9f0a-4577-bb25-b4a3f0ab3bb8
failed in state FAILED: java.lang.ClassCastException: org.apache.beam.sdk.coders.LengthPrefixCoder
cannot be cast to org.apache.beam.sdk.coders.KvCoder

======================================================================
ERROR: test_windowing (__main__.SparkRunnerTest)
----------------------------------------------------------------------
Traceback (most recent call last):
  File "apache_beam/runners/portability/fn_api_runner_test.py", line 604, in test_windowing
    assert_that(res, equal_to([('k', [1, 2]), ('k', [100, 101, 102])]))
  File "apache_beam/pipeline.py", line 426, in __exit__
    self.run().wait_until_finish()
  File "apache_beam/runners/portability/portable_runner.py", line 454, in wait_until_finish
    self._job_id, self._state, self._last_error_message()))
RuntimeError: Pipeline test_windowing_1561896210.14_53cf770e-c12c-46ce-8c87-ae50621130c0 failed
in state FAILED: java.lang.ClassCastException: org.apache.beam.sdk.coders.LengthPrefixCoder
cannot be cast to org.apache.beam.sdk.coders.KvCoder

======================================================================
FAIL: test_assert_that (__main__.SparkRunnerTest)
----------------------------------------------------------------------
Traceback (most recent call last):
  File "apache_beam/runners/portability/fn_api_runner_test.py", line 92, in test_assert_that
    assert_that(p | beam.Create(['a', 'b']), equal_to(['a']))
AssertionError: "Failed assert" does not match "Pipeline test_assert_that_1561896169.63_54230069-5b95-4de8-92e7-d4d1c4d7ae20
failed in state FAILED: java.lang.ClassCastException: org.apache.beam.sdk.coders.LengthPrefixCoder
cannot be cast to org.apache.beam.sdk.coders.KvCoder"

======================================================================
FAIL: test_error_message_includes_stage (__main__.SparkRunnerTest)
----------------------------------------------------------------------
Traceback (most recent call last):
  File "apache_beam/runners/portability/fn_api_runner_test.py", line 638, in test_error_message_includes_stage
    self.assertIn('StageC', message)
AssertionError: 'StageC' not found in u'Pipeline test_error_message_includes_stage_1561896176.49_0a8597e7-580f-4cff-b502-8323784a649a
failed in state FAILED: java.lang.ClassCastException: org.apache.beam.sdk.coders.LengthPrefixCoder
cannot be cast to org.apache.beam.sdk.coders.KvCoder'

----------------------------------------------------------------------
Ran 38 tests in 41.115s

FAILED (failures=2, errors=22, skipped=10)

> Task :sdks:python:sparkValidatesRunner FAILED

FAILURE: Build failed with an exception.

* Where:
Build file '<https://builds.apache.org/job/beam_PostCommit_Python_VR_Spark/ws/src/sdks/python/build.gradle'>
line: 251

* What went wrong:
Execution failed for task ':sdks:python:sparkValidatesRunner'.
> Process 'command 'sh'' finished with non-zero exit value 1

* Try:
Run with --stacktrace option to get the stack trace. Run with --info or --debug option to
get more log output. Run with --scan to get full insights.

* Get more help at https://help.gradle.org

Deprecated Gradle features were used in this build, making it incompatible with Gradle 6.0.
Use '--warning-mode all' to show the individual deprecation warnings.
See https://docs.gradle.org/5.2.1/userguide/command_line_interface.html#sec:command_line_warnings

BUILD FAILED in 3m 9s
60 actionable tasks: 47 executed, 13 from cache

Publishing build scan...
https://gradle.com/s/xhuxmxueb7evq

Build step 'Invoke Gradle script' changed build result to FAILURE
Build step 'Invoke Gradle script' marked build as failure

---------------------------------------------------------------------
To unsubscribe, e-mail: builds-unsubscribe@beam.apache.org
For additional commands, e-mail: builds-help@beam.apache.org


Mime
View raw message