axis-java-dev mailing list archives

Site index · List index
Message view « Date » · « Thread »
Top « Date » · « Thread »
From Apache Jenkins Server <jenk...@builds.apache.org>
Subject Build failed in Jenkins: rampart-1.7 #77
Date Sun, 30 Jul 2017 16:52:00 GMT
See <https://builds.apache.org/job/rampart-1.7/77/display/redirect?page=changes>

Changes:

[veithen] Merge r1803424 to the 1.7 branch.

------------------------------------------
[...truncated 854.48 KB...]
[JettyServer] - Starting http connector on port: 5555
[JettyServer] - Stop called
Tests run: 1, Failures: 0, Errors: 0, Skipped: 0, Time elapsed: 0.801 sec
Running org.apache.rahas.RahasSAMLTokenUTForBearerV1205Test
[JettyServer] - Starting http connector on port: 5555
[JettyServer] - Stop called
Tests run: 1, Failures: 0, Errors: 0, Skipped: 0, Time elapsed: 0.746 sec
Running org.apache.rahas.RahasSAMLTokenUTForHoKV1205Test
[JettyServer] - Starting http connector on port: 5555
[JettyServer] - Stop called
Tests run: 1, Failures: 0, Errors: 0, Skipped: 0, Time elapsed: 0.746 sec
Running org.apache.rahas.RahasSAMLTokenV1205Test
[JettyServer] - Starting http connector on port: 5555
[JettyServer] - Stop called
Tests run: 1, Failures: 0, Errors: 0, Skipped: 0, Time elapsed: 0.763 sec
Running org.apache.rahas.RahasSAML2TokenCertForHoKTest
[JettyServer] - Starting http connector on port: 5555
Running SAML2 Test with Public Key as the KeyType in RST.
[JettyServer] - Stop called
Tests run: 1, Failures: 0, Errors: 0, Skipped: 0, Time elapsed: 0.778 sec
Running org.apache.rahas.RahasSAML2TokenTest
[JettyServer] - Starting http connector on port: 5555
 Running SAML2 Test with Symmetric Key As the KeyType in RST. 
[JettyServer] - Stop called
Tests run: 1, Failures: 0, Errors: 0, Skipped: 0, Time elapsed: 0.781 sec
Running org.apache.rahas.RahasSAMLTokenUTForHoKTest
[JettyServer] - Starting http connector on port: 5555
[JettyServer] - Stop called
Tests run: 1, Failures: 0, Errors: 0, Skipped: 0, Time elapsed: 0.856 sec
Running org.apache.rahas.RahasSAMLTokenCertForHoKV1205Test
[JettyServer] - Starting http connector on port: 5555
[JettyServer] - Stop called
Tests run: 1, Failures: 0, Errors: 0, Skipped: 0, Time elapsed: 0.763 sec
Running org.apache.rahas.RahasSAML2TokenUTForBearerTest
[JettyServer] - Starting http connector on port: 5555
[JettyServer] - Stop called
Tests run: 1, Failures: 0, Errors: 0, Skipped: 0, Time elapsed: 0.73 sec
Running org.apache.rahas.RahasSAMLTokenAttributeTest
[JettyServer] - Starting http connector on port: 5555
[JettyServer] - Stop called
Tests run: 1, Failures: 0, Errors: 0, Skipped: 0, Time elapsed: 0.715 sec
Running org.apache.rahas.RahasSAMLTokenCertForHoKTest
[JettyServer] - Starting http connector on port: 5555
[JettyServer] - Stop called
Tests run: 1, Failures: 0, Errors: 0, Skipped: 0, Time elapsed: 0.851 sec

Results :

Tests run: 13, Failures: 0, Errors: 0, Skipped: 0

[JENKINS] Recording test results
[INFO] 
[INFO] --- build-helper-maven-plugin:1.7:attach-artifact (attach-jacoco-exec) @ rampart-integration
---
[INFO] 
[INFO] --- maven-jar-plugin:2.5:jar (default-jar) @ rampart-integration ---
[INFO] Building jar: <https://builds.apache.org/job/rampart-1.7/ws/1_7/modules/rampart-integration/target/rampart-integration-1.7.1-SNAPSHOT.jar>
[INFO] 
[INFO] --- maven-site-plugin:3.4:attach-descriptor (attach-descriptor) @ rampart-integration
---
[INFO] 
[INFO] --- maven-assembly-plugin:2.6:single (source-release-assembly) @ rampart-integration
---
[INFO] Assemblies have been skipped per configuration of the skipAssembly parameter.
[INFO] 
[INFO] --- maven-source-plugin:2.4:jar-no-fork (source-jars) @ rampart-integration ---
[INFO] Building jar: <https://builds.apache.org/job/rampart-1.7/ws/1_7/modules/rampart-integration/target/rampart-integration-1.7.1-SNAPSHOT-sources.jar>
[INFO] 
[INFO] --- maven-javadoc-plugin:2.10.3:jar (attach-javadocs) @ rampart-integration ---
[INFO] The goal 'org.apache.maven.plugins:maven-javadoc-plugin:2.10.3:javadoc' has not been
previously called for the module: 'org.apache.rampart:rampart:mar:1.7.1-SNAPSHOT'. Trying
to invoke it...
[WARNING] Creating fake javadoc directory to prevent repeated invocations: <https://builds.apache.org/job/rampart-1.7/ws/1_7/modules/rampart-mar/target/apidocs>
[INFO] The goal 'org.apache.maven.plugins:maven-javadoc-plugin:2.10.3:javadoc' has not been
previously called for the module: 'org.apache.rampart:rahas:mar:1.7.1-SNAPSHOT'. Trying to
invoke it...
[WARNING] Creating fake javadoc directory to prevent repeated invocations: <https://builds.apache.org/job/rampart-1.7/ws/1_7/modules/rampart-trust-mar/target/apidocs>
[ERROR] Error fetching link: <https://builds.apache.org/job/rampart-1.7/ws/1_7/modules/rampart-mar/target/apidocs/package-list.>
Ignored it.
[ERROR] Error fetching link: <https://builds.apache.org/job/rampart-1.7/ws/1_7/modules/rampart-trust-mar/target/apidocs/package-list.>
Ignored it.
[INFO] 
Loading source files for package org.apache.rampart...
Loading source files for package org.apache.rahas...
Loading source files for package org.apache.axis2.integration...
Constructing Javadoc information...
Standard Doclet version 1.8.0_131
Building tree for all the packages and classes...
Generating <https://builds.apache.org/job/rampart-1.7/ws/1_7/modules/rampart-integration/target/apidocs/org/apache/rampart/PWCallback.html...>
Generating <https://builds.apache.org/job/rampart-1.7/ws/1_7/modules/rampart-integration/target/apidocs/org/apache/rampart/RampartConfigUpdater.html...>
Generating <https://builds.apache.org/job/rampart-1.7/ws/1_7/modules/rampart-integration/target/apidocs/org/apache/rampart/Service.html...>
Generating <https://builds.apache.org/job/rampart-1.7/ws/1_7/modules/rampart-integration/target/apidocs/org/apache/rahas/PWCallback.html...>
Generating <https://builds.apache.org/job/rampart-1.7/ws/1_7/modules/rampart-integration/target/apidocs/org/apache/rahas/Service.html...>
Generating <https://builds.apache.org/job/rampart-1.7/ws/1_7/modules/rampart-integration/target/apidocs/org/apache/rahas/TestClient.html...>
Generating <https://builds.apache.org/job/rampart-1.7/ws/1_7/modules/rampart-integration/target/apidocs/org/apache/axis2/integration/JettyServer.html...>
Generating <https://builds.apache.org/job/rampart-1.7/ws/1_7/modules/rampart-integration/target/apidocs/org/apache/axis2/integration/TestingUtils.html...>
Generating <https://builds.apache.org/job/rampart-1.7/ws/1_7/modules/rampart-integration/target/apidocs/overview-frame.html...>
Generating <https://builds.apache.org/job/rampart-1.7/ws/1_7/modules/rampart-integration/target/apidocs/org/apache/axis2/integration/package-frame.html...>
Generating <https://builds.apache.org/job/rampart-1.7/ws/1_7/modules/rampart-integration/target/apidocs/org/apache/axis2/integration/package-summary.html...>
Generating <https://builds.apache.org/job/rampart-1.7/ws/1_7/modules/rampart-integration/target/apidocs/org/apache/axis2/integration/package-tree.html...>
Generating <https://builds.apache.org/job/rampart-1.7/ws/1_7/modules/rampart-integration/target/apidocs/org/apache/rahas/package-frame.html...>
Generating <https://builds.apache.org/job/rampart-1.7/ws/1_7/modules/rampart-integration/target/apidocs/org/apache/rahas/package-summary.html...>
Generating <https://builds.apache.org/job/rampart-1.7/ws/1_7/modules/rampart-integration/target/apidocs/org/apache/rahas/package-tree.html...>
Generating <https://builds.apache.org/job/rampart-1.7/ws/1_7/modules/rampart-integration/target/apidocs/org/apache/rampart/package-frame.html...>
Generating <https://builds.apache.org/job/rampart-1.7/ws/1_7/modules/rampart-integration/target/apidocs/org/apache/rampart/package-summary.html...>
Generating <https://builds.apache.org/job/rampart-1.7/ws/1_7/modules/rampart-integration/target/apidocs/org/apache/rampart/package-tree.html...>
Generating <https://builds.apache.org/job/rampart-1.7/ws/1_7/modules/rampart-integration/target/apidocs/constant-values.html...>
Generating <https://builds.apache.org/job/rampart-1.7/ws/1_7/modules/rampart-integration/target/apidocs/org/apache/rampart/class-use/PWCallback.html...>
Generating <https://builds.apache.org/job/rampart-1.7/ws/1_7/modules/rampart-integration/target/apidocs/org/apache/rampart/class-use/Service.html...>
Generating <https://builds.apache.org/job/rampart-1.7/ws/1_7/modules/rampart-integration/target/apidocs/org/apache/rampart/class-use/RampartConfigUpdater.html...>
Generating <https://builds.apache.org/job/rampart-1.7/ws/1_7/modules/rampart-integration/target/apidocs/org/apache/rahas/class-use/TestClient.html...>
Generating <https://builds.apache.org/job/rampart-1.7/ws/1_7/modules/rampart-integration/target/apidocs/org/apache/rahas/class-use/PWCallback.html...>
Generating <https://builds.apache.org/job/rampart-1.7/ws/1_7/modules/rampart-integration/target/apidocs/org/apache/rahas/class-use/Service.html...>
Generating <https://builds.apache.org/job/rampart-1.7/ws/1_7/modules/rampart-integration/target/apidocs/org/apache/axis2/integration/class-use/TestingUtils.html...>
Generating <https://builds.apache.org/job/rampart-1.7/ws/1_7/modules/rampart-integration/target/apidocs/org/apache/axis2/integration/class-use/JettyServer.html...>
Generating <https://builds.apache.org/job/rampart-1.7/ws/1_7/modules/rampart-integration/target/apidocs/org/apache/axis2/integration/package-use.html...>
Generating <https://builds.apache.org/job/rampart-1.7/ws/1_7/modules/rampart-integration/target/apidocs/org/apache/rahas/package-use.html...>
Generating <https://builds.apache.org/job/rampart-1.7/ws/1_7/modules/rampart-integration/target/apidocs/org/apache/rampart/package-use.html...>
Building index for all the packages and classes...
Generating <https://builds.apache.org/job/rampart-1.7/ws/1_7/modules/rampart-integration/target/apidocs/overview-tree.html...>
Generating <https://builds.apache.org/job/rampart-1.7/ws/1_7/modules/rampart-integration/target/apidocs/index-all.html...>
Generating <https://builds.apache.org/job/rampart-1.7/ws/1_7/modules/rampart-integration/target/apidocs/deprecated-list.html...>
Building index for all classes...
Generating <https://builds.apache.org/job/rampart-1.7/ws/1_7/modules/rampart-integration/target/apidocs/allclasses-frame.html...>
Generating <https://builds.apache.org/job/rampart-1.7/ws/1_7/modules/rampart-integration/target/apidocs/allclasses-noframe.html...>
Generating <https://builds.apache.org/job/rampart-1.7/ws/1_7/modules/rampart-integration/target/apidocs/index.html...>
Generating <https://builds.apache.org/job/rampart-1.7/ws/1_7/modules/rampart-integration/target/apidocs/overview-summary.html...>
Generating <https://builds.apache.org/job/rampart-1.7/ws/1_7/modules/rampart-integration/target/apidocs/help-doc.html...>
2 errors
14 warnings
[INFO] ------------------------------------------------------------------------
[INFO] Reactor Summary:
[INFO] 
[INFO] Apache Rampart ..................................... SUCCESS [ 25.737 s]
[INFO] Rampart - Policy ................................... SUCCESS [ 29.760 s]
[INFO] Rampart - Trust .................................... SUCCESS [01:31 min]
[INFO] Rampart - Core ..................................... SUCCESS [ 27.065 s]
[INFO] Javadoc ............................................ SUCCESS [ 19.050 s]
[INFO] Rampart - Test Suite ............................... SUCCESS [ 16.994 s]
[INFO] Rampart - Mar ...................................... SUCCESS [ 17.909 s]
[INFO] Rampart - Trust-Mar ................................ SUCCESS [ 13.939 s]
[INFO] Rampart - Integration .............................. FAILURE [01:06 min]
[INFO] Rampart - Samples .................................. SKIPPED
[INFO] Rampart - Distribution ............................. SKIPPED
[INFO] Code Coverage Report ............................... SKIPPED
[INFO] ------------------------------------------------------------------------
[INFO] BUILD FAILURE
[INFO] ------------------------------------------------------------------------
[INFO] Total time: 05:51 min
[INFO] Finished at: 2017-07-30T16:51:37+00:00
[INFO] Final Memory: 134M/887M
[INFO] ------------------------------------------------------------------------
[ERROR] Failed to execute goal org.apache.maven.plugins:maven-javadoc-plugin:2.10.3:jar (attach-javadocs)
on project rampart-integration: MavenReportException: Error while generating Javadoc:
[ERROR] Exit code: 1 - <https://builds.apache.org/job/rampart-1.7/ws/1_7/modules/rampart-integration/src/main/java/org/apache/rampart/PWCallback.java>:65:
warning: no description for @param
[ERROR] * @param callbacks
[ERROR] ^
[ERROR] <https://builds.apache.org/job/rampart-1.7/ws/1_7/modules/rampart-integration/src/main/java/org/apache/rampart/PWCallback.java>:67:
warning: no description for @throws
[ERROR] * @throws java.io.IOException
[ERROR] ^
[ERROR] <https://builds.apache.org/job/rampart-1.7/ws/1_7/modules/rampart-integration/src/main/java/org/apache/rampart/PWCallback.java>:69:
warning: no description for @throws
[ERROR] * @throws javax.security.auth.callback.UnsupportedCallbackException
[ERROR] ^
[ERROR] <https://builds.apache.org/job/rampart-1.7/ws/1_7/modules/rampart-integration/src/main/java/org/apache/rampart/Service.java>:30:
warning: no description for @param
[ERROR] * @param element
[ERROR] ^
[ERROR] <https://builds.apache.org/job/rampart-1.7/ws/1_7/modules/rampart-integration/src/main/java/org/apache/rampart/Service.java>:31:
warning: no description for @return
[ERROR] * @return
[ERROR] ^
[ERROR] <https://builds.apache.org/job/rampart-1.7/ws/1_7/modules/rampart-integration/src/main/java/org/apache/rampart/Service.java>:32:
warning: no description for @throws
[ERROR] * @throws Exception
[ERROR] ^
[ERROR] <https://builds.apache.org/job/rampart-1.7/ws/1_7/modules/rampart-integration/src/main/java/org/apache/rahas/PWCallback.java>:42:
warning: no description for @param
[ERROR] * @param callbacks
[ERROR] ^
[ERROR] <https://builds.apache.org/job/rampart-1.7/ws/1_7/modules/rampart-integration/src/main/java/org/apache/rahas/PWCallback.java>:44:
warning: no description for @throws
[ERROR] * @throws java.io.IOException
[ERROR] ^
[ERROR] <https://builds.apache.org/job/rampart-1.7/ws/1_7/modules/rampart-integration/src/main/java/org/apache/rahas/PWCallback.java>:46:
warning: no description for @throws
[ERROR] * @throws javax.security.auth.callback.UnsupportedCallbackException
[ERROR] ^
[ERROR] <https://builds.apache.org/job/rampart-1.7/ws/1_7/modules/rampart-integration/src/main/java/org/apache/rahas/TestClient.java>:56:
warning: no @throws for java.lang.Exception
[ERROR] public void testRequest() throws Exception {
[ERROR] ^
[ERROR] <https://builds.apache.org/job/rampart-1.7/ws/1_7/modules/rampart-integration/src/main/java/org/apache/axis2/integration/JettyServer.java>:85:
warning: no description for @throws
[ERROR] * @throws Exception
[ERROR] ^
[ERROR] <https://builds.apache.org/job/rampart-1.7/ws/1_7/modules/rampart-integration/src/main/java/org/apache/axis2/integration/JettyServer.java>:98:
warning: no description for @throws
[ERROR] * @throws Exception
[ERROR] ^
[ERROR] <https://builds.apache.org/job/rampart-1.7/ws/1_7/modules/rampart-integration/src/main/java/org/apache/axis2/integration/JettyServer.java>:114:
warning: no description for @throws
[ERROR] * @throws Exception
[ERROR] ^
[ERROR] <https://builds.apache.org/job/rampart-1.7/ws/1_7/modules/rampart-integration/src/main/java/org/apache/axis2/integration/JettyServer.java>:202:
warning: no description for @throws
[ERROR] * @throws Exception
[ERROR] ^
[ERROR] <https://builds.apache.org/job/rampart-1.7/ws/1_7/modules/rampart-integration/src/main/java/org/apache/axis2/integration/JettyServer.java>:43:
error: syntax error in reference
[ERROR] * Keymanager password to configure for Jetty's ssl context factory: {@value
[ERROR] ^
[ERROR] <https://builds.apache.org/job/rampart-1.7/ws/1_7/modules/rampart-integration/src/main/java/org/apache/axis2/integration/JettyServer.java>:68:
error: {@value} not allowed here
[ERROR] * Webapp resource base directory to use: {@value}
[ERROR] ^
[ERROR] 
[ERROR] Command line was: /usr/local/asfpackages/java/jdk1.8.0_131/jre/../bin/javadoc @options
@packages
[ERROR] 
[ERROR] Refer to the generated Javadoc files in '<https://builds.apache.org/job/rampart-1.7/ws/1_7/modules/rampart-integration/target/apidocs'>
dir.
[ERROR] -> [Help 1]
[ERROR] 
[ERROR] To see the full stack trace of the errors, re-run Maven with the -e switch.
[ERROR] Re-run Maven using the -X switch to enable full debug logging.
[ERROR] 
[ERROR] For more information about the errors and possible solutions, please read the following
articles:
[ERROR] [Help 1] http://cwiki.apache.org/confluence/display/MAVEN/MojoExecutionException
[ERROR] 
[ERROR] After correcting the problems, you can resume the build with the command
[ERROR]   mvn <goals> -rf :rampart-integration
[JENKINS] Archiving <https://builds.apache.org/job/rampart-1.7/ws/1_7/pom.xml> to org.apache.rampart/rampart-project/1.7.1-SNAPSHOT/rampart-project-1.7.1-SNAPSHOT.pom
[JENKINS] Archiving <https://builds.apache.org/job/rampart-1.7/ws/1_7/target/rampart-project-1.7.1-SNAPSHOT-site.xml>
to org.apache.rampart/rampart-project/1.7.1-20170730.164612-73/rampart-project-1.7.1-20170730.164612-73-site.xml
[JENKINS] Archiving <https://builds.apache.org/job/rampart-1.7/ws/1_7/modules/rampart-trust/pom.xml>
to org.apache.rampart/rampart-trust/1.7.1-SNAPSHOT/rampart-trust-1.7.1-SNAPSHOT.pom
[JENKINS] Archiving <https://builds.apache.org/job/rampart-1.7/ws/1_7/modules/rampart-trust/target/rampart-trust-1.7.1-SNAPSHOT.jar>
to org.apache.rampart/rampart-trust/1.7.1-20170730.164814-73/rampart-trust-1.7.1-20170730.164814-73.jar
[JENKINS] Archiving <https://builds.apache.org/job/rampart-1.7/ws/1_7/modules/rampart-trust/target/jacoco.exec>
to org.apache.rampart/rampart-trust/1.7.1-20170730.164814-73/rampart-trust-1.7.1-20170730.164814-73-jacoco.exec
[JENKINS] Archiving <https://builds.apache.org/job/rampart-1.7/ws/1_7/modules/rampart-trust/target/rampart-trust-1.7.1-SNAPSHOT-sources.jar>
to org.apache.rampart/rampart-trust/1.7.1-20170730.164814-73/rampart-trust-1.7.1-20170730.164814-73-sources.jar
[JENKINS] Archiving <https://builds.apache.org/job/rampart-1.7/ws/1_7/modules/rampart-trust/target/rampart-trust-1.7.1-SNAPSHOT-javadoc.jar>
to org.apache.rampart/rampart-trust/1.7.1-20170730.164814-73/rampart-trust-1.7.1-20170730.164814-73-javadoc.jar
[JENKINS] Archiving <https://builds.apache.org/job/rampart-1.7/ws/1_7/modules/rampart-mar/pom.xml>
to org.apache.rampart/rampart/1.7.1-SNAPSHOT/rampart-1.7.1-SNAPSHOT.pom
[JENKINS] Archiving <https://builds.apache.org/job/rampart-1.7/ws/1_7/modules/rampart-mar/target/rampart-1.7.1-SNAPSHOT.mar>
to org.apache.rampart/rampart/1.7.1-20170730.164944-73/rampart-1.7.1-20170730.164944-73.mar
[JENKINS] Archiving <https://builds.apache.org/job/rampart-1.7/ws/1_7/modules/rampart-mar/target/jacoco.exec>
to org.apache.rampart/rampart/1.7.1-20170730.164944-73/rampart-1.7.1-20170730.164944-73-jacoco.exec
[JENKINS] Archiving <https://builds.apache.org/job/rampart-1.7/ws/1_7/modules/rampart-mar/target/rampart-1.7.1-SNAPSHOT.mar>
to org.apache.rampart/rampart/1.7.1-20170730.164944-73/rampart-1.7.1-20170730.164944-73.jar
[JENKINS] Archiving <https://builds.apache.org/job/rampart-1.7/ws/1_7/modules/rampart-mar/target/rampart-1.7.1-SNAPSHOT-sources.jar>
to org.apache.rampart/rampart/1.7.1-20170730.164944-73/rampart-1.7.1-20170730.164944-73-sources.jar
[JENKINS] Archiving <https://builds.apache.org/job/rampart-1.7/ws/1_7/modules/rampart-integration/pom.xml>
to org.apache.rampart/rampart-integration/1.7.1-SNAPSHOT/rampart-integration-1.7.1-SNAPSHOT.pom
[JENKINS] Archiving <https://builds.apache.org/job/rampart-1.7/ws/1_7/modules/rampart-integration/target/rampart-integration-1.7.1-SNAPSHOT.jar>
to org.apache.rampart/rampart-integration/1.7.1-SNAPSHOT/rampart-integration-1.7.1-SNAPSHOT.jar
[JENKINS] Archiving <https://builds.apache.org/job/rampart-1.7/ws/1_7/modules/rampart-integration/target/jacoco.exec>
to org.apache.rampart/rampart-integration/1.7.1-SNAPSHOT/rampart-integration-1.7.1-SNAPSHOT-jacoco.exec
[JENKINS] Archiving <https://builds.apache.org/job/rampart-1.7/ws/1_7/modules/rampart-integration/target/rampart-integration-1.7.1-SNAPSHOT-sources.jar>
to org.apache.rampart/rampart-integration/1.7.1-SNAPSHOT/rampart-integration-1.7.1-SNAPSHOT-sources.jar
[JENKINS] Archiving <https://builds.apache.org/job/rampart-1.7/ws/1_7/modules/rampart-tests/pom.xml>
to org.apache.rampart/rampart-tests/1.7.1-SNAPSHOT/rampart-tests-1.7.1-SNAPSHOT.pom
[JENKINS] Archiving <https://builds.apache.org/job/rampart-1.7/ws/1_7/modules/rampart-tests/target/rampart-tests-1.7.1-SNAPSHOT.jar>
to org.apache.rampart/rampart-tests/1.7.1-SNAPSHOT/rampart-tests-1.7.1-SNAPSHOT.jar
[JENKINS] Archiving <https://builds.apache.org/job/rampart-1.7/ws/1_7/modules/rampart-tests/target/jacoco.exec>
to org.apache.rampart/rampart-tests/1.7.1-SNAPSHOT/rampart-tests-1.7.1-SNAPSHOT-jacoco.exec
[JENKINS] Archiving <https://builds.apache.org/job/rampart-1.7/ws/1_7/modules/rampart-tests/target/rampart-tests-1.7.1-SNAPSHOT-sources.jar>
to org.apache.rampart/rampart-tests/1.7.1-SNAPSHOT/rampart-tests-1.7.1-SNAPSHOT-sources.jar
[JENKINS] Archiving <https://builds.apache.org/job/rampart-1.7/ws/1_7/modules/rampart-trust-mar/pom.xml>
to org.apache.rampart/rahas/1.7.1-SNAPSHOT/rahas-1.7.1-SNAPSHOT.pom
[JENKINS] Archiving <https://builds.apache.org/job/rampart-1.7/ws/1_7/modules/rampart-trust-mar/target/rahas-1.7.1-SNAPSHOT.mar>
to org.apache.rampart/rahas/1.7.1-20170730.165002-73/rahas-1.7.1-20170730.165002-73.mar
[JENKINS] Archiving <https://builds.apache.org/job/rampart-1.7/ws/1_7/modules/rampart-trust-mar/target/jacoco.exec>
to org.apache.rampart/rahas/1.7.1-20170730.165002-73/rahas-1.7.1-20170730.165002-73-jacoco.exec
[JENKINS] Archiving <https://builds.apache.org/job/rampart-1.7/ws/1_7/modules/rampart-trust-mar/target/rahas-1.7.1-SNAPSHOT-sources.jar>
to org.apache.rampart/rahas/1.7.1-20170730.165002-73/rahas-1.7.1-20170730.165002-73-sources.jar
[JENKINS] Archiving <https://builds.apache.org/job/rampart-1.7/ws/1_7/modules/rampart-samples/pom.xml>
to org.apache.rampart/rampart-sample/1.7.1-SNAPSHOT/rampart-sample-1.7.1-SNAPSHOT.pom
[JENKINS] Archiving <https://builds.apache.org/job/rampart-1.7/ws/1_7/modules/distribution/pom.xml>
to org.apache.rampart/rampart-dist/1.7.1-SNAPSHOT/rampart-dist-1.7.1-SNAPSHOT.pom
[JENKINS] Archiving <https://builds.apache.org/job/rampart-1.7/ws/1_7/modules/rampart-policy/pom.xml>
to org.apache.rampart/rampart-policy/1.7.1-SNAPSHOT/rampart-policy-1.7.1-SNAPSHOT.pom
[JENKINS] Archiving <https://builds.apache.org/job/rampart-1.7/ws/1_7/modules/rampart-policy/target/rampart-policy-1.7.1-SNAPSHOT.jar>
to org.apache.rampart/rampart-policy/1.7.1-20170730.164640-73/rampart-policy-1.7.1-20170730.164640-73.jar
[JENKINS] Archiving <https://builds.apache.org/job/rampart-1.7/ws/1_7/modules/rampart-policy/target/jacoco.exec>
to org.apache.rampart/rampart-policy/1.7.1-20170730.164640-73/rampart-policy-1.7.1-20170730.164640-73-jacoco.exec
[JENKINS] Archiving <https://builds.apache.org/job/rampart-1.7/ws/1_7/modules/rampart-policy/target/rampart-policy-1.7.1-SNAPSHOT-sources.jar>
to org.apache.rampart/rampart-policy/1.7.1-20170730.164640-73/rampart-policy-1.7.1-20170730.164640-73-sources.jar
[JENKINS] Archiving <https://builds.apache.org/job/rampart-1.7/ws/1_7/modules/rampart-policy/target/rampart-policy-1.7.1-SNAPSHOT-javadoc.jar>
to org.apache.rampart/rampart-policy/1.7.1-20170730.164640-73/rampart-policy-1.7.1-20170730.164640-73-javadoc.jar
[JENKINS] Archiving <https://builds.apache.org/job/rampart-1.7/ws/1_7/apidocs/pom.xml>
to org.apache.rampart/apidocs/1.7.1-SNAPSHOT/apidocs-1.7.1-SNAPSHOT.pom
[JENKINS] Archiving <https://builds.apache.org/job/rampart-1.7/ws/1_7/apidocs/target/apidocs-1.7.1-SNAPSHOT.zip>
to org.apache.rampart/apidocs/1.7.1-SNAPSHOT/apidocs-1.7.1-SNAPSHOT.zip
[JENKINS] Archiving <https://builds.apache.org/job/rampart-1.7/ws/1_7/modules/rampart-core/pom.xml>
to org.apache.rampart/rampart-core/1.7.1-SNAPSHOT/rampart-core-1.7.1-SNAPSHOT.pom
[JENKINS] Archiving <https://builds.apache.org/job/rampart-1.7/ws/1_7/modules/rampart-core/target/rampart-core-1.7.1-SNAPSHOT.jar>
to org.apache.rampart/rampart-core/1.7.1-20170730.164843-73/rampart-core-1.7.1-20170730.164843-73.jar
[JENKINS] Archiving <https://builds.apache.org/job/rampart-1.7/ws/1_7/modules/rampart-core/target/jacoco.exec>
to org.apache.rampart/rampart-core/1.7.1-20170730.164843-73/rampart-core-1.7.1-20170730.164843-73-jacoco.exec
[JENKINS] Archiving <https://builds.apache.org/job/rampart-1.7/ws/1_7/modules/rampart-core/target/rampart-core-1.7.1-SNAPSHOT-sources.jar>
to org.apache.rampart/rampart-core/1.7.1-20170730.164843-73/rampart-core-1.7.1-20170730.164843-73-sources.jar
[JENKINS] Archiving <https://builds.apache.org/job/rampart-1.7/ws/1_7/modules/rampart-core/target/rampart-core-1.7.1-SNAPSHOT-javadoc.jar>
to org.apache.rampart/rampart-core/1.7.1-20170730.164843-73/rampart-core-1.7.1-20170730.164843-73-javadoc.jar
[JENKINS] Archiving <https://builds.apache.org/job/rampart-1.7/ws/1_7/code-coverage/pom.xml>
to org.apache.rampart/code-coverage/1.7.1-SNAPSHOT/code-coverage-1.7.1-SNAPSHOT.pom
Sending e-mails to: java-dev@axis.apache.org
[locks-and-latches] Releasing all the locks
[locks-and-latches] All the locks released
channel stopped

---------------------------------------------------------------------
To unsubscribe, e-mail: java-dev-unsubscribe@axis.apache.org
For additional commands, e-mail: java-dev-help@axis.apache.org


Mime
View raw message