axis-java-dev mailing list archives

Site index · List index
Message view « Date » · « Thread »
Top « Date » · « Thread »
From Apache Jenkins Server <jenk...@builds.apache.org>
Subject Build failed in Jenkins: rampart-1.7 » Rampart - Integration #77
Date Sun, 30 Jul 2017 16:51:55 GMT
See <https://builds.apache.org/job/rampart-1.7/org.apache.rampart$rampart-integration/77/display/redirect>

------------------------------------------
[...truncated 92.05 KB...]
Testing WS-Sec: custom scenario 21
Testing WS-Sec: custom scenario 22
Testing WS-Sec: custom scenario 23
Testing WS-Sec: custom scenario 24
Testing WS-Sec: custom scenario 26
Testing WS-Sec: custom scenario 27
Testing WS-Sec: custom scenario 28
2017-07-30 16:50:46,414 ERROR org.apache.axis2.engine.AxisEngine - Expected encrypted part
missing
org.apache.axis2.AxisFault: Expected encrypted part missing
	at org.apache.rampart.handler.RampartReceiver.setFaultCodeAndThrowAxisFault(RampartReceiver.java:180)
	at org.apache.rampart.handler.RampartReceiver.invoke(RampartReceiver.java:99)
	at org.apache.axis2.engine.Phase.invokeHandler(Phase.java:335)
	at org.apache.axis2.engine.Phase.invoke(Phase.java:308)
	at org.apache.axis2.engine.AxisEngine.invoke(AxisEngine.java:250)
	at org.apache.axis2.engine.AxisEngine.receive(AxisEngine.java:156)
	at org.apache.axis2.transport.http.HTTPTransportUtils.processHTTPPostRequest(HTTPTransportUtils.java:178)
	at org.apache.axis2.transport.http.AxisServlet.doPost(AxisServlet.java:164)
	at javax.servlet.http.HttpServlet.service(HttpServlet.java:727)
	at javax.servlet.http.HttpServlet.service(HttpServlet.java:820)
	at org.eclipse.jetty.servlet.ServletHolder.handle(ServletHolder.java:652)
	at org.eclipse.jetty.servlet.ServletHandler.doHandle(ServletHandler.java:445)
	at org.eclipse.jetty.server.handler.ScopedHandler.handle(ScopedHandler.java:137)
	at org.eclipse.jetty.security.SecurityHandler.handle(SecurityHandler.java:556)
	at org.eclipse.jetty.server.session.SessionHandler.doHandle(SessionHandler.java:227)
	at org.eclipse.jetty.server.handler.ContextHandler.doHandle(ContextHandler.java:1044)
	at org.eclipse.jetty.servlet.ServletHandler.doScope(ServletHandler.java:372)
	at org.eclipse.jetty.server.session.SessionHandler.doScope(SessionHandler.java:189)
	at org.eclipse.jetty.server.handler.ContextHandler.doScope(ContextHandler.java:978)
	at org.eclipse.jetty.server.handler.ScopedHandler.handle(ScopedHandler.java:135)
	at org.eclipse.jetty.server.handler.HandlerWrapper.handle(HandlerWrapper.java:116)
	at org.eclipse.jetty.server.Server.handle(Server.java:369)
	at org.eclipse.jetty.server.AbstractHttpConnection.handleRequest(AbstractHttpConnection.java:486)
	at org.eclipse.jetty.server.AbstractHttpConnection.content(AbstractHttpConnection.java:944)
	at org.eclipse.jetty.server.AbstractHttpConnection$RequestHandler.content(AbstractHttpConnection.java:1005)
	at org.eclipse.jetty.http.HttpParser.parseNext(HttpParser.java:957)
	at org.eclipse.jetty.http.HttpParser.parseAvailable(HttpParser.java:240)
	at org.eclipse.jetty.server.AsyncHttpConnection.handle(AsyncHttpConnection.java:82)
	at org.eclipse.jetty.io.nio.SelectChannelEndPoint.handle(SelectChannelEndPoint.java:667)
	at org.eclipse.jetty.io.nio.SelectChannelEndPoint$1.run(SelectChannelEndPoint.java:52)
	at org.eclipse.jetty.util.thread.QueuedThreadPool.runJob(QueuedThreadPool.java:608)
	at org.eclipse.jetty.util.thread.QueuedThreadPool$3.run(QueuedThreadPool.java:543)
	at java.lang.Thread.run(Thread.java:745)
Caused by: org.apache.rampart.RampartException: Expected encrypted part missing
	at org.apache.rampart.PolicyBasedResultsValidator.validateEncrSig(PolicyBasedResultsValidator.java:276)
	at org.apache.rampart.PolicyBasedResultsValidator.validate(PolicyBasedResultsValidator.java:153)
	at org.apache.rampart.RampartEngine.process(RampartEngine.java:280)
	at org.apache.rampart.handler.RampartReceiver.invoke(RampartReceiver.java:92)
	... 31 more
Testing WS-Sec: custom scenario 29
Testing WS-Sec: custom scenario 30
Testing WS-Sec: custom scenario 31
Testing WS-Sec: custom scenario 32
Testing WS-Sec: custom scenario 33
Testing WS-Sec: custom scenario 34
2017-07-30 16:50:46,893 ERROR org.apache.axis2.engine.AxisEngine - Invalid signature algorithm
for Asymmetric binding
org.apache.axis2.AxisFault: Invalid signature algorithm for Asymmetric binding
	at org.apache.rampart.handler.RampartReceiver.setFaultCodeAndThrowAxisFault(RampartReceiver.java:180)
	at org.apache.rampart.handler.RampartReceiver.invoke(RampartReceiver.java:99)
	at org.apache.axis2.engine.Phase.invokeHandler(Phase.java:335)
	at org.apache.axis2.engine.Phase.invoke(Phase.java:308)
	at org.apache.axis2.engine.AxisEngine.invoke(AxisEngine.java:250)
	at org.apache.axis2.engine.AxisEngine.receive(AxisEngine.java:156)
	at org.apache.axis2.transport.http.HTTPTransportUtils.processHTTPPostRequest(HTTPTransportUtils.java:178)
	at org.apache.axis2.transport.http.AxisServlet.doPost(AxisServlet.java:164)
	at javax.servlet.http.HttpServlet.service(HttpServlet.java:727)
	at javax.servlet.http.HttpServlet.service(HttpServlet.java:820)
	at org.eclipse.jetty.servlet.ServletHolder.handle(ServletHolder.java:652)
	at org.eclipse.jetty.servlet.ServletHandler.doHandle(ServletHandler.java:445)
	at org.eclipse.jetty.server.handler.ScopedHandler.handle(ScopedHandler.java:137)
	at org.eclipse.jetty.security.SecurityHandler.handle(SecurityHandler.java:556)
	at org.eclipse.jetty.server.session.SessionHandler.doHandle(SessionHandler.java:227)
	at org.eclipse.jetty.server.handler.ContextHandler.doHandle(ContextHandler.java:1044)
	at org.eclipse.jetty.servlet.ServletHandler.doScope(ServletHandler.java:372)
	at org.eclipse.jetty.server.session.SessionHandler.doScope(SessionHandler.java:189)
	at org.eclipse.jetty.server.handler.ContextHandler.doScope(ContextHandler.java:978)
	at org.eclipse.jetty.server.handler.ScopedHandler.handle(ScopedHandler.java:135)
	at org.eclipse.jetty.server.handler.HandlerWrapper.handle(HandlerWrapper.java:116)
	at org.eclipse.jetty.server.Server.handle(Server.java:369)
	at org.eclipse.jetty.server.AbstractHttpConnection.handleRequest(AbstractHttpConnection.java:486)
	at org.eclipse.jetty.server.AbstractHttpConnection.content(AbstractHttpConnection.java:944)
	at org.eclipse.jetty.server.AbstractHttpConnection$RequestHandler.content(AbstractHttpConnection.java:1005)
	at org.eclipse.jetty.http.HttpParser.parseNext(HttpParser.java:957)
	at org.eclipse.jetty.http.HttpParser.parseAvailable(HttpParser.java:240)
	at org.eclipse.jetty.server.AsyncHttpConnection.handle(AsyncHttpConnection.java:82)
	at org.eclipse.jetty.io.nio.SelectChannelEndPoint.handle(SelectChannelEndPoint.java:667)
	at org.eclipse.jetty.io.nio.SelectChannelEndPoint$1.run(SelectChannelEndPoint.java:52)
	at org.eclipse.jetty.util.thread.QueuedThreadPool.runJob(QueuedThreadPool.java:608)
	at org.eclipse.jetty.util.thread.QueuedThreadPool$3.run(QueuedThreadPool.java:543)
	at java.lang.Thread.run(Thread.java:745)
Caused by: org.apache.rampart.RampartException: Invalid signature algorithm for Asymmetric
binding
	at org.apache.rampart.RampartEngine.process(RampartEngine.java:257)
	at org.apache.rampart.handler.RampartReceiver.invoke(RampartReceiver.java:92)
	... 31 more
Invalid signature algorithm for Asymmetric binding
Testing WS-Sec: custom scenario 35
--------------Testing negative scenarios----------------------------
Testing WS-Sec: negative scenario 1
Testing WS-Sec: negative scenario 2
Testing WS-Sec: negative scenario 6
Testing WS-Sec: negative scenario 7
Testing WS-Sec: negative scenario 8
Testing WS-Sec: negative scenario 9
Testing WS-Sec: negative scenario 10
Testing WS-Sec: negative scenario 11
Testing WS-Sec: negative scenario 12
Testing WS-Sec: negative scenario 13
Testing WS-Sec: negative scenario 14
Testing WS-Sec: negative scenario 15
Testing WS-Sec: negative scenario 16
Testing WS-Sec: negative scenario 17
Testing WS-Sec: negative scenario 18
Testing WS-Sec: negative scenario 19
Testing WS-Sec: negative scenario 20
Testing WS-Sec: negative scenario 21
Testing WS-Sec: negative scenario 22
Testing WS-SecConv: custom scenario 1
Testing WS-SecConv: custom scenario 2
Testing WS-SecConv: custom scenario 3
Testing WS-SecConv: custom scenario 4
Testing WS-SecConv: custom scenario 5
Testing WS-SecConv: custom scenario 6
[JettyServer] - Stop called
Tests run: 1, Failures: 0, Errors: 0, Skipped: 0, Time elapsed: 18.677 sec
Running org.apache.rahas.RahasSAMLTokenUTForBearerTest
[JettyServer] - Starting http connector on port: 5555
[JettyServer] - Stop called
Tests run: 1, Failures: 0, Errors: 0, Skipped: 0, Time elapsed: 0.945 sec
Running org.apache.rahas.RahasSAMLTokenTest
[JettyServer] - Starting http connector on port: 5555
[JettyServer] - Stop called
Tests run: 1, Failures: 0, Errors: 0, Skipped: 0, Time elapsed: 0.801 sec
Running org.apache.rahas.RahasSAMLTokenUTForBearerV1205Test
[JettyServer] - Starting http connector on port: 5555
[JettyServer] - Stop called
Tests run: 1, Failures: 0, Errors: 0, Skipped: 0, Time elapsed: 0.746 sec
Running org.apache.rahas.RahasSAMLTokenUTForHoKV1205Test
[JettyServer] - Starting http connector on port: 5555
[JettyServer] - Stop called
Tests run: 1, Failures: 0, Errors: 0, Skipped: 0, Time elapsed: 0.746 sec
Running org.apache.rahas.RahasSAMLTokenV1205Test
[JettyServer] - Starting http connector on port: 5555
[JettyServer] - Stop called
Tests run: 1, Failures: 0, Errors: 0, Skipped: 0, Time elapsed: 0.763 sec
Running org.apache.rahas.RahasSAML2TokenCertForHoKTest
[JettyServer] - Starting http connector on port: 5555
Running SAML2 Test with Public Key as the KeyType in RST.
[JettyServer] - Stop called
Tests run: 1, Failures: 0, Errors: 0, Skipped: 0, Time elapsed: 0.778 sec
Running org.apache.rahas.RahasSAML2TokenTest
[JettyServer] - Starting http connector on port: 5555
 Running SAML2 Test with Symmetric Key As the KeyType in RST. 
[JettyServer] - Stop called
Tests run: 1, Failures: 0, Errors: 0, Skipped: 0, Time elapsed: 0.781 sec
Running org.apache.rahas.RahasSAMLTokenUTForHoKTest
[JettyServer] - Starting http connector on port: 5555
[JettyServer] - Stop called
Tests run: 1, Failures: 0, Errors: 0, Skipped: 0, Time elapsed: 0.856 sec
Running org.apache.rahas.RahasSAMLTokenCertForHoKV1205Test
[JettyServer] - Starting http connector on port: 5555
[JettyServer] - Stop called
Tests run: 1, Failures: 0, Errors: 0, Skipped: 0, Time elapsed: 0.763 sec
Running org.apache.rahas.RahasSAML2TokenUTForBearerTest
[JettyServer] - Starting http connector on port: 5555
[JettyServer] - Stop called
Tests run: 1, Failures: 0, Errors: 0, Skipped: 0, Time elapsed: 0.73 sec
Running org.apache.rahas.RahasSAMLTokenAttributeTest
[JettyServer] - Starting http connector on port: 5555
[JettyServer] - Stop called
Tests run: 1, Failures: 0, Errors: 0, Skipped: 0, Time elapsed: 0.715 sec
Running org.apache.rahas.RahasSAMLTokenCertForHoKTest
[JettyServer] - Starting http connector on port: 5555
[JettyServer] - Stop called
Tests run: 1, Failures: 0, Errors: 0, Skipped: 0, Time elapsed: 0.851 sec

Results :

Tests run: 13, Failures: 0, Errors: 0, Skipped: 0

[JENKINS] Recording test results
[INFO] 
[INFO] --- build-helper-maven-plugin:1.7:attach-artifact (attach-jacoco-exec) @ rampart-integration
---
[INFO] 
[INFO] --- maven-jar-plugin:2.5:jar (default-jar) @ rampart-integration ---
[INFO] Building jar: <https://builds.apache.org/job/rampart-1.7/org.apache.rampart$rampart-integration/ws/target/rampart-integration-1.7.1-SNAPSHOT.jar>
[INFO] 
[INFO] --- maven-site-plugin:3.4:attach-descriptor (attach-descriptor) @ rampart-integration
---
[INFO] 
[INFO] --- maven-assembly-plugin:2.6:single (source-release-assembly) @ rampart-integration
---
[INFO] Assemblies have been skipped per configuration of the skipAssembly parameter.
[INFO] 
[INFO] --- maven-source-plugin:2.4:jar-no-fork (source-jars) @ rampart-integration ---
[INFO] Building jar: <https://builds.apache.org/job/rampart-1.7/org.apache.rampart$rampart-integration/ws/target/rampart-integration-1.7.1-SNAPSHOT-sources.jar>
[INFO] 
[INFO] --- maven-javadoc-plugin:2.10.3:jar (attach-javadocs) @ rampart-integration ---
[INFO] The goal 'org.apache.maven.plugins:maven-javadoc-plugin:2.10.3:javadoc' has not been
previously called for the module: 'org.apache.rampart:rampart:mar:1.7.1-SNAPSHOT'. Trying
to invoke it...
[WARNING] Creating fake javadoc directory to prevent repeated invocations: /home/jenkins/jenkins-slave/workspace/rampart-1.7/1_7/modules/rampart-mar/target/apidocs
[INFO] The goal 'org.apache.maven.plugins:maven-javadoc-plugin:2.10.3:javadoc' has not been
previously called for the module: 'org.apache.rampart:rahas:mar:1.7.1-SNAPSHOT'. Trying to
invoke it...
[WARNING] Creating fake javadoc directory to prevent repeated invocations: /home/jenkins/jenkins-slave/workspace/rampart-1.7/1_7/modules/rampart-trust-mar/target/apidocs
[ERROR] Error fetching link: /home/jenkins/jenkins-slave/workspace/rampart-1.7/1_7/modules/rampart-mar/target/apidocs/package-list.
Ignored it.
[ERROR] Error fetching link: /home/jenkins/jenkins-slave/workspace/rampart-1.7/1_7/modules/rampart-trust-mar/target/apidocs/package-list.
Ignored it.
[INFO] 
Loading source files for package org.apache.rampart...
Loading source files for package org.apache.rahas...
Loading source files for package org.apache.axis2.integration...
Constructing Javadoc information...
Standard Doclet version 1.8.0_131
Building tree for all the packages and classes...
Generating <https://builds.apache.org/job/rampart-1.7/org.apache.rampart$rampart-integration/ws/target/apidocs/org/apache/rampart/PWCallback.html...>
Generating <https://builds.apache.org/job/rampart-1.7/org.apache.rampart$rampart-integration/ws/target/apidocs/org/apache/rampart/RampartConfigUpdater.html...>
Generating <https://builds.apache.org/job/rampart-1.7/org.apache.rampart$rampart-integration/ws/target/apidocs/org/apache/rampart/Service.html...>
Generating <https://builds.apache.org/job/rampart-1.7/org.apache.rampart$rampart-integration/ws/target/apidocs/org/apache/rahas/PWCallback.html...>
Generating <https://builds.apache.org/job/rampart-1.7/org.apache.rampart$rampart-integration/ws/target/apidocs/org/apache/rahas/Service.html...>
Generating <https://builds.apache.org/job/rampart-1.7/org.apache.rampart$rampart-integration/ws/target/apidocs/org/apache/rahas/TestClient.html...>
Generating <https://builds.apache.org/job/rampart-1.7/org.apache.rampart$rampart-integration/ws/target/apidocs/org/apache/axis2/integration/JettyServer.html...>
Generating <https://builds.apache.org/job/rampart-1.7/org.apache.rampart$rampart-integration/ws/target/apidocs/org/apache/axis2/integration/TestingUtils.html...>
Generating <https://builds.apache.org/job/rampart-1.7/org.apache.rampart$rampart-integration/ws/target/apidocs/overview-frame.html...>
Generating <https://builds.apache.org/job/rampart-1.7/org.apache.rampart$rampart-integration/ws/target/apidocs/org/apache/axis2/integration/package-frame.html...>
Generating <https://builds.apache.org/job/rampart-1.7/org.apache.rampart$rampart-integration/ws/target/apidocs/org/apache/axis2/integration/package-summary.html...>
Generating <https://builds.apache.org/job/rampart-1.7/org.apache.rampart$rampart-integration/ws/target/apidocs/org/apache/axis2/integration/package-tree.html...>
Generating <https://builds.apache.org/job/rampart-1.7/org.apache.rampart$rampart-integration/ws/target/apidocs/org/apache/rahas/package-frame.html...>
Generating <https://builds.apache.org/job/rampart-1.7/org.apache.rampart$rampart-integration/ws/target/apidocs/org/apache/rahas/package-summary.html...>
Generating <https://builds.apache.org/job/rampart-1.7/org.apache.rampart$rampart-integration/ws/target/apidocs/org/apache/rahas/package-tree.html...>
Generating <https://builds.apache.org/job/rampart-1.7/org.apache.rampart$rampart-integration/ws/target/apidocs/org/apache/rampart/package-frame.html...>
Generating <https://builds.apache.org/job/rampart-1.7/org.apache.rampart$rampart-integration/ws/target/apidocs/org/apache/rampart/package-summary.html...>
Generating <https://builds.apache.org/job/rampart-1.7/org.apache.rampart$rampart-integration/ws/target/apidocs/org/apache/rampart/package-tree.html...>
Generating <https://builds.apache.org/job/rampart-1.7/org.apache.rampart$rampart-integration/ws/target/apidocs/constant-values.html...>
Generating <https://builds.apache.org/job/rampart-1.7/org.apache.rampart$rampart-integration/ws/target/apidocs/org/apache/rampart/class-use/PWCallback.html...>
Generating <https://builds.apache.org/job/rampart-1.7/org.apache.rampart$rampart-integration/ws/target/apidocs/org/apache/rampart/class-use/Service.html...>
Generating <https://builds.apache.org/job/rampart-1.7/org.apache.rampart$rampart-integration/ws/target/apidocs/org/apache/rampart/class-use/RampartConfigUpdater.html...>
Generating <https://builds.apache.org/job/rampart-1.7/org.apache.rampart$rampart-integration/ws/target/apidocs/org/apache/rahas/class-use/TestClient.html...>
Generating <https://builds.apache.org/job/rampart-1.7/org.apache.rampart$rampart-integration/ws/target/apidocs/org/apache/rahas/class-use/PWCallback.html...>
Generating <https://builds.apache.org/job/rampart-1.7/org.apache.rampart$rampart-integration/ws/target/apidocs/org/apache/rahas/class-use/Service.html...>
Generating <https://builds.apache.org/job/rampart-1.7/org.apache.rampart$rampart-integration/ws/target/apidocs/org/apache/axis2/integration/class-use/TestingUtils.html...>
Generating <https://builds.apache.org/job/rampart-1.7/org.apache.rampart$rampart-integration/ws/target/apidocs/org/apache/axis2/integration/class-use/JettyServer.html...>
Generating <https://builds.apache.org/job/rampart-1.7/org.apache.rampart$rampart-integration/ws/target/apidocs/org/apache/axis2/integration/package-use.html...>
Generating <https://builds.apache.org/job/rampart-1.7/org.apache.rampart$rampart-integration/ws/target/apidocs/org/apache/rahas/package-use.html...>
Generating <https://builds.apache.org/job/rampart-1.7/org.apache.rampart$rampart-integration/ws/target/apidocs/org/apache/rampart/package-use.html...>
Building index for all the packages and classes...
Generating <https://builds.apache.org/job/rampart-1.7/org.apache.rampart$rampart-integration/ws/target/apidocs/overview-tree.html...>
Generating <https://builds.apache.org/job/rampart-1.7/org.apache.rampart$rampart-integration/ws/target/apidocs/index-all.html...>
Generating <https://builds.apache.org/job/rampart-1.7/org.apache.rampart$rampart-integration/ws/target/apidocs/deprecated-list.html...>
Building index for all classes...
Generating <https://builds.apache.org/job/rampart-1.7/org.apache.rampart$rampart-integration/ws/target/apidocs/allclasses-frame.html...>
Generating <https://builds.apache.org/job/rampart-1.7/org.apache.rampart$rampart-integration/ws/target/apidocs/allclasses-noframe.html...>
Generating <https://builds.apache.org/job/rampart-1.7/org.apache.rampart$rampart-integration/ws/target/apidocs/index.html...>
Generating <https://builds.apache.org/job/rampart-1.7/org.apache.rampart$rampart-integration/ws/target/apidocs/overview-summary.html...>
Generating <https://builds.apache.org/job/rampart-1.7/org.apache.rampart$rampart-integration/ws/target/apidocs/help-doc.html...>
2 errors
14 warnings

---------------------------------------------------------------------
To unsubscribe, e-mail: java-dev-unsubscribe@axis.apache.org
For additional commands, e-mail: java-dev-help@axis.apache.org


Mime
View raw message