axis-java-dev mailing list archives

Site index · List index
Message view « Date » · « Thread »
Top « Date » · « Thread »
From Apache Jenkins Server <jenk...@builds.apache.org>
Subject Build failed in Jenkins: axis2-1.7 #125
Date Sun, 30 Jul 2017 12:33:56 GMT
See <https://builds.apache.org/job/axis2-1.7/125/display/redirect?page=changes>

Changes:

[veithen] AXIS2-5781: Merge r1787676 to the 1.7 branch.

------------------------------------------
[...truncated 534.24 KB...]
[ERROR] * <p/>
[ERROR] ^
[ERROR] <https://builds.apache.org/job/axis2-1.7/ws/axis2/modules/kernel/src/org/apache/axis2/client/Options.java>:798:
warning: empty <p> tag
[ERROR] * <p/>
[ERROR] ^
[ERROR] <https://builds.apache.org/job/axis2-1.7/ws/axis2/modules/kernel/src/org/apache/axis2/client/Options.java>:802:
error: tag not allowed here: <p>
[ERROR] * <p><a name="ACCEPT_GZIP"></a></p>
[ERROR] ^
[ERROR] <https://builds.apache.org/job/axis2-1.7/ws/axis2/modules/kernel/src/org/apache/axis2/client/Options.java>:808:
error: tag not allowed here: <p>
[ERROR] * <p/>
[ERROR] ^
[ERROR] <https://builds.apache.org/job/axis2-1.7/ws/axis2/modules/kernel/src/org/apache/axis2/client/Options.java>:809:
error: tag not allowed here: <p>
[ERROR] * <p><a name="COOKIE"></a></p>
[ERROR] ^
[ERROR] <https://builds.apache.org/job/axis2-1.7/ws/axis2/modules/kernel/src/org/apache/axis2/client/Options.java>:813:
error: tag not allowed here: <p>
[ERROR] * <p><a name="HTTP_PROTOCOL_VERSION"></a></p>
[ERROR] ^
[ERROR] <https://builds.apache.org/job/axis2-1.7/ws/axis2/modules/kernel/src/org/apache/axis2/client/Options.java>:818:
error: tag not allowed here: <p>
[ERROR] * <p/>
[ERROR] ^
[ERROR] <https://builds.apache.org/job/axis2-1.7/ws/axis2/modules/kernel/src/org/apache/axis2/client/Options.java>:822:
error: tag not allowed here: <p>
[ERROR] * <p><a name="HTTP_HEADERS"></a></p>
[ERROR] ^
[ERROR] <https://builds.apache.org/job/axis2-1.7/ws/axis2/modules/kernel/src/org/apache/axis2/client/Options.java>:827:
error: tag not allowed here: <p>
[ERROR] * <p><a name="REUSE_HTTP_CLIENT"></a></p>
[ERROR] ^
[ERROR] <https://builds.apache.org/job/axis2-1.7/ws/axis2/modules/kernel/src/org/apache/axis2/client/Options.java>:828:
error: tag not allowed here: <p>
[ERROR] * <p/>
[ERROR] ^
[ERROR] <https://builds.apache.org/job/axis2-1.7/ws/axis2/modules/kernel/src/org/apache/axis2/client/Options.java>:828:
warning: empty <p> tag
[ERROR] * <p/>
[ERROR] ^
[ERROR] <https://builds.apache.org/job/axis2-1.7/ws/axis2/modules/kernel/src/org/apache/axis2/client/Options.java>:832:
error: tag not allowed here: <p>
[ERROR] * <p><a name="CACHED_HTTP_CLIENT"></a></p>
[ERROR] ^
[ERROR] <https://builds.apache.org/job/axis2-1.7/ws/axis2/modules/kernel/src/org/apache/axis2/client/Options.java>:838:
error: self-closing element not allowed
[ERROR] * <p/>
[ERROR] ^
[ERROR] <https://builds.apache.org/job/axis2-1.7/ws/axis2/modules/kernel/src/org/apache/axis2/client/Options.java>:838:
warning: empty <p> tag
[ERROR] * <p/>
[ERROR] ^
[ERROR] <https://builds.apache.org/job/axis2-1.7/ws/axis2/modules/kernel/src/org/apache/axis2/client/Options.java>:841:
error: tag not allowed here: <a>
[ERROR] * <a name="ENABLE_REST"></a></p>
[ERROR] ^
[ERROR] <https://builds.apache.org/job/axis2-1.7/ws/axis2/modules/kernel/src/org/apache/axis2/client/Options.java>:841:
error: unexpected end tag: </p>
[ERROR] * <a name="ENABLE_REST"></a></p>
[ERROR] ^
[ERROR] <https://builds.apache.org/job/axis2-1.7/ws/axis2/modules/kernel/src/org/apache/axis2/client/Options.java>:847:
error: tag not allowed here: <p>
[ERROR] * <p><a name="HTTP_METHOD"></a></p>
[ERROR] ^
[ERROR] <https://builds.apache.org/job/axis2-1.7/ws/axis2/modules/kernel/src/org/apache/axis2/client/Options.java>:849:
error: self-closing element not allowed
[ERROR] * <p/>
[ERROR] ^
[ERROR] <https://builds.apache.org/job/axis2-1.7/ws/axis2/modules/kernel/src/org/apache/axis2/client/Options.java>:849:
warning: empty <p> tag
[ERROR] * <p/>
[ERROR] ^
[ERROR] <https://builds.apache.org/job/axis2-1.7/ws/axis2/modules/kernel/src/org/apache/axis2/client/Options.java>:857:
error: tag not allowed here: <p>
[ERROR] * <p><a name="CONTENT_TYPE"></a>  </p>
[ERROR] ^
[ERROR] <https://builds.apache.org/job/axis2-1.7/ws/axis2/modules/kernel/src/org/apache/axis2/client/Options.java>:859:
error: self-closing element not allowed
[ERROR] * <p>This will help the user to pick the content type to be used during a REST<br
/>
[ERROR] ^
[ERROR] <https://builds.apache.org/job/axis2-1.7/ws/axis2/modules/kernel/src/org/apache/axis2/client/Options.java>:860:
error: self-closing element not allowed
[ERROR] * <p/>
[ERROR] ^
[ERROR] <https://builds.apache.org/job/axis2-1.7/ws/axis2/modules/kernel/src/org/apache/axis2/client/Options.java>:864:
error: self-closing element not allowed
[ERROR] * <li>application/xml                   -<br />
[ERROR] ^
[ERROR] <https://builds.apache.org/job/axis2-1.7/ws/axis2/modules/kernel/src/org/apache/axis2/client/Options.java>:866:
error: self-closing element not allowed
[ERROR] * <li>application/x-www-form-urlencoded -<br />
[ERROR] ^
[ERROR] <https://builds.apache.org/job/axis2-1.7/ws/axis2/modules/kernel/src/org/apache/axis2/client/Options.java>:870:
warning: empty <p> tag
[ERROR] * <p/>
[ERROR] ^
[ERROR] <https://builds.apache.org/job/axis2-1.7/ws/axis2/modules/kernel/src/org/apache/axis2/client/Options.java>:877:
warning: no description for @param
[ERROR] * @param propertyKey
[ERROR] ^
[ERROR] <https://builds.apache.org/job/axis2-1.7/ws/axis2/modules/kernel/src/org/apache/axis2/client/Options.java>:878:
warning: no description for @param
[ERROR] * @param property
[ERROR] ^
[ERROR] <https://builds.apache.org/job/axis2-1.7/ws/axis2/modules/kernel/src/org/apache/axis2/client/Options.java>:894:
warning: no description for @param
[ERROR] * @param relatesTo
[ERROR] ^
[ERROR] <https://builds.apache.org/job/axis2-1.7/ws/axis2/modules/kernel/src/org/apache/axis2/client/Options.java>:915:
warning: no description for @param
[ERROR] * @param transportOut
[ERROR] ^
[ERROR] <https://builds.apache.org/job/axis2-1.7/ws/axis2/modules/kernel/src/org/apache/axis2/client/Options.java>:926:
warning: no description for @param
[ERROR] * @param axisConfiguration
[ERROR] ^
[ERROR] <https://builds.apache.org/job/axis2-1.7/ws/axis2/modules/kernel/src/org/apache/axis2/client/Options.java>:944:
warning: no description for @param
[ERROR] * @param soapVersionURI
[ERROR] ^
[ERROR] <https://builds.apache.org/job/axis2-1.7/ws/axis2/modules/kernel/src/org/apache/axis2/client/Options.java>:957:
warning: no description for @param
[ERROR] * @param timeOutInMilliSeconds
[ERROR] ^
[ERROR] <https://builds.apache.org/job/axis2-1.7/ws/axis2/modules/kernel/src/org/apache/axis2/client/Options.java>:979:
warning: no description for @param
[ERROR] * @param useSeparateListener
[ERROR] ^
[ERROR] <https://builds.apache.org/job/axis2-1.7/ws/axis2/modules/kernel/src/org/apache/axis2/client/Options.java>:1016:
warning: no description for @throws
[ERROR] * @throws IOException
[ERROR] ^
[ERROR] <https://builds.apache.org/job/axis2-1.7/ws/axis2/modules/kernel/src/org/apache/axis2/client/Options.java>:1139:
warning: no description for @throws
[ERROR] * @throws IOException
[ERROR] ^
[ERROR] <https://builds.apache.org/job/axis2-1.7/ws/axis2/modules/kernel/src/org/apache/axis2/client/Options.java>:1140:
warning: no description for @throws
[ERROR] * @throws ClassNotFoundException
[ERROR] ^
[ERROR] <https://builds.apache.org/job/axis2-1.7/ws/axis2/modules/kernel/src/org/apache/axis2/client/Options.java>:230:
warning: no description for @param
[ERROR] * @param parent
[ERROR] ^
[ERROR] <https://builds.apache.org/job/axis2-1.7/ws/axis2/modules/kernel/src/org/apache/axis2/client/ServiceClient.java>:776:
warning: no description for @throws
[ERROR] * @throws AxisFault
[ERROR] ^
[ERROR] <https://builds.apache.org/job/axis2-1.7/ws/axis2/modules/kernel/src/org/apache/axis2/client/Stub.java>:78:
warning: no description for @param
[ERROR] * @param _serviceClient
[ERROR] ^
[ERROR] <https://builds.apache.org/job/axis2-1.7/ws/axis2/modules/kernel/src/org/apache/axis2/client/Stub.java>:89:
warning: no description for @param
[ERROR] * @param options
[ERROR] ^
[ERROR] <https://builds.apache.org/job/axis2-1.7/ws/axis2/modules/kernel/src/org/apache/axis2/client/Stub.java>:91:
warning: no description for @throws
[ERROR] * @throws SOAPProcessingException
[ERROR] ^
[ERROR] <https://builds.apache.org/job/axis2-1.7/ws/axis2/modules/kernel/src/org/apache/axis2/client/Stub.java>:100:
warning: no description for @param
[ERROR] * @param soapVersionURI
[ERROR] ^
[ERROR] <https://builds.apache.org/job/axis2-1.7/ws/axis2/modules/kernel/src/org/apache/axis2/client/Stub.java>:119:
warning: no description for @throws
[ERROR] * @throws Throwable
[ERROR] ^
[ERROR] <https://builds.apache.org/job/axis2-1.7/ws/axis2/modules/kernel/src/org/apache/axis2/client/Stub.java>:130:
warning: no description for @throws
[ERROR] * @throws AxisFault
[ERROR] ^
[ERROR] <https://builds.apache.org/job/axis2-1.7/ws/axis2/modules/kernel/src/org/apache/axis2/client/Stub.java>:140:
warning: no description for @param
[ERROR] * @param address
[ERROR] ^
[ERROR] <https://builds.apache.org/job/axis2-1.7/ws/axis2/modules/kernel/src/org/apache/axis2/client/Stub.java>:151:
warning: no description for @param
[ERROR] * @param messageContext
[ERROR] ^
[ERROR] <https://builds.apache.org/job/axis2-1.7/ws/axis2/modules/kernel/src/org/apache/axis2/client/Stub.java>:152:
warning: no description for @param
[ERROR] * @param name
[ERROR] ^
[ERROR] <https://builds.apache.org/job/axis2-1.7/ws/axis2/modules/kernel/src/org/apache/axis2/client/Stub.java>:153:
warning: no description for @param
[ERROR] * @param value
[ERROR] ^
[ERROR] <https://builds.apache.org/job/axis2-1.7/ws/axis2/modules/kernel/src/org/apache/axis2/client/Stub.java>:171:
warning: no description for @param
[ERROR] * @param operationClient
[ERROR] ^
[ERROR] <https://builds.apache.org/job/axis2-1.7/ws/axis2/modules/kernel/src/org/apache/axis2/client/Stub.java>:172:
warning: no description for @param
[ERROR] * @param propertyKey
[ERROR] ^
[ERROR] <https://builds.apache.org/job/axis2-1.7/ws/axis2/modules/kernel/src/org/apache/axis2/client/Stub.java>:173:
warning: no description for @param
[ERROR] * @param propertyValue
[ERROR] ^
[ERROR] 
[ERROR] Command line was: /usr/local/asfpackages/java/jdk1.8.0_131/jre/../bin/javadoc @options
@packages
[ERROR] 
[ERROR] Refer to the generated Javadoc files in '<https://builds.apache.org/job/axis2-1.7/ws/axis2/modules/kernel/target/apidocs'>
dir.
[ERROR] -> [Help 1]
[ERROR] 
[ERROR] To see the full stack trace of the errors, re-run Maven with the -e switch.
[ERROR] Re-run Maven using the -X switch to enable full debug logging.
[ERROR] 
[ERROR] For more information about the errors and possible solutions, please read the following
articles:
[ERROR] [Help 1] http://cwiki.apache.org/confluence/display/MAVEN/MojoExecutionException
[ERROR] 
[ERROR] After correcting the problems, you can resume the build with the command
[ERROR]   mvn <goals> -rf :axis2-kernel
[JENKINS] Archiving <https://builds.apache.org/job/axis2-1.7/ws/axis2/modules/tool/archetype/quickstart/pom.xml>
to org.apache.axis2.archetype/quickstart/1.7.6-SNAPSHOT/quickstart-1.7.6-SNAPSHOT.pom
[JENKINS] Archiving <https://builds.apache.org/job/axis2-1.7/ws/axis2/apidocs/pom.xml>
to org.apache.axis2/apidocs/1.7.6-SNAPSHOT/apidocs-1.7.6-SNAPSHOT.pom
[JENKINS] Archiving <https://builds.apache.org/job/axis2-1.7/ws/axis2/modules/tool/axis2-aar-maven-plugin/pom.xml>
to org.apache.axis2/axis2-aar-maven-plugin/1.7.6-SNAPSHOT/axis2-aar-maven-plugin-1.7.6-SNAPSHOT.pom
[JENKINS] Archiving <https://builds.apache.org/job/axis2-1.7/ws/axis2/modules/resource-bundle/pom.xml>
to org.apache.axis2/axis2-resource-bundle/1.7.6-SNAPSHOT/axis2-resource-bundle-1.7.6-SNAPSHOT.pom
[JENKINS] Archiving <https://builds.apache.org/job/axis2-1.7/ws/axis2/modules/resource-bundle/target/axis2-resource-bundle-1.7.6-SNAPSHOT.jar>
to org.apache.axis2/axis2-resource-bundle/1.7.6-20170730.123141-7/axis2-resource-bundle-1.7.6-20170730.123141-7.jar
[JENKINS] Archiving <https://builds.apache.org/job/axis2-1.7/ws/axis2/modules/resource-bundle/target/axis2-resource-bundle-1.7.6-SNAPSHOT-sources.jar>
to org.apache.axis2/axis2-resource-bundle/1.7.6-20170730.123141-7/axis2-resource-bundle-1.7.6-20170730.123141-7-sources.jar
[JENKINS] Archiving <https://builds.apache.org/job/axis2-1.7/ws/axis2/modules/adb-codegen/pom.xml>
to org.apache.axis2/axis2-adb-codegen/1.7.6-SNAPSHOT/axis2-adb-codegen-1.7.6-SNAPSHOT.pom
[JENKINS] Archiving <https://builds.apache.org/job/axis2-1.7/ws/axis2/modules/tool/axis2-idea-plugin/pom.xml>
to org.apache.axis2/axis2-idea-plugin/1.7.6-SNAPSHOT/axis2-idea-plugin-1.7.6-SNAPSHOT.pom
[JENKINS] Archiving <https://builds.apache.org/job/axis2-1.7/ws/axis2/modules/transport/jms/pom.xml>
to org.apache.axis2/axis2-transport-jms/1.7.6-SNAPSHOT/axis2-transport-jms-1.7.6-SNAPSHOT.pom
[JENKINS] Archiving <https://builds.apache.org/job/axis2-1.7/ws/axis2/modules/tool/archetype/quickstart-webapp/pom.xml>
to org.apache.axis2.archetype/quickstart-webapp/1.7.6-SNAPSHOT/quickstart-webapp-1.7.6-SNAPSHOT.pom
[JENKINS] Archiving <https://builds.apache.org/job/axis2-1.7/ws/axis2/modules/tool/simple-server-maven-plugin/pom.xml>
to org.apache.axis2/simple-server-maven-plugin/1.7.6-SNAPSHOT/simple-server-maven-plugin-1.7.6-SNAPSHOT.pom
[JENKINS] Archiving <https://builds.apache.org/job/axis2-1.7/ws/axis2/modules/transport/base/pom.xml>
to org.apache.axis2/axis2-transport-base/1.7.6-SNAPSHOT/axis2-transport-base-1.7.6-SNAPSHOT.pom
[JENKINS] Archiving <https://builds.apache.org/job/axis2-1.7/ws/axis2/modules/soapmonitor/servlet/pom.xml>
to org.apache.axis2/axis2-soapmonitor-servlet/1.7.6-SNAPSHOT/axis2-soapmonitor-servlet-1.7.6-SNAPSHOT.pom
[JENKINS] Archiving <https://builds.apache.org/job/axis2-1.7/ws/axis2/modules/samples/jaxws-interop/pom.xml>
to org.apache.axis2.examples/jaxws-interop/1.7.6-SNAPSHOT/jaxws-interop-1.7.6-SNAPSHOT.pom
[JENKINS] Archiving <https://builds.apache.org/job/axis2-1.7/ws/axis2/modules/corba/pom.xml>
to org.apache.axis2/axis2-corba/1.7.6-SNAPSHOT/axis2-corba-1.7.6-SNAPSHOT.pom
[JENKINS] Archiving <https://builds.apache.org/job/axis2-1.7/ws/axis2/modules/osgi/pom.xml>
to org.apache.axis2/org.apache.axis2.osgi/1.7.6-SNAPSHOT/org.apache.axis2.osgi-1.7.6-SNAPSHOT.pom
[JENKINS] Archiving <https://builds.apache.org/job/axis2-1.7/ws/axis2/modules/samples/jaxws-addressbook/pom.xml>
to org.apache.axis2.examples/jaxws-addressbook/1.7.6-SNAPSHOT/jaxws-addressbook-1.7.6-SNAPSHOT.pom
[JENKINS] Archiving <https://builds.apache.org/job/axis2-1.7/ws/axis2/modules/addressing/pom.xml>
to org.apache.axis2/addressing/1.7.6-SNAPSHOT/addressing-1.7.6-SNAPSHOT.pom
[JENKINS] Archiving <https://builds.apache.org/job/axis2-1.7/ws/axis2/modules/tool/axis2-ant-plugin/pom.xml>
to org.apache.axis2/axis2-ant-plugin/1.7.6-SNAPSHOT/axis2-ant-plugin-1.7.6-SNAPSHOT.pom
[JENKINS] Archiving <https://builds.apache.org/job/axis2-1.7/ws/axis2/modules/json/pom.xml>
to org.apache.axis2/axis2-json/1.7.6-SNAPSHOT/axis2-json-1.7.6-SNAPSHOT.pom
[JENKINS] Archiving <https://builds.apache.org/job/axis2-1.7/ws/axis2/modules/samples/transport/jms-sample/pom.xml>
to org.apache.axis2.examples/jms-sample/1.7.6-SNAPSHOT/jms-sample-1.7.6-SNAPSHOT.pom
[JENKINS] Archiving <https://builds.apache.org/job/axis2-1.7/ws/axis2/modules/samples/jaxws-version/pom.xml>
to org.apache.axis2.examples/jaxws-version/1.7.6-SNAPSHOT/jaxws-version-1.7.6-SNAPSHOT.pom
[JENKINS] Archiving <https://builds.apache.org/job/axis2-1.7/ws/axis2/modules/integration/pom.xml>
to org.apache.axis2/axis2-integration/1.7.6-SNAPSHOT/axis2-integration-1.7.6-SNAPSHOT.pom
[JENKINS] Archiving <https://builds.apache.org/job/axis2-1.7/ws/axis2/modules/osgi-tests/pom.xml>
to org.apache.axis2/osgi-tests/1.7.6-SNAPSHOT/osgi-tests-1.7.6-SNAPSHOT.pom
[JENKINS] Archiving <https://builds.apache.org/job/axis2-1.7/ws/axis2/modules/samples/version/pom.xml>
to org.apache.axis2/version/1.7.6-SNAPSHOT/version-1.7.6-SNAPSHOT.pom
[JENKINS] Archiving <https://builds.apache.org/job/axis2-1.7/ws/axis2/modules/saaj/pom.xml>
to org.apache.axis2/axis2-saaj/1.7.6-SNAPSHOT/axis2-saaj-1.7.6-SNAPSHOT.pom
[JENKINS] Archiving <https://builds.apache.org/job/axis2-1.7/ws/axis2/modules/tool/axis2-eclipse-service-plugin/pom.xml>
to org.apache.axis2/axis2.eclipse.service.plugin/1.7.6-SNAPSHOT/axis2.eclipse.service.plugin-1.7.6-SNAPSHOT.pom
[JENKINS] Archiving <https://builds.apache.org/job/axis2-1.7/ws/axis2/modules/samples/transport/https-sample/httpsService/pom.xml>
to org.apache.axis2.examples/httpsService/1.7.6-SNAPSHOT/httpsService-1.7.6-SNAPSHOT.pom
[JENKINS] Archiving <https://builds.apache.org/job/axis2-1.7/ws/axis2/systests/pom.xml>
to org.apache.axis2/systests/1.7.6-SNAPSHOT/systests-1.7.6-SNAPSHOT.pom
[JENKINS] Archiving <https://builds.apache.org/job/axis2-1.7/ws/axis2/modules/tool/axis2-eclipse-codegen-plugin/pom.xml>
to org.apache.axis2/axis2.eclipse.codegen.plugin/1.7.6-SNAPSHOT/axis2.eclipse.codegen.plugin-1.7.6-SNAPSHOT.pom
[JENKINS] Archiving <https://builds.apache.org/job/axis2-1.7/ws/axis2/modules/jaxws/pom.xml>
to org.apache.axis2/axis2-jaxws/1.7.6-SNAPSHOT/axis2-jaxws-1.7.6-SNAPSHOT.pom
[JENKINS] Archiving <https://builds.apache.org/job/axis2-1.7/ws/axis2/modules/tool/axis2-java2wsdl-maven-plugin/pom.xml>
to org.apache.axis2/axis2-java2wsdl-maven-plugin/1.7.6-SNAPSHOT/axis2-java2wsdl-maven-plugin-1.7.6-SNAPSHOT.pom
[JENKINS] Archiving <https://builds.apache.org/job/axis2-1.7/ws/axis2/modules/tool/axis2-mar-maven-plugin/pom.xml>
to org.apache.axis2/axis2-mar-maven-plugin/1.7.6-SNAPSHOT/axis2-mar-maven-plugin-1.7.6-SNAPSHOT.pom
[JENKINS] Archiving <https://builds.apache.org/job/axis2-1.7/ws/axis2/modules/samples/java_first_jaxws/pom.xml>
to org.apache.axis2.examples/java_first_jaxws/1.7.6-SNAPSHOT/java_first_jaxws-1.7.6-SNAPSHOT.pom
[JENKINS] Archiving <https://builds.apache.org/job/axis2-1.7/ws/axis2/pom.xml> to org.apache.axis2/axis2/1.7.6-SNAPSHOT/axis2-1.7.6-SNAPSHOT.pom
[JENKINS] Archiving <https://builds.apache.org/job/axis2-1.7/ws/axis2/target/axis2-1.7.6-SNAPSHOT-site.xml>
to org.apache.axis2/axis2/1.7.6-20170730.123125-7/axis2-1.7.6-20170730.123125-7-site.xml
[JENKINS] Archiving <https://builds.apache.org/job/axis2-1.7/ws/axis2/modules/jaxbri/pom.xml>
to org.apache.axis2/axis2-jaxbri/1.7.6-SNAPSHOT/axis2-jaxbri-1.7.6-SNAPSHOT.pom
[JENKINS] Archiving <https://builds.apache.org/job/axis2-1.7/ws/axis2/modules/transport/testkit/pom.xml>
to org.apache.axis2/axis2-transport-testkit/1.7.6-SNAPSHOT/axis2-transport-testkit-1.7.6-SNAPSHOT.pom
[JENKINS] Archiving <https://builds.apache.org/job/axis2-1.7/ws/axis2/modules/soapmonitor/module/pom.xml>
to org.apache.axis2/soapmonitor/1.7.6-SNAPSHOT/soapmonitor-1.7.6-SNAPSHOT.pom
[JENKINS] Archiving <https://builds.apache.org/job/axis2-1.7/ws/axis2/modules/ping/pom.xml>
to org.apache.axis2/ping/1.7.6-SNAPSHOT/ping-1.7.6-SNAPSHOT.pom
[JENKINS] Archiving <https://builds.apache.org/job/axis2-1.7/ws/axis2/modules/adb-tests/pom.xml>
to org.apache.axis2/axis2-adb-tests/1.7.6-SNAPSHOT/axis2-adb-tests-1.7.6-SNAPSHOT.pom
[JENKINS] Archiving <https://builds.apache.org/job/axis2-1.7/ws/axis2/modules/tool/axis2-repo-maven-plugin/pom.xml>
to org.apache.axis2/axis2-repo-maven-plugin/1.7.6-SNAPSHOT/axis2-repo-maven-plugin-1.7.6-SNAPSHOT.pom
[JENKINS] Archiving <https://builds.apache.org/job/axis2-1.7/ws/axis2/modules/transport/udp/pom.xml>
to org.apache.axis2/axis2-transport-udp/1.7.6-SNAPSHOT/axis2-transport-udp-1.7.6-SNAPSHOT.pom
[JENKINS] Archiving <https://builds.apache.org/job/axis2-1.7/ws/axis2/modules/jaxws-integration/pom.xml>
to org.apache.axis2/axis2-jaxws-integration/1.7.6-SNAPSHOT/axis2-jaxws-integration-1.7.6-SNAPSHOT.pom
[Fast Archiver] Compressed 89.72 KB of artifacts by 35.7% relative to #123
[JENKINS] Archiving <https://builds.apache.org/job/axis2-1.7/ws/axis2/modules/metadata/pom.xml>
to org.apache.axis2/axis2-metadata/1.7.6-SNAPSHOT/axis2-metadata-1.7.6-SNAPSHOT.pom
[JENKINS] Archiving <https://builds.apache.org/job/axis2-1.7/ws/axis2/modules/transport/http/pom.xml>
to org.apache.axis2/axis2-transport-http/1.7.6-SNAPSHOT/axis2-transport-http-1.7.6-SNAPSHOT.pom
[JENKINS] Archiving <https://builds.apache.org/job/axis2-1.7/ws/axis2/modules/xmlbeans/pom.xml>
to org.apache.axis2/axis2-xmlbeans/1.7.6-SNAPSHOT/axis2-xmlbeans-1.7.6-SNAPSHOT.pom
[JENKINS] Archiving <https://builds.apache.org/job/axis2-1.7/ws/axis2/modules/distribution/pom.xml>
to org.apache.axis2/distribution/1.7.6-SNAPSHOT/distribution-1.7.6-SNAPSHOT.pom
[JENKINS] Archiving <https://builds.apache.org/job/axis2-1.7/ws/axis2/modules/webapp/pom.xml>
to org.apache.axis2/axis2-webapp/1.7.6-SNAPSHOT/axis2-webapp-1.7.6-SNAPSHOT.pom
[JENKINS] Archiving <https://builds.apache.org/job/axis2-1.7/ws/axis2/modules/samples/transport/https-sample/httpsClient/pom.xml>
to org.apache.axis2.examples/httpsClient/1.7.6-SNAPSHOT/httpsClient-1.7.6-SNAPSHOT.pom
[JENKINS] Archiving <https://builds.apache.org/job/axis2-1.7/ws/axis2/modules/samples/jaxws-calculator/pom.xml>
to org.apache.axis2.examples/jaxws-calculator/1.7.6-SNAPSHOT/jaxws-calculator-1.7.6-SNAPSHOT.pom
[JENKINS] Archiving <https://builds.apache.org/job/axis2-1.7/ws/axis2/systests/webapp-tests/pom.xml>
to org.apache.axis2/webapp-tests/1.7.6-SNAPSHOT/webapp-tests-1.7.6-SNAPSHOT.pom
[JENKINS] Archiving <https://builds.apache.org/job/axis2-1.7/ws/axis2/modules/scripting/pom.xml>
to org.apache.axis2/scripting/1.7.6-SNAPSHOT/scripting-1.7.6-SNAPSHOT.pom
[JENKINS] Archiving <https://builds.apache.org/job/axis2-1.7/ws/axis2/modules/jibx/pom.xml>
to org.apache.axis2/axis2-jibx/1.7.6-SNAPSHOT/axis2-jibx-1.7.6-SNAPSHOT.pom
[JENKINS] Archiving <https://builds.apache.org/job/axis2-1.7/ws/axis2/modules/fastinfoset/pom.xml>
to org.apache.axis2/axis2-fastinfoset/1.7.6-SNAPSHOT/axis2-fastinfoset-1.7.6-SNAPSHOT.pom
[JENKINS] Archiving <https://builds.apache.org/job/axis2-1.7/ws/axis2/modules/spring/pom.xml>
to org.apache.axis2/axis2-spring/1.7.6-SNAPSHOT/axis2-spring-1.7.6-SNAPSHOT.pom
[JENKINS] Archiving <https://builds.apache.org/job/axis2-1.7/ws/axis2/modules/testutils/pom.xml>
to org.apache.axis2/axis2-testutils/1.7.6-SNAPSHOT/axis2-testutils-1.7.6-SNAPSHOT.pom
[JENKINS] Archiving <https://builds.apache.org/job/axis2-1.7/ws/axis2/modules/java2wsdl/pom.xml>
to org.apache.axis2/axis2-java2wsdl/1.7.6-SNAPSHOT/axis2-java2wsdl-1.7.6-SNAPSHOT.pom
[JENKINS] Archiving <https://builds.apache.org/job/axis2-1.7/ws/axis2/modules/samples/jaxws-samples/pom.xml>
to org.apache.axis2.examples/jaxws-samples/1.7.6-SNAPSHOT/jaxws-samples-1.7.6-SNAPSHOT.pom
[JENKINS] Archiving <https://builds.apache.org/job/axis2-1.7/ws/axis2/modules/mtompolicy-mar/pom.xml>
to org.apache.axis2/mtompolicy/1.7.6-SNAPSHOT/mtompolicy-1.7.6-SNAPSHOT.pom
[JENKINS] Archiving <https://builds.apache.org/job/axis2-1.7/ws/axis2/modules/clustering/pom.xml>
to org.apache.axis2/axis2-clustering/1.7.6-SNAPSHOT/axis2-clustering-1.7.6-SNAPSHOT.pom
[JENKINS] Archiving <https://builds.apache.org/job/axis2-1.7/ws/axis2/modules/samples/transport/jms-sample/jmsService/pom.xml>
to org.apache.axis2.examples/jmsService/1.7.6-SNAPSHOT/jmsService-1.7.6-SNAPSHOT.pom
[JENKINS] Archiving <https://builds.apache.org/job/axis2-1.7/ws/axis2/modules/mex/pom.xml>
to org.apache.axis2/mex/1.7.6-SNAPSHOT/mex-1.7.6-SNAPSHOT.pom
[JENKINS] Archiving <https://builds.apache.org/job/axis2-1.7/ws/axis2/modules/codegen/pom.xml>
to org.apache.axis2/axis2-codegen/1.7.6-SNAPSHOT/axis2-codegen-1.7.6-SNAPSHOT.pom
[JENKINS] Archiving <https://builds.apache.org/job/axis2-1.7/ws/axis2/modules/transport/tcp/pom.xml>
to org.apache.axis2/axis2-transport-tcp/1.7.6-SNAPSHOT/axis2-transport-tcp-1.7.6-SNAPSHOT.pom
[JENKINS] Archiving <https://builds.apache.org/job/axis2-1.7/ws/axis2/modules/mtompolicy/pom.xml>
to org.apache.axis2/axis2-mtompolicy/1.7.6-SNAPSHOT/axis2-mtompolicy-1.7.6-SNAPSHOT.pom
[JENKINS] Archiving <https://builds.apache.org/job/axis2-1.7/ws/axis2/modules/samples/pom.xml>
to org.apache.axis2.examples/samples/1.7.6-SNAPSHOT/samples-1.7.6-SNAPSHOT.pom
[JENKINS] Archiving <https://builds.apache.org/job/axis2-1.7/ws/axis2/modules/kernel/pom.xml>
to org.apache.axis2/axis2-kernel/1.7.6-SNAPSHOT/axis2-kernel-1.7.6-SNAPSHOT.pom
[JENKINS] Archiving <https://builds.apache.org/job/axis2-1.7/ws/axis2/modules/kernel/target/axis2-kernel-1.7.6-SNAPSHOT.jar>
to org.apache.axis2/axis2-kernel/1.7.6-SNAPSHOT/axis2-kernel-1.7.6-SNAPSHOT.jar
[JENKINS] Archiving <https://builds.apache.org/job/axis2-1.7/ws/axis2/modules/kernel/target/axis2-kernel-1.7.6-SNAPSHOT-sources.jar>
to org.apache.axis2/axis2-kernel/1.7.6-SNAPSHOT/axis2-kernel-1.7.6-SNAPSHOT-sources.jar
[JENKINS] Archiving <https://builds.apache.org/job/axis2-1.7/ws/axis2/modules/jaxws-mar/pom.xml>
to org.apache.axis2/axis2-jaxws-mar/1.7.6-SNAPSHOT/axis2-jaxws-mar-1.7.6-SNAPSHOT.pom
[JENKINS] Archiving <https://builds.apache.org/job/axis2-1.7/ws/axis2/modules/transport/xmpp/pom.xml>
to org.apache.axis2/axis2-transport-xmpp/1.7.6-SNAPSHOT/axis2-transport-xmpp-1.7.6-SNAPSHOT.pom
[JENKINS] Archiving <https://builds.apache.org/job/axis2-1.7/ws/axis2/modules/tool/axis2-wsdl2code-maven-plugin/pom.xml>
to org.apache.axis2/axis2-wsdl2code-maven-plugin/1.7.6-SNAPSHOT/axis2-wsdl2code-maven-plugin-1.7.6-SNAPSHOT.pom
[JENKINS] Archiving <https://builds.apache.org/job/axis2-1.7/ws/axis2/modules/adb/pom.xml>
to org.apache.axis2/axis2-adb/1.7.6-SNAPSHOT/axis2-adb-1.7.6-SNAPSHOT.pom
[JENKINS] Archiving <https://builds.apache.org/job/axis2-1.7/ws/axis2/modules/samples/transport/https-sample/pom.xml>
to org.apache.axis2.examples/https-sample/1.7.6-SNAPSHOT/https-sample-1.7.6-SNAPSHOT.pom
[JENKINS] Archiving <https://builds.apache.org/job/axis2-1.7/ws/axis2/modules/transport/local/pom.xml>
to org.apache.axis2/axis2-transport-local/1.7.6-SNAPSHOT/axis2-transport-local-1.7.6-SNAPSHOT.pom
[JENKINS] Archiving <https://builds.apache.org/job/axis2-1.7/ws/axis2/modules/transport/mail/pom.xml>
to org.apache.axis2/axis2-transport-mail/1.7.6-SNAPSHOT/axis2-transport-mail-1.7.6-SNAPSHOT.pom
Sending e-mails to: java-dev@axis.apache.org
[locks-and-latches] Releasing all the locks
[locks-and-latches] All the locks released
channel stopped
[JIRA] Updating issue AXIS2-5781

---------------------------------------------------------------------
To unsubscribe, e-mail: java-dev-unsubscribe@axis.apache.org
For additional commands, e-mail: java-dev-help@axis.apache.org


Mime
View raw message