axis-java-dev mailing list archives

Site index · List index
Message view « Date » · « Thread »
Top « Date » · « Thread »
From Apache Jenkins Server <jenk...@builds.apache.org>
Subject Build failed in Jenkins: Rampart #2339
Date Sat, 28 Jan 2017 17:04:41 GMT
See <https://builds.apache.org/job/Rampart/2339/changes>

Changes:

[veithen] Move JettyServer to Axis2's testutils.

------------------------------------------
[...truncated 1719 lines...]
[INFO] Uploading: https://repository.apache.org/content/repositories/snapshots/org/apache/rampart/rampart/1.8.0-SNAPSHOT/maven-metadata.xml
[INFO] Uploaded: https://repository.apache.org/content/repositories/snapshots/org/apache/rampart/rampart/1.8.0-SNAPSHOT/maven-metadata.xml
(2 KB at 22.6 KB/sec)
[INFO] Uploading: https://repository.apache.org/content/repositories/snapshots/org/apache/rampart/rampart/1.8.0-SNAPSHOT/rampart-1.8.0-20170128.170402-213.jar
[INFO] Uploaded: https://repository.apache.org/content/repositories/snapshots/org/apache/rampart/rampart/1.8.0-SNAPSHOT/rampart-1.8.0-20170128.170402-213.jar
(10 KB at 94.9 KB/sec)
[INFO] Uploading: https://repository.apache.org/content/repositories/snapshots/org/apache/rampart/rampart/1.8.0-SNAPSHOT/maven-metadata.xml
[INFO] Uploaded: https://repository.apache.org/content/repositories/snapshots/org/apache/rampart/rampart/1.8.0-SNAPSHOT/maven-metadata.xml
(2 KB at 17.8 KB/sec)
[INFO] Uploading: https://repository.apache.org/content/repositories/snapshots/org/apache/rampart/rampart/1.8.0-SNAPSHOT/rampart-1.8.0-20170128.170402-213-sources.jar
[INFO] Uploaded: https://repository.apache.org/content/repositories/snapshots/org/apache/rampart/rampart/1.8.0-SNAPSHOT/rampart-1.8.0-20170128.170402-213-sources.jar
(7 KB at 73.6 KB/sec)
[INFO] Uploading: https://repository.apache.org/content/repositories/snapshots/org/apache/rampart/rampart/1.8.0-SNAPSHOT/maven-metadata.xml
[INFO] Uploaded: https://repository.apache.org/content/repositories/snapshots/org/apache/rampart/rampart/1.8.0-SNAPSHOT/maven-metadata.xml
(2 KB at 19.1 KB/sec)
[INFO]                                                                         
[INFO] ------------------------------------------------------------------------
[INFO] Building Rampart - Trust-Mar 1.8.0-SNAPSHOT
[INFO] ------------------------------------------------------------------------
[INFO] 
[INFO] --- maven-clean-plugin:2.5:clean (default-clean) @ rahas ---
[INFO] Deleting <https://builds.apache.org/job/Rampart/ws/trunk/modules/rampart-trust-mar/target>
[INFO] 
[INFO] --- maven-enforcer-plugin:1.1:enforce (default) @ rahas ---
[INFO] 
[INFO] --- gmavenplus-plugin:1.5:execute (initialize) @ rahas ---
[INFO] Using Groovy 2.4.4 to perform execute.
[INFO] 
[INFO] --- jacoco-maven-plugin:0.7.5.201505241946:prepare-agent (prepare-agent-for-surefire)
@ rahas ---
[INFO] jacoco.surefireArgLine set to -javaagent:<https://builds.apache.org/job/Rampart/ws/.repository/org/jacoco/org.jacoco.agent/0.7.5.201505241946/org.jacoco.agent-0.7.5.201505241946-runtime.jar=destfile=/home/jenkins/jenkins-slave/workspace/Rampart/trunk/modules/rampart-trust-mar/target/jacoco.exec,sessionid=mvn>:org.apache.rampart:rahas:1.8.0-SNAPSHOT:surefire
[INFO] 
[INFO] --- maven-remote-resources-plugin:1.5:process (default) @ rahas ---
[INFO] 
[INFO] --- maven-resources-plugin:2.7:resources (default-resources) @ rahas ---
[INFO] Using 'UTF-8' encoding to copy filtered resources.
[INFO] skip non existing resourceDirectory <https://builds.apache.org/job/Rampart/ws/trunk/modules/rampart-trust-mar/src/main/resources>
[INFO] Copying 3 resources
[INFO] 
[INFO] --- maven-compiler-plugin:2.0:compile (default-compile) @ rahas ---
[INFO] No sources to compile
[INFO] 
[INFO] --- maven-resources-plugin:2.7:testResources (default-testResources) @ rahas ---
[INFO] Using 'UTF-8' encoding to copy filtered resources.
[INFO] skip non existing resourceDirectory <https://builds.apache.org/job/Rampart/ws/trunk/modules/rampart-trust-mar/src/test/resources>
[INFO] Copying 3 resources
[INFO] 
[INFO] --- maven-compiler-plugin:2.0:testCompile (default-testCompile) @ rahas ---
[INFO] No sources to compile
[INFO] 
[INFO] --- maven-surefire-plugin:2.10:test (default-test) @ rahas ---
[INFO] Surefire report directory: <https://builds.apache.org/job/Rampart/ws/trunk/modules/rampart-trust-mar/target/surefire-reports>

-------------------------------------------------------
 T E S T S
-------------------------------------------------------

Results :

Tests run: 0, Failures: 0, Errors: 0, Skipped: 0

[JENKINS] Recording test results[INFO] 

[INFO] --- build-helper-maven-plugin:1.7:attach-artifact (attach-jacoco-exec) @ rahas ---
[INFO] 
[INFO] --- axis2-mar-maven-plugin:1.8.0-SNAPSHOT:mar (default-mar) @ rahas ---
[INFO] Generating mar <https://builds.apache.org/job/Rampart/ws/trunk/modules/rampart-trust-mar/target/rahas-1.8.0-SNAPSHOT.mar>
[INFO] Building jar: <https://builds.apache.org/job/Rampart/ws/trunk/modules/rampart-trust-mar/target/rahas-1.8.0-SNAPSHOT.mar>
[INFO] 
[INFO] --- maven-site-plugin:3.4:attach-descriptor (attach-descriptor) @ rahas ---
[INFO] 
[INFO] --- maven-assembly-plugin:2.6:single (source-release-assembly) @ rahas ---
[INFO] Assemblies have been skipped per configuration of the skipAssembly parameter.
[INFO] 
[INFO] --- maven-source-plugin:2.4:jar-no-fork (source-jars) @ rahas ---
[INFO] Building jar: <https://builds.apache.org/job/Rampart/ws/trunk/modules/rampart-trust-mar/target/rahas-1.8.0-SNAPSHOT-sources.jar>
[INFO] 
[INFO] --- maven-javadoc-plugin:2.10.3:jar (attach-javadocs) @ rahas ---
[INFO] 
[INFO] --- animal-sniffer-maven-plugin:1.14:check (check) @ rahas ---
[INFO] Checking unresolved references to org.codehaus.mojo.signature:java16:1.1
[INFO] 
[INFO] --- maven-gpg-plugin:1.5:sign (default) @ rahas ---
[INFO] 
[INFO] --- maven-install-plugin:2.5.2:install (default-install) @ rahas ---
[INFO] Installing <https://builds.apache.org/job/Rampart/ws/trunk/modules/rampart-trust-mar/target/rahas-1.8.0-SNAPSHOT.mar>
to <https://builds.apache.org/job/Rampart/ws/.repository/org/apache/rampart/rahas/1.8.0-SNAPSHOT/rahas-1.8.0-SNAPSHOT.mar>
[INFO] Installing <https://builds.apache.org/job/Rampart/ws/trunk/modules/rampart-trust-mar/pom.xml>
to <https://builds.apache.org/job/Rampart/ws/.repository/org/apache/rampart/rahas/1.8.0-SNAPSHOT/rahas-1.8.0-SNAPSHOT.pom>
[INFO] Installing <https://builds.apache.org/job/Rampart/ws/trunk/modules/rampart-trust-mar/target/jacoco.exec>
to <https://builds.apache.org/job/Rampart/ws/.repository/org/apache/rampart/rahas/1.8.0-SNAPSHOT/rahas-1.8.0-SNAPSHOT-jacoco.exec>
[INFO] Installing <https://builds.apache.org/job/Rampart/ws/trunk/modules/rampart-trust-mar/target/rahas-1.8.0-SNAPSHOT-sources.jar>
to <https://builds.apache.org/job/Rampart/ws/.repository/org/apache/rampart/rahas/1.8.0-SNAPSHOT/rahas-1.8.0-SNAPSHOT-sources.jar>
[INFO] 
[INFO] --- maven-deploy-plugin:2.8.2:deploy (default-deploy) @ rahas ---
[INFO] Downloading: https://repository.apache.org/content/repositories/snapshots/org/apache/rampart/rahas/1.8.0-SNAPSHOT/maven-metadata.xml
[INFO] Downloaded: https://repository.apache.org/content/repositories/snapshots/org/apache/rampart/rahas/1.8.0-SNAPSHOT/maven-metadata.xml
(2 KB at 24.1 KB/sec)
[INFO] Uploading: https://repository.apache.org/content/repositories/snapshots/org/apache/rampart/rahas/1.8.0-SNAPSHOT/rahas-1.8.0-20170128.170409-213.mar
[INFO] Uploaded: https://repository.apache.org/content/repositories/snapshots/org/apache/rampart/rahas/1.8.0-SNAPSHOT/rahas-1.8.0-20170128.170409-213.mar
(10 KB at 69.6 KB/sec)
[INFO] Uploading: https://repository.apache.org/content/repositories/snapshots/org/apache/rampart/rahas/1.8.0-SNAPSHOT/rahas-1.8.0-20170128.170409-213.pom
[INFO] Uploaded: https://repository.apache.org/content/repositories/snapshots/org/apache/rampart/rahas/1.8.0-SNAPSHOT/rahas-1.8.0-20170128.170409-213.pom
(3 KB at 23.5 KB/sec)
[INFO] Downloading: https://repository.apache.org/content/repositories/snapshots/org/apache/rampart/rahas/maven-metadata.xml
[INFO] Downloaded: https://repository.apache.org/content/repositories/snapshots/org/apache/rampart/rahas/maven-metadata.xml
(423 B at 7.5 KB/sec)
[INFO] Uploading: https://repository.apache.org/content/repositories/snapshots/org/apache/rampart/rahas/1.8.0-SNAPSHOT/maven-metadata.xml
[INFO] Uploaded: https://repository.apache.org/content/repositories/snapshots/org/apache/rampart/rahas/1.8.0-SNAPSHOT/maven-metadata.xml
(2 KB at 14.6 KB/sec)
[INFO] Uploading: https://repository.apache.org/content/repositories/snapshots/org/apache/rampart/rahas/maven-metadata.xml
[INFO] Uploaded: https://repository.apache.org/content/repositories/snapshots/org/apache/rampart/rahas/maven-metadata.xml
(423 B at 4.8 KB/sec)
[INFO] Uploading: https://repository.apache.org/content/repositories/snapshots/org/apache/rampart/rahas/1.8.0-SNAPSHOT/rahas-1.8.0-20170128.170409-213-jacoco.exec
[INFO] Uploaded: https://repository.apache.org/content/repositories/snapshots/org/apache/rampart/rahas/1.8.0-SNAPSHOT/rahas-1.8.0-20170128.170409-213-jacoco.exec
(3 KB at 28.4 KB/sec)
[INFO] Uploading: https://repository.apache.org/content/repositories/snapshots/org/apache/rampart/rahas/1.8.0-SNAPSHOT/maven-metadata.xml
[INFO] Uploaded: https://repository.apache.org/content/repositories/snapshots/org/apache/rampart/rahas/1.8.0-SNAPSHOT/maven-metadata.xml
(2 KB at 10.3 KB/sec)
[INFO] Uploading: https://repository.apache.org/content/repositories/snapshots/org/apache/rampart/rahas/1.8.0-SNAPSHOT/rahas-1.8.0-20170128.170409-213-sources.jar
[INFO] Uploaded: https://repository.apache.org/content/repositories/snapshots/org/apache/rampart/rahas/1.8.0-SNAPSHOT/rahas-1.8.0-20170128.170409-213-sources.jar
(7 KB at 81.7 KB/sec)
[INFO] Uploading: https://repository.apache.org/content/repositories/snapshots/org/apache/rampart/rahas/1.8.0-SNAPSHOT/maven-metadata.xml
[INFO] Uploaded: https://repository.apache.org/content/repositories/snapshots/org/apache/rampart/rahas/1.8.0-SNAPSHOT/maven-metadata.xml
(2 KB at 16.9 KB/sec)
[INFO]                                                                         
[INFO] ------------------------------------------------------------------------
[INFO] Building Rampart - Integration 1.8.0-SNAPSHOT
[INFO] ------------------------------------------------------------------------
[INFO] Downloading: http://repository.apache.org/snapshots/org/apache/axis2/axis2-repo-maven-plugin/1.8.0-SNAPSHOT/maven-metadata.xml
[INFO] Downloaded: http://repository.apache.org/snapshots/org/apache/axis2/axis2-repo-maven-plugin/1.8.0-SNAPSHOT/maven-metadata.xml
(2 KB at 33.3 KB/sec)
[INFO] Downloading: http://repository.apache.org/snapshots/org/apache/axis2/axis2-transport-http/1.8.0-SNAPSHOT/maven-metadata.xml
[INFO] Downloaded: http://repository.apache.org/snapshots/org/apache/axis2/axis2-transport-http/1.8.0-SNAPSHOT/maven-metadata.xml
(2 KB at 40.1 KB/sec)
[INFO] Downloading: http://repository.apache.org/snapshots/org/apache/axis2/axis2-transport-local/1.8.0-SNAPSHOT/maven-metadata.xml
[INFO] Downloaded: http://repository.apache.org/snapshots/org/apache/axis2/axis2-transport-local/1.8.0-SNAPSHOT/maven-metadata.xml
(2 KB at 35.2 KB/sec)
[INFO] Downloading: http://repository.apache.org/snapshots/org/apache/axis2/axis2-transport-local/1.8.0-SNAPSHOT/axis2-transport-local-1.8.0-20170128.170329-454.pom
[INFO] Downloaded: http://repository.apache.org/snapshots/org/apache/axis2/axis2-transport-local/1.8.0-SNAPSHOT/axis2-transport-local-1.8.0-20170128.170329-454.pom
(5 KB at 157.0 KB/sec)
[INFO] Downloading: http://repository.apache.org/snapshots/org/apache/axis2/axis2-codegen/1.8.0-SNAPSHOT/maven-metadata.xml
[INFO] Downloaded: http://repository.apache.org/snapshots/org/apache/axis2/axis2-codegen/1.8.0-SNAPSHOT/maven-metadata.xml
(2 KB at 33.0 KB/sec)
[INFO] Downloading: http://repository.apache.org/snapshots/org/apache/axis2/axis2-adb/1.8.0-SNAPSHOT/maven-metadata.xml
[INFO] Downloaded: http://repository.apache.org/snapshots/org/apache/axis2/axis2-adb/1.8.0-SNAPSHOT/maven-metadata.xml
(2 KB at 35.9 KB/sec)
[INFO] Downloading: http://repository.apache.org/snapshots/org/apache/axis2/axis2-adb/1.8.0-SNAPSHOT/axis2-adb-1.8.0-20170128.170314-454.pom
[INFO] Downloaded: http://repository.apache.org/snapshots/org/apache/axis2/axis2-adb/1.8.0-SNAPSHOT/axis2-adb-1.8.0-20170128.170314-454.pom
(5 KB at 160.7 KB/sec)
[INFO] Downloading: http://repository.apache.org/snapshots/org/apache/axis2/axis2-xmlbeans/1.8.0-SNAPSHOT/maven-metadata.xml
[INFO] Downloaded: http://repository.apache.org/snapshots/org/apache/axis2/axis2-xmlbeans/1.8.0-SNAPSHOT/maven-metadata.xml
(2 KB at 32.1 KB/sec)
[INFO] Downloading: http://repository.apache.org/snapshots/org/apache/axis2/axis2-adb-codegen/1.8.0-SNAPSHOT/maven-metadata.xml
[INFO] Downloaded: http://repository.apache.org/snapshots/org/apache/axis2/axis2-adb-codegen/1.8.0-SNAPSHOT/maven-metadata.xml
(2 KB at 34.1 KB/sec)
[INFO] Downloading: http://repository.apache.org/snapshots/org/apache/axis2/addressing/1.8.0-SNAPSHOT/maven-metadata.xml
[INFO] Downloaded: http://repository.apache.org/snapshots/org/apache/axis2/addressing/1.8.0-SNAPSHOT/maven-metadata.xml
(2 KB at 24.2 KB/sec)
[INFO] Downloading: http://repository.apache.org/snapshots/org/apache/axis2/addressing/1.8.0-SNAPSHOT/addressing-1.8.0-20170128.170343-454.pom
[INFO] Downloaded: http://repository.apache.org/snapshots/org/apache/axis2/addressing/1.8.0-SNAPSHOT/addressing-1.8.0-20170128.170343-454.pom
(6 KB at 176.3 KB/sec)
[INFO] Downloading: http://repository.apache.org/snapshots/org/apache/axis2/axis2-testutils/1.8.0-SNAPSHOT/maven-metadata.xml
[INFO] Downloaded: http://repository.apache.org/snapshots/org/apache/axis2/axis2-testutils/1.8.0-SNAPSHOT/maven-metadata.xml
(2 KB at 35.0 KB/sec)
[INFO] Downloading: http://repository.apache.org/snapshots/org/apache/axis2/axis2-transport-local/1.8.0-SNAPSHOT/axis2-transport-local-1.8.0-20170128.170329-454.jar
[INFO] Downloading: http://repository.apache.org/snapshots/org/apache/axis2/axis2-adb/1.8.0-SNAPSHOT/axis2-adb-1.8.0-20170128.170314-454.jar
[INFO] Downloading: http://repository.apache.org/snapshots/org/apache/axis2/addressing/1.8.0-SNAPSHOT/addressing-1.8.0-20170128.170343-454.mar
[INFO] Downloaded: http://repository.apache.org/snapshots/org/apache/axis2/axis2-transport-local/1.8.0-SNAPSHOT/axis2-transport-local-1.8.0-20170128.170329-454.jar
(18 KB at 224.2 KB/sec)
[INFO] Downloaded: http://repository.apache.org/snapshots/org/apache/axis2/addressing/1.8.0-SNAPSHOT/addressing-1.8.0-20170128.170343-454.mar
(34 KB at 409.4 KB/sec)
[INFO] Downloaded: http://repository.apache.org/snapshots/org/apache/axis2/axis2-adb/1.8.0-SNAPSHOT/axis2-adb-1.8.0-20170128.170314-454.jar
(186 KB at 2239.2 KB/sec)
[INFO] 
[INFO] --- maven-clean-plugin:2.5:clean (default-clean) @ rampart-integration ---
[INFO] Deleting <https://builds.apache.org/job/Rampart/ws/trunk/modules/rampart-integration/target>
[INFO] 
[INFO] --- maven-enforcer-plugin:1.1:enforce (default) @ rampart-integration ---
[INFO] 
[INFO] --- gmavenplus-plugin:1.5:execute (initialize) @ rampart-integration ---
[INFO] Using Groovy 2.4.4 to perform execute.
[INFO] 
[INFO] --- jacoco-maven-plugin:0.7.5.201505241946:prepare-agent (prepare-agent-for-surefire)
@ rampart-integration ---
[INFO] jacoco.surefireArgLine set to -javaagent:<https://builds.apache.org/job/Rampart/ws/.repository/org/jacoco/org.jacoco.agent/0.7.5.201505241946/org.jacoco.agent-0.7.5.201505241946-runtime.jar=destfile=/home/jenkins/jenkins-slave/workspace/Rampart/trunk/modules/rampart-integration/target/jacoco.exec,sessionid=mvn>:org.apache.rampart:rampart-integration:1.8.0-SNAPSHOT:surefire
[INFO] 
[INFO] --- maven-remote-resources-plugin:1.5:process (default) @ rampart-integration ---
[INFO] 
[INFO] --- maven-resources-plugin:2.7:resources (default-resources) @ rampart-integration
---
[INFO] Using 'UTF-8' encoding to copy filtered resources.
[INFO] Copying 0 resource
[INFO] Copying 3 resources
[INFO] 
[INFO] --- maven-dependency-plugin:2.6:copy-dependencies (copy-endorsed) @ rampart-integration
---
[INFO] 
[INFO] --- maven-compiler-plugin:2.0:compile (default-compile) @ rampart-integration ---
Compiling 8 source files to <https://builds.apache.org/job/Rampart/ws/trunk/modules/rampart-integration/target/classes>
[INFO] ------------------------------------------------------------------------
[INFO] Reactor Summary:
[INFO] 
[INFO] Apache Rampart ..................................... SUCCESS [ 12.658 s]
[INFO] Rampart - Policy ................................... SUCCESS [ 15.207 s]
[INFO] Rampart - Trust .................................... SUCCESS [ 51.220 s]
[INFO] Rampart - Core ..................................... SUCCESS [ 16.454 s]
[INFO] Javadoc ............................................ SUCCESS [ 13.237 s]
[INFO] Rampart - Test Suite ............................... SUCCESS [ 16.281 s]
[INFO] Rampart - Mar ...................................... SUCCESS [ 13.086 s]
[INFO] Rampart - Trust-Mar ................................ SUCCESS [  6.052 s]
[INFO] Rampart - Integration .............................. FAILURE [  4.656 s]
[INFO] Rampart - Samples .................................. SKIPPED
[INFO] Rampart - Distribution ............................. SKIPPED
[INFO] Code Coverage Report ............................... SKIPPED
[INFO] ------------------------------------------------------------------------
[INFO] BUILD FAILURE
[INFO] ------------------------------------------------------------------------
[INFO] Total time: 02:52 min
[INFO] Finished at: 2017-01-28T17:04:26+00:00
[INFO] Final Memory: 100M/815M
[INFO] ------------------------------------------------------------------------
Waiting for Jenkins to finish collecting data
[ERROR] Failed to execute goal org.apache.maven.plugins:maven-compiler-plugin:2.0:compile
(default-compile) on project rampart-integration: Compilation failure: Compilation failure:
[ERROR] <https://builds.apache.org/job/Rampart/ws/trunk/modules/rampart-integration/src/main/java/org/apache/rahas/TestClient.java>:[34,33]
error: cannot find symbol
[ERROR] 
[ERROR] could not parse error message:   symbol:   class JettyServer
[ERROR] location: package org.apache.axis2.testutils
[ERROR] <https://builds.apache.org/job/Rampart/ws/trunk/modules/rampart-integration/src/main/java/org/apache/rahas/TestClient.java>:44:
error: cannot find symbol
[ERROR] public final JettyServer server = new JettyServer(TESTING_PATH + getServiceRepo(),
false);
[ERROR] ^
[ERROR] 
[ERROR] could not parse error message:   symbol:   class JettyServer
[ERROR] location: class TestClient
[ERROR] <https://builds.apache.org/job/Rampart/ws/trunk/modules/rampart-integration/src/main/java/org/apache/rahas/TestClient.java>:44:
error: cannot find symbol
[ERROR] public final JettyServer server = new JettyServer(TESTING_PATH + getServiceRepo(),
false);
[ERROR] ^
[ERROR] -> [Help 1]
[ERROR] 
[ERROR] To see the full stack trace of the errors, re-run Maven with the -e switch.
[ERROR] Re-run Maven using the -X switch to enable full debug logging.
[ERROR] 
[ERROR] For more information about the errors and possible solutions, please read the following
articles:
[ERROR] [Help 1] http://cwiki.apache.org/confluence/display/MAVEN/MojoFailureException
[ERROR] 
[ERROR] After correcting the problems, you can resume the build with the command
[ERROR]   mvn <goals> -rf :rampart-integration
[JENKINS] Archiving <https://builds.apache.org/job/Rampart/ws/trunk/pom.xml> to org.apache.rampart/rampart-project/1.8.0-SNAPSHOT/rampart-project-1.8.0-SNAPSHOT.pom
[JENKINS] Archiving <https://builds.apache.org/job/Rampart/ws/trunk/target/rampart-project-1.8.0-SNAPSHOT-site.xml>
to org.apache.rampart/rampart-project/1.8.0-20170128.170146-215/rampart-project-1.8.0-20170128.170146-215-site.xml
[JENKINS] Archiving <https://builds.apache.org/job/Rampart/ws/trunk/modules/rampart-trust/pom.xml>
to org.apache.rampart/rampart-trust/1.8.0-SNAPSHOT/rampart-trust-1.8.0-SNAPSHOT.pom
[JENKINS] Archiving <https://builds.apache.org/job/Rampart/ws/trunk/modules/rampart-trust/target/rampart-trust-1.8.0-SNAPSHOT.jar>
to org.apache.rampart/rampart-trust/1.8.0-20170128.170256-213/rampart-trust-1.8.0-20170128.170256-213.jar
[JENKINS] Archiving <https://builds.apache.org/job/Rampart/ws/trunk/modules/rampart-trust/target/jacoco.exec>
to org.apache.rampart/rampart-trust/1.8.0-20170128.170256-213/rampart-trust-1.8.0-20170128.170256-213-jacoco.exec
[JENKINS] Archiving <https://builds.apache.org/job/Rampart/ws/trunk/modules/rampart-trust/target/rampart-trust-1.8.0-SNAPSHOT-sources.jar>
to org.apache.rampart/rampart-trust/1.8.0-20170128.170256-213/rampart-trust-1.8.0-20170128.170256-213-sources.jar
[JENKINS] Archiving <https://builds.apache.org/job/Rampart/ws/trunk/modules/rampart-trust/target/rampart-trust-1.8.0-SNAPSHOT-javadoc.jar>
to org.apache.rampart/rampart-trust/1.8.0-20170128.170256-213/rampart-trust-1.8.0-20170128.170256-213-javadoc.jar
Compressed 705.03 KB of artifacts by 18.2% relative to #2338
[JENKINS] Archiving <https://builds.apache.org/job/Rampart/ws/trunk/modules/rampart-mar/pom.xml>
to org.apache.rampart/rampart/1.8.0-SNAPSHOT/rampart-1.8.0-SNAPSHOT.pom
[JENKINS] Archiving <https://builds.apache.org/job/Rampart/ws/trunk/modules/rampart-mar/target/rampart-1.8.0-SNAPSHOT.mar>
to org.apache.rampart/rampart/1.8.0-20170128.170402-213/rampart-1.8.0-20170128.170402-213.mar
[JENKINS] Archiving <https://builds.apache.org/job/Rampart/ws/trunk/modules/rampart-mar/target/jacoco.exec>
to org.apache.rampart/rampart/1.8.0-20170128.170402-213/rampart-1.8.0-20170128.170402-213-jacoco.exec
[JENKINS] Archiving <https://builds.apache.org/job/Rampart/ws/trunk/modules/rampart-mar/target/rampart-1.8.0-SNAPSHOT.mar>
to org.apache.rampart/rampart/1.8.0-20170128.170402-213/rampart-1.8.0-20170128.170402-213.jar
[JENKINS] Archiving <https://builds.apache.org/job/Rampart/ws/trunk/modules/rampart-mar/target/rampart-1.8.0-SNAPSHOT-sources.jar>
to org.apache.rampart/rampart/1.8.0-20170128.170402-213/rampart-1.8.0-20170128.170402-213-sources.jar
[JENKINS] Archiving <https://builds.apache.org/job/Rampart/ws/trunk/modules/rampart-integration/pom.xml>
to org.apache.rampart/rampart-integration/1.8.0-SNAPSHOT/rampart-integration-1.8.0-SNAPSHOT.pom
[JENKINS] Archiving <https://builds.apache.org/job/Rampart/ws/trunk/modules/rampart-tests/pom.xml>
to org.apache.rampart/rampart-tests/1.8.0-SNAPSHOT/rampart-tests-1.8.0-SNAPSHOT.pom
[JENKINS] Archiving <https://builds.apache.org/job/Rampart/ws/trunk/modules/rampart-tests/target/rampart-tests-1.8.0-SNAPSHOT.jar>
to org.apache.rampart/rampart-tests/1.8.0-SNAPSHOT/rampart-tests-1.8.0-SNAPSHOT.jar
[JENKINS] Archiving <https://builds.apache.org/job/Rampart/ws/trunk/modules/rampart-tests/target/jacoco.exec>
to org.apache.rampart/rampart-tests/1.8.0-SNAPSHOT/rampart-tests-1.8.0-SNAPSHOT-jacoco.exec
[JENKINS] Archiving <https://builds.apache.org/job/Rampart/ws/trunk/modules/rampart-tests/target/rampart-tests-1.8.0-SNAPSHOT-sources.jar>
to org.apache.rampart/rampart-tests/1.8.0-SNAPSHOT/rampart-tests-1.8.0-SNAPSHOT-sources.jar
[JENKINS] Archiving <https://builds.apache.org/job/Rampart/ws/trunk/modules/rampart-trust-mar/pom.xml>
to org.apache.rampart/rahas/1.8.0-SNAPSHOT/rahas-1.8.0-SNAPSHOT.pom
[JENKINS] Archiving <https://builds.apache.org/job/Rampart/ws/trunk/modules/rampart-trust-mar/target/rahas-1.8.0-SNAPSHOT.mar>
to org.apache.rampart/rahas/1.8.0-20170128.170409-213/rahas-1.8.0-20170128.170409-213.mar
[JENKINS] Archiving <https://builds.apache.org/job/Rampart/ws/trunk/modules/rampart-trust-mar/target/jacoco.exec>
to org.apache.rampart/rahas/1.8.0-20170128.170409-213/rahas-1.8.0-20170128.170409-213-jacoco.exec
[JENKINS] Archiving <https://builds.apache.org/job/Rampart/ws/trunk/modules/rampart-trust-mar/target/rahas-1.8.0-SNAPSHOT-sources.jar>
to org.apache.rampart/rahas/1.8.0-20170128.170409-213/rahas-1.8.0-20170128.170409-213-sources.jar
[JENKINS] Archiving <https://builds.apache.org/job/Rampart/ws/trunk/modules/rampart-samples/pom.xml>
to org.apache.rampart/rampart-sample/1.8.0-SNAPSHOT/rampart-sample-1.8.0-SNAPSHOT.pom
[JENKINS] Archiving <https://builds.apache.org/job/Rampart/ws/trunk/modules/distribution/pom.xml>
to org.apache.rampart/rampart-dist/1.8.0-SNAPSHOT/rampart-dist-1.8.0-SNAPSHOT.pom
[JENKINS] Archiving <https://builds.apache.org/job/Rampart/ws/trunk/modules/rampart-policy/pom.xml>
to org.apache.rampart/rampart-policy/1.8.0-SNAPSHOT/rampart-policy-1.8.0-SNAPSHOT.pom
[JENKINS] Archiving <https://builds.apache.org/job/Rampart/ws/trunk/modules/rampart-policy/target/rampart-policy-1.8.0-SNAPSHOT.jar>
to org.apache.rampart/rampart-policy/1.8.0-20170128.170203-215/rampart-policy-1.8.0-20170128.170203-215.jar
[JENKINS] Archiving <https://builds.apache.org/job/Rampart/ws/trunk/modules/rampart-policy/target/jacoco.exec>
to org.apache.rampart/rampart-policy/1.8.0-20170128.170203-215/rampart-policy-1.8.0-20170128.170203-215-jacoco.exec
[JENKINS] Archiving <https://builds.apache.org/job/Rampart/ws/trunk/modules/rampart-policy/target/rampart-policy-1.8.0-SNAPSHOT-sources.jar>
to org.apache.rampart/rampart-policy/1.8.0-20170128.170203-215/rampart-policy-1.8.0-20170128.170203-215-sources.jar
[JENKINS] Archiving <https://builds.apache.org/job/Rampart/ws/trunk/modules/rampart-policy/target/rampart-policy-1.8.0-SNAPSHOT-javadoc.jar>
to org.apache.rampart/rampart-policy/1.8.0-20170128.170203-215/rampart-policy-1.8.0-20170128.170203-215-javadoc.jar
Compressed 829.07 KB of artifacts by 11.6% relative to #2338
[JENKINS] Archiving <https://builds.apache.org/job/Rampart/ws/trunk/apidocs/pom.xml>
to org.apache.rampart/apidocs/1.8.0-SNAPSHOT/apidocs-1.8.0-SNAPSHOT.pom
[JENKINS] Archiving <https://builds.apache.org/job/Rampart/ws/trunk/apidocs/target/apidocs-1.8.0-SNAPSHOT.zip>
to org.apache.rampart/apidocs/1.8.0-SNAPSHOT/apidocs-1.8.0-SNAPSHOT.zip
[JENKINS] Archiving <https://builds.apache.org/job/Rampart/ws/trunk/modules/rampart-core/pom.xml>
to org.apache.rampart/rampart-core/1.8.0-SNAPSHOT/rampart-core-1.8.0-SNAPSHOT.pom
[JENKINS] Archiving <https://builds.apache.org/job/Rampart/ws/trunk/modules/rampart-core/target/rampart-core-1.8.0-SNAPSHOT.jar>
to org.apache.rampart/rampart-core/1.8.0-20170128.170314-213/rampart-core-1.8.0-20170128.170314-213.jar
[JENKINS] Archiving <https://builds.apache.org/job/Rampart/ws/trunk/modules/rampart-core/target/jacoco.exec>
to org.apache.rampart/rampart-core/1.8.0-20170128.170314-213/rampart-core-1.8.0-20170128.170314-213-jacoco.exec
[JENKINS] Archiving <https://builds.apache.org/job/Rampart/ws/trunk/modules/rampart-core/target/rampart-core-1.8.0-SNAPSHOT-sources.jar>
to org.apache.rampart/rampart-core/1.8.0-20170128.170314-213/rampart-core-1.8.0-20170128.170314-213-sources.jar
[JENKINS] Archiving <https://builds.apache.org/job/Rampart/ws/trunk/modules/rampart-core/target/rampart-core-1.8.0-SNAPSHOT-javadoc.jar>
to org.apache.rampart/rampart-core/1.8.0-20170128.170314-213/rampart-core-1.8.0-20170128.170314-213-javadoc.jar
[JENKINS] Archiving <https://builds.apache.org/job/Rampart/ws/trunk/code-coverage/pom.xml>
to org.apache.rampart/code-coverage/1.8.0-SNAPSHOT/code-coverage-1.8.0-SNAPSHOT.pom
Sending e-mails to: java-dev@axis.apache.org
channel stopped

---------------------------------------------------------------------
To unsubscribe, e-mail: java-dev-unsubscribe@axis.apache.org
For additional commands, e-mail: java-dev-help@axis.apache.org


Mime
View raw message