axis-java-dev mailing list archives

Site index · List index
Message view « Date » · « Thread »
Top « Date » · « Thread »
From Apache Jenkins Server <jenk...@builds.apache.org>
Subject Build failed in Jenkins: axis2-1.7 » webapp-tests #89
Date Sun, 16 Oct 2016 22:23:04 GMT
See <https://builds.apache.org/job/axis2-1.7/org.apache.axis2$webapp-tests/89/>

------------------------------------------
[INFO]                                                                         
[INFO] ------------------------------------------------------------------------
[INFO] Building webapp-tests 1.7.4-SNAPSHOT
[INFO] ------------------------------------------------------------------------
[INFO] 
[INFO] --- maven-clean-plugin:2.2:clean (default-clean) @ webapp-tests ---
[INFO] Deleting directory <https://builds.apache.org/job/axis2-1.7/org.apache.axis2$webapp-tests/ws/target>
[INFO] 
[INFO] --- maven-enforcer-plugin:1.1:enforce (default) @ webapp-tests ---
[INFO] 
[INFO] --- gmavenplus-plugin:1.5:execute (create-tmp-directory) @ webapp-tests ---
[INFO] Using Groovy 2.4.4 to perform execute.
[INFO] 
[INFO] --- alta-maven-plugin:0.4:generate-properties (default) @ webapp-tests ---
[INFO] 
[INFO] --- maven-remote-resources-plugin:1.5:process (default) @ webapp-tests ---
[INFO] 
[INFO] --- maven-resources-plugin:2.4.2:resources (default-resources) @ webapp-tests ---
[INFO] Using 'UTF-8' encoding to copy filtered resources.
[INFO] skip non existing resourceDirectory <https://builds.apache.org/job/axis2-1.7/org.apache.axis2$webapp-tests/ws/src/main/resources>
[INFO] Copying 3 resources
[INFO] 
[INFO] --- maven-compiler-plugin:3.5.1:compile (default-compile) @ webapp-tests ---
[INFO] No sources to compile
[INFO] 
[INFO] --- maven-resources-plugin:2.4.2:testResources (default-testResources) @ webapp-tests
---
[INFO] Using 'UTF-8' encoding to copy filtered resources.
[INFO] skip non existing resourceDirectory <https://builds.apache.org/job/axis2-1.7/org.apache.axis2$webapp-tests/ws/src/test/resources>
[INFO] Copying 3 resources
[INFO] 
[INFO] --- maven-compiler-plugin:3.5.1:testCompile (default-testCompile) @ webapp-tests ---
[INFO] Changes detected - recompiling the module!
[INFO] Compiling 4 source files to <https://builds.apache.org/job/axis2-1.7/org.apache.axis2$webapp-tests/ws/target/test-classes>
[INFO] 
[INFO] --- maven-surefire-plugin:2.13:test (default-test) @ webapp-tests ---
[JENKINS] Recording test results
[INFO] 
[INFO] --- maven-jar-plugin:2.2:jar (default-jar) @ webapp-tests ---
[INFO] Building jar: <https://builds.apache.org/job/axis2-1.7/org.apache.axis2$webapp-tests/ws/target/webapp-tests-1.7.4-SNAPSHOT.jar>
[INFO] 
[INFO] --- maven-site-plugin:3.4:attach-descriptor (attach-descriptor) @ webapp-tests ---
[INFO] 
[INFO] --- maven-assembly-plugin:2.6:single (source-release-assembly) @ webapp-tests ---
[INFO] Assemblies have been skipped per configuration of the skipAssembly parameter.
[INFO] 
[INFO] --- maven-source-plugin:2.4:jar-no-fork (source-jars) @ webapp-tests ---
[INFO] Building jar: <https://builds.apache.org/job/axis2-1.7/org.apache.axis2$webapp-tests/ws/target/webapp-tests-1.7.4-SNAPSHOT-sources.jar>
[INFO] 
[INFO] --- maven-javadoc-plugin:2.10.3:jar (attach-javadocs) @ webapp-tests ---
[INFO] 
[INFO] --- build-helper-maven-plugin:1.4:reserve-network-port (reserve-network-port) @ webapp-tests
---
[INFO] Reserved port 43759 for jetty.stopPort
[INFO] Reserved port 46910 for jetty.httpPort
[INFO] 
[INFO] --- maven-enforcer-plugin:1.1:enforce (default) @ webapp-tests ---
[WARNING] Failed to getClass for org.mortbay.jetty.plugin.JettyDeployWar
[INFO] 
[INFO] --- jetty-maven-plugin:8.1.16.v20140903:deploy-war (start-jetty) @ webapp-tests ---
[INFO] Configuring Jetty for project: webapp-tests
[INFO] Context path = /axis2
[INFO] Tmp directory = <https://builds.apache.org/job/axis2-1.7/org.apache.axis2$webapp-tests/ws/target/tmp>
[INFO] Web defaults = org/eclipse/jetty/webapp/webdefault.xml
[INFO] Web overrides =  none
2016-10-16 22:18:17.821:INFO:oejs.Server:jetty-8.1.16.v20140903
2016-10-16 22:18:17.842:INFO:oejw.WebInfConfiguration:Extract jar:file:/home/jenkins/jenkins-slave/workspace/axis2-1.7/axis2/modules/webapp/target/axis2.war!/
to <https://builds.apache.org/job/axis2-1.7/org.apache.axis2$webapp-tests/ws/target/tmp/webapp>
2016-10-16 22:18:20.548:INFO:oejpw.PlusConfiguration:No Transaction manager found - if your
webapp requires one, please configure one.
[INFO] Clustering has been disabled
[INFO] Deploying module: jaxws-1.7.4-SNAPSHOT - <https://builds.apache.org/job/axis2-1.7/org.apache.axis2$webapp-tests/ws/target/tmp/webapp/WEB-INF/modules/axis2-jaxws-mar-1.7.4-SNAPSHOT.mar>
[INFO] Deploying module: soapmonitor-1.7.4-SNAPSHOT - <https://builds.apache.org/job/axis2-1.7/org.apache.axis2$webapp-tests/ws/target/tmp/webapp/WEB-INF/modules/soapmonitor-1.7.4-SNAPSHOT.mar>
[INFO] Deploying module: ping-1.7.4-SNAPSHOT - <https://builds.apache.org/job/axis2-1.7/org.apache.axis2$webapp-tests/ws/target/tmp/webapp/WEB-INF/modules/ping-1.7.4-SNAPSHOT.mar>
[INFO] Deploying module: metadataExchange-1.7.4-SNAPSHOT - <https://builds.apache.org/job/axis2-1.7/org.apache.axis2$webapp-tests/ws/target/tmp/webapp/WEB-INF/modules/mex-1.7.4-SNAPSHOT.mar>
[INFO] Deploying module: script-1.7.4-SNAPSHOT - <https://builds.apache.org/job/axis2-1.7/org.apache.axis2$webapp-tests/ws/target/tmp/webapp/WEB-INF/modules/scripting-1.7.4-SNAPSHOT.mar>
[INFO] Deploying module: addressing-1.7.4-SNAPSHOT - <https://builds.apache.org/job/axis2-1.7/org.apache.axis2$webapp-tests/ws/target/tmp/webapp/WEB-INF/modules/addressing-1.7.4-SNAPSHOT.mar>
[INFO] Deploying module: mtompolicy-1.7.4-SNAPSHOT - <https://builds.apache.org/job/axis2-1.7/org.apache.axis2$webapp-tests/ws/target/tmp/webapp/WEB-INF/modules/mtompolicy-1.7.4-SNAPSHOT.mar>
[INFO] Deploying Web service: version-1.7.4-SNAPSHOT.aar - <https://builds.apache.org/job/axis2-1.7/org.apache.axis2$webapp-tests/ws/target/tmp/webapp/WEB-INF/services/version-1.7.4-SNAPSHOT.aar>
2016-10-16 22:18:25.820:WARN:oejsh.RequestLogHandler:!RequestLog
2016-10-16 22:18:25.828:WARN:oejuc.AbstractLifeCycle:FAILED SelectChannelConnector@0.0.0.0:46910:
java.net.BindException: Address already in use
java.net.BindException: Address already in use
	at sun.nio.ch.Net.bind0(Native Method)
	at sun.nio.ch.Net.bind(Net.java:463)
	at sun.nio.ch.Net.bind(Net.java:455)
	at sun.nio.ch.ServerSocketChannelImpl.bind(ServerSocketChannelImpl.java:223)
	at sun.nio.ch.ServerSocketAdaptor.bind(ServerSocketAdaptor.java:74)
	at org.eclipse.jetty.server.nio.SelectChannelConnector.open(SelectChannelConnector.java:187)
	at org.eclipse.jetty.server.AbstractConnector.doStart(AbstractConnector.java:316)
	at org.eclipse.jetty.server.nio.SelectChannelConnector.doStart(SelectChannelConnector.java:265)
	at org.eclipse.jetty.util.component.AbstractLifeCycle.start(AbstractLifeCycle.java:64)
	at org.eclipse.jetty.server.Server.doStart(Server.java:293)
	at org.mortbay.jetty.plugin.JettyServer.doStart(JettyServer.java:65)
	at org.eclipse.jetty.util.component.AbstractLifeCycle.start(AbstractLifeCycle.java:64)
	at org.mortbay.jetty.plugin.AbstractJettyMojo.startJetty(AbstractJettyMojo.java:520)
	at org.mortbay.jetty.plugin.AbstractJettyMojo.execute(AbstractJettyMojo.java:365)
	at org.mortbay.jetty.plugin.JettyRunWarMojo.execute(JettyRunWarMojo.java:71)
	at org.apache.maven.plugin.DefaultBuildPluginManager.executeMojo(DefaultBuildPluginManager.java:101)
	at org.apache.maven.lifecycle.internal.MojoExecutor.execute(MojoExecutor.java:209)
	at org.apache.maven.lifecycle.internal.MojoExecutor.execute(MojoExecutor.java:153)
	at org.apache.maven.lifecycle.internal.MojoExecutor.execute(MojoExecutor.java:145)
	at org.apache.maven.lifecycle.internal.LifecycleModuleBuilder.buildProject(LifecycleModuleBuilder.java:84)
	at org.apache.maven.lifecycle.internal.LifecycleModuleBuilder.buildProject(LifecycleModuleBuilder.java:59)
	at org.apache.maven.lifecycle.internal.LifecycleStarter.singleThreadedBuild(LifecycleStarter.java:183)
	at org.apache.maven.lifecycle.internal.LifecycleStarter.execute(LifecycleStarter.java:161)
	at org.apache.maven.DefaultMaven.doExecute(DefaultMaven.java:320)
	at org.apache.maven.DefaultMaven.execute(DefaultMaven.java:156)
	at org.jvnet.hudson.maven3.launcher.Maven3Launcher.main(Maven3Launcher.java:117)
	at sun.reflect.NativeMethodAccessorImpl.invoke0(Native Method)
	at sun.reflect.NativeMethodAccessorImpl.invoke(NativeMethodAccessorImpl.java:57)
	at sun.reflect.DelegatingMethodAccessorImpl.invoke(DelegatingMethodAccessorImpl.java:43)
	at java.lang.reflect.Method.invoke(Method.java:606)
	at org.codehaus.plexus.classworlds.launcher.Launcher.launchStandard(Launcher.java:329)
	at org.codehaus.plexus.classworlds.launcher.Launcher.launch(Launcher.java:239)
	at org.jvnet.hudson.maven3.agent.Maven3Main.launch(Maven3Main.java:181)
	at sun.reflect.NativeMethodAccessorImpl.invoke0(Native Method)
	at sun.reflect.NativeMethodAccessorImpl.invoke(NativeMethodAccessorImpl.java:57)
	at sun.reflect.DelegatingMethodAccessorImpl.invoke(DelegatingMethodAccessorImpl.java:43)
	at java.lang.reflect.Method.invoke(Method.java:606)
	at hudson.maven.Maven3Builder.call(Maven3Builder.java:136)
	at hudson.maven.Maven3Builder.call(Maven3Builder.java:71)
	at hudson.remoting.UserRequest.perform(UserRequest.java:153)
	at hudson.remoting.UserRequest.perform(UserRequest.java:50)
	at hudson.remoting.Request$2.run(Request.java:332)
	at hudson.remoting.InterceptingExecutorService$1.call(InterceptingExecutorService.java:68)
	at java.util.concurrent.FutureTask.run(FutureTask.java:262)
	at java.util.concurrent.ThreadPoolExecutor.runWorker(ThreadPoolExecutor.java:1145)
	at java.util.concurrent.ThreadPoolExecutor$Worker.run(ThreadPoolExecutor.java:615)
	at java.lang.Thread.run(Thread.java:745)
2016-10-16 22:18:25.829:WARN:oejuc.AbstractLifeCycle:FAILED org.mortbay.jetty.plugin.JettyServer@264e9df9:
java.net.BindException: Address already in use
java.net.BindException: Address already in use
	at sun.nio.ch.Net.bind0(Native Method)
	at sun.nio.ch.Net.bind(Net.java:463)
	at sun.nio.ch.Net.bind(Net.java:455)
	at sun.nio.ch.ServerSocketChannelImpl.bind(ServerSocketChannelImpl.java:223)
	at sun.nio.ch.ServerSocketAdaptor.bind(ServerSocketAdaptor.java:74)
	at org.eclipse.jetty.server.nio.SelectChannelConnector.open(SelectChannelConnector.java:187)
	at org.eclipse.jetty.server.AbstractConnector.doStart(AbstractConnector.java:316)
	at org.eclipse.jetty.server.nio.SelectChannelConnector.doStart(SelectChannelConnector.java:265)
	at org.eclipse.jetty.util.component.AbstractLifeCycle.start(AbstractLifeCycle.java:64)
	at org.eclipse.jetty.server.Server.doStart(Server.java:293)
	at org.mortbay.jetty.plugin.JettyServer.doStart(JettyServer.java:65)
	at org.eclipse.jetty.util.component.AbstractLifeCycle.start(AbstractLifeCycle.java:64)
	at org.mortbay.jetty.plugin.AbstractJettyMojo.startJetty(AbstractJettyMojo.java:520)
	at org.mortbay.jetty.plugin.AbstractJettyMojo.execute(AbstractJettyMojo.java:365)
	at org.mortbay.jetty.plugin.JettyRunWarMojo.execute(JettyRunWarMojo.java:71)
	at org.apache.maven.plugin.DefaultBuildPluginManager.executeMojo(DefaultBuildPluginManager.java:101)
	at org.apache.maven.lifecycle.internal.MojoExecutor.execute(MojoExecutor.java:209)
	at org.apache.maven.lifecycle.internal.MojoExecutor.execute(MojoExecutor.java:153)
	at org.apache.maven.lifecycle.internal.MojoExecutor.execute(MojoExecutor.java:145)
	at org.apache.maven.lifecycle.internal.LifecycleModuleBuilder.buildProject(LifecycleModuleBuilder.java:84)
	at org.apache.maven.lifecycle.internal.LifecycleModuleBuilder.buildProject(LifecycleModuleBuilder.java:59)
	at org.apache.maven.lifecycle.internal.LifecycleStarter.singleThreadedBuild(LifecycleStarter.java:183)
	at org.apache.maven.lifecycle.internal.LifecycleStarter.execute(LifecycleStarter.java:161)
	at org.apache.maven.DefaultMaven.doExecute(DefaultMaven.java:320)
	at org.apache.maven.DefaultMaven.execute(DefaultMaven.java:156)
	at org.jvnet.hudson.maven3.launcher.Maven3Launcher.main(Maven3Launcher.java:117)
	at sun.reflect.NativeMethodAccessorImpl.invoke0(Native Method)
	at sun.reflect.NativeMethodAccessorImpl.invoke(NativeMethodAccessorImpl.java:57)
	at sun.reflect.DelegatingMethodAccessorImpl.invoke(DelegatingMethodAccessorImpl.java:43)
	at java.lang.reflect.Method.invoke(Method.java:606)
	at org.codehaus.plexus.classworlds.launcher.Launcher.launchStandard(Launcher.java:329)
	at org.codehaus.plexus.classworlds.launcher.Launcher.launch(Launcher.java:239)
	at org.jvnet.hudson.maven3.agent.Maven3Main.launch(Maven3Main.java:181)
	at sun.reflect.NativeMethodAccessorImpl.invoke0(Native Method)
	at sun.reflect.NativeMethodAccessorImpl.invoke(NativeMethodAccessorImpl.java:57)
	at sun.reflect.DelegatingMethodAccessorImpl.invoke(DelegatingMethodAccessorImpl.java:43)
	at java.lang.reflect.Method.invoke(Method.java:606)
	at hudson.maven.Maven3Builder.call(Maven3Builder.java:136)
	at hudson.maven.Maven3Builder.call(Maven3Builder.java:71)
	at hudson.remoting.UserRequest.perform(UserRequest.java:153)
	at hudson.remoting.UserRequest.perform(UserRequest.java:50)
	at hudson.remoting.Request$2.run(Request.java:332)
	at hudson.remoting.InterceptingExecutorService$1.call(InterceptingExecutorService.java:68)
	at java.util.concurrent.FutureTask.run(FutureTask.java:262)
	at java.util.concurrent.ThreadPoolExecutor.runWorker(ThreadPoolExecutor.java:1145)
	at java.util.concurrent.ThreadPoolExecutor$Worker.run(ThreadPoolExecutor.java:615)
	at java.lang.Thread.run(Thread.java:745)

---------------------------------------------------------------------
To unsubscribe, e-mail: java-dev-unsubscribe@axis.apache.org
For additional commands, e-mail: java-dev-help@axis.apache.org


Mime
View raw message