axis-java-dev mailing list archives

Site index · List index
Message view « Date » · « Thread »
Top « Date » · « Thread »
From Apache Jenkins Server <jenk...@builds.apache.org>
Subject Build failed in Jenkins: rampart-1.7 #39
Date Sun, 07 Aug 2016 21:15:59 GMT
See <https://builds.apache.org/job/rampart-1.7/39/>

------------------------------------------
Started by upstream project "axiom-1.2.x" build number 37
originally caused by:
 Started by user veithen
[EnvInject] - Loading node environment variables.
Building remotely on ubuntu3 (Ubuntu ubuntu legacy-ubuntu) in workspace <https://builds.apache.org/job/rampart-1.7/ws/>
Updating http://svn.apache.org/repos/asf/axis/axis2/java/rampart/branches/1_7 at revision
'2016-08-07T21:15:41.214 +0000'
At revision 1755460

No changes for http://svn.apache.org/repos/asf/axis/axis2/java/rampart/branches/1_7 since
the previous build
[locks-and-latches] Checking to see if we really have the locks
[locks-and-latches] Have all the locks, build can start
Parsing POMs
Downloaded artifact http://repo.maven.apache.org/maven2/org/apache/apache/17/apache-17.pom
Established TCP socket on 41663
maven3-agent.jar already up to date
maven3-interceptor.jar already up to date
maven3-interceptor-commons.jar already up to date
[1_7] $ /home/jenkins/tools/java/jdk1.7.0_79-unlimited-security/bin/java -Xmx2g -Xms256m -XX:MaxPermSize=512m
-cp /home/jenkins/jenkins-slave/maven3-agent.jar:/home/jenkins/jenkins-slave/tools/hudson.tasks.Maven_MavenInstallation/Maven_3.0.3/boot/plexus-classworlds-2.4.jar
org.jvnet.hudson.maven3.agent.Maven3Main /home/jenkins/jenkins-slave/tools/hudson.tasks.Maven_MavenInstallation/Maven_3.0.3
/x1/jenkins/jenkins-slave/slave.jar /home/jenkins/jenkins-slave/maven3-interceptor.jar /home/jenkins/jenkins-slave/maven3-interceptor-commons.jar
41663
<===[JENKINS REMOTING CAPACITY]===>   channel started
Executing Maven:  -B -f <https://builds.apache.org/job/rampart-1.7/ws/1_7/pom.xml> -Dmaven.repo.local=<https://builds.apache.org/job/rampart-1.7/ws/.repository>
-U clean deploy -Papache-release -Dgpg.skip=true
[INFO] Scanning for projects...
Downloading: http://repository.apache.org/snapshots/org/apache/axis2/axis2-mar-maven-plugin/1.7.3-SNAPSHOT/maven-metadata.xml
Downloading: http://repository.apache.org/snapshots/org/apache/axis2/axis2-mar-maven-plugin/1.7.3-SNAPSHOT/maven-metadata.xml
Downloading: http://repository.apache.org/snapshots/org/apache/axis2/axis2-mar-maven-plugin/1.7.3-SNAPSHOT/axis2-mar-maven-plugin-1.7.3-SNAPSHOT.pom
[WARNING] The POM for org.apache.axis2:axis2-mar-maven-plugin:jar:1.7.3-SNAPSHOT is missing,
no dependency information available
Downloading: http://repository.apache.org/snapshots/org/apache/axis2/axis2-mar-maven-plugin/1.7.3-SNAPSHOT/axis2-mar-maven-plugin-1.7.3-SNAPSHOT.jar
Downloading: http://repo1.maven.org/maven2/org/codehaus/plexus/plexus-utils/1.1/plexus-utils-1.1.jar
Downloaded: http://repo1.maven.org/maven2/org/codehaus/plexus/plexus-utils/1.1/plexus-utils-1.1.jar
(165 KB at 1419.1 KB/sec)
[ERROR] The build could not read 2 projects -> [Help 1]
[ERROR]   
[ERROR]   The project org.apache.rampart:rampart:1.7.1-SNAPSHOT (<https://builds.apache.org/job/rampart-1.7/ws/1_7/modules/rampart-mar/pom.xml)>
has 2 errors
[ERROR]     Unresolveable build extension: Plugin org.apache.axis2:axis2-mar-maven-plugin:1.7.3-SNAPSHOT
or one of its dependencies could not be resolved: Could not find artifact org.apache.axis2:axis2-mar-maven-plugin:jar:1.7.3-SNAPSHOT
in Nexus (http://repository.apache.org/snapshots) -> [Help 2]
[ERROR]     Unknown packaging: mar @ line 34, column 16
[ERROR]   
[ERROR]   The project org.apache.rampart:rahas:1.7.1-SNAPSHOT (<https://builds.apache.org/job/rampart-1.7/ws/1_7/modules/rampart-trust-mar/pom.xml)>
has 2 errors
[ERROR]     Unresolveable build extension: Plugin org.apache.axis2:axis2-mar-maven-plugin:1.7.3-SNAPSHOT
or one of its dependencies could not be resolved: Could not find artifact org.apache.axis2:axis2-mar-maven-plugin:jar:1.7.3-SNAPSHOT
in Nexus (http://repository.apache.org/snapshots) -> [Help 2]
[ERROR]     Unknown packaging: mar @ line 35, column 16
[ERROR] 
[ERROR] To see the full stack trace of the errors, re-run Maven with the -e switch.
[ERROR] Re-run Maven using the -X switch to enable full debug logging.
[ERROR] 
[ERROR] For more information about the errors and possible solutions, please read the following
articles:
[ERROR] [Help 1] http://cwiki.apache.org/confluence/display/MAVEN/ProjectBuildingException
[ERROR] [Help 2] http://cwiki.apache.org/confluence/display/MAVEN/PluginResolutionException
[locks-and-latches] Releasing all the locks
[locks-and-latches] All the locks released
channel stopped

---------------------------------------------------------------------
To unsubscribe, e-mail: java-dev-unsubscribe@axis.apache.org
For additional commands, e-mail: java-dev-help@axis.apache.org


Mime
View raw message