axis-java-dev mailing list archives

Site index · List index
Message view « Date » · « Thread »
Top « Date » · « Thread »
From Apache Jenkins Server <jenk...@builds.apache.org>
Subject Build failed in Jenkins: Axis2 » Apache Axis2 - Distribution #3406
Date Sat, 19 Mar 2016 22:38:12 GMT
See <https://builds.apache.org/job/Axis2/org.apache.axis2$distribution/3406/>

------------------------------------------
[...truncated 546 lines...]
[INFO] Generating <https://builds.apache.org/job/Axis2/org.apache.axis2$distribution/ws/target/axis2-1.8.0-SNAPSHOT/samples/jaxws-calculator/target/apidocs/org/apache/axis2/jaxws/calculator/client/class-use/AddSEIClient.html...>
[INFO] Generating <https://builds.apache.org/job/Axis2/org.apache.axis2$distribution/ws/target/axis2-1.8.0-SNAPSHOT/samples/jaxws-calculator/target/apidocs/org/apache/axis2/jaxws/calculator/client/class-use/GetTicketResponse.html...>
[INFO] Generating <https://builds.apache.org/job/Axis2/org.apache.axis2$distribution/ws/target/axis2-1.8.0-SNAPSHOT/samples/jaxws-calculator/target/apidocs/org/apache/axis2/jaxws/calculator/package-use.html...>
[INFO] Generating <https://builds.apache.org/job/Axis2/org.apache.axis2$distribution/ws/target/axis2-1.8.0-SNAPSHOT/samples/jaxws-calculator/target/apidocs/org/apache/axis2/jaxws/calculator/client/package-use.html...>
[INFO] Building index for all the packages and classes...
[INFO] Generating <https://builds.apache.org/job/Axis2/org.apache.axis2$distribution/ws/target/axis2-1.8.0-SNAPSHOT/samples/jaxws-calculator/target/apidocs/overview-tree.html...>
[INFO] Generating <https://builds.apache.org/job/Axis2/org.apache.axis2$distribution/ws/target/axis2-1.8.0-SNAPSHOT/samples/jaxws-calculator/target/apidocs/index-all.html...>
[INFO] Generating <https://builds.apache.org/job/Axis2/org.apache.axis2$distribution/ws/target/axis2-1.8.0-SNAPSHOT/samples/jaxws-calculator/target/apidocs/deprecated-list.html...>
[INFO] Building index for all classes...
[INFO] Generating <https://builds.apache.org/job/Axis2/org.apache.axis2$distribution/ws/target/axis2-1.8.0-SNAPSHOT/samples/jaxws-calculator/target/apidocs/allclasses-frame.html...>
[INFO] Generating <https://builds.apache.org/job/Axis2/org.apache.axis2$distribution/ws/target/axis2-1.8.0-SNAPSHOT/samples/jaxws-calculator/target/apidocs/allclasses-noframe.html...>
[INFO] Generating <https://builds.apache.org/job/Axis2/org.apache.axis2$distribution/ws/target/axis2-1.8.0-SNAPSHOT/samples/jaxws-calculator/target/apidocs/index.html...>
[INFO] Generating <https://builds.apache.org/job/Axis2/org.apache.axis2$distribution/ws/target/axis2-1.8.0-SNAPSHOT/samples/jaxws-calculator/target/apidocs/overview-summary.html...>
[INFO] Generating <https://builds.apache.org/job/Axis2/org.apache.axis2$distribution/ws/target/axis2-1.8.0-SNAPSHOT/samples/jaxws-calculator/target/apidocs/help-doc.html...>
[INFO] [INFO] Building jar: <https://builds.apache.org/job/Axis2/org.apache.axis2$distribution/ws/target/axis2-1.8.0-SNAPSHOT/samples/jaxws-calculator/target/jaxws-calculator-1.8.0-SNAPSHOT-javadoc.jar>
[INFO] [INFO] 
[INFO] [INFO] --- maven-jar-plugin:2.3.1:jar (default) @ jaxws-calculator ---
[INFO] [INFO] Building jar: <https://builds.apache.org/job/Axis2/org.apache.axis2$distribution/ws/target/axis2-1.8.0-SNAPSHOT/samples/jaxws-calculator/target/jaxws-calculator-1.8.0-SNAPSHOT-client.jar>
[INFO] [INFO]                                                                         
[INFO] [INFO] ------------------------------------------------------------------------
[INFO] [INFO] Building JAXWS Interop Sample 1.8.0-SNAPSHOT
[INFO] [INFO] ------------------------------------------------------------------------
[INFO] [INFO] 
[INFO] [INFO] --- maven-enforcer-plugin:1.1:enforce (default) @ jaxws-interop ---
[INFO] [INFO] 
[INFO] [INFO] --- maven-remote-resources-plugin:1.5:process (default) @ jaxws-interop ---
[INFO] [INFO] 
[INFO] [INFO] --- maven-resources-plugin:2.4.2:resources (default-resources) @ jaxws-interop
---
[INFO] [INFO] Using 'UTF-8' encoding to copy filtered resources.
[INFO] [INFO] Copying 4 resources
[INFO] [INFO] Copying 3 resources
[INFO] [INFO] 
[INFO] [INFO] --- maven-compiler-plugin:2.3.1:compile (default-compile) @ jaxws-interop ---
[INFO] [INFO] Compiling 9 source files to <https://builds.apache.org/job/Axis2/org.apache.axis2$distribution/ws/target/axis2-1.8.0-SNAPSHOT/samples/jaxws-interop/target/classes>
[INFO] [INFO] 
[INFO] [INFO] --- maven-resources-plugin:2.4.2:testResources (default-testResources) @ jaxws-interop
---
[INFO] [INFO] Using 'UTF-8' encoding to copy filtered resources.
[INFO] [INFO] skip non existing resourceDirectory <https://builds.apache.org/job/Axis2/org.apache.axis2$distribution/ws/target/axis2-1.8.0-SNAPSHOT/samples/jaxws-interop/src/test/resources>
[INFO] [INFO] Copying 3 resources
[INFO] [INFO] 
[INFO] [INFO] --- maven-compiler-plugin:2.3.1:testCompile (default-testCompile) @ jaxws-interop
---
[INFO] [INFO] No sources to compile
[INFO] [INFO] 
[INFO] [INFO] --- maven-surefire-plugin:2.13:test (default-test) @ jaxws-interop ---
[INFO] [INFO] 
[INFO] [INFO] --- maven-jar-plugin:2.2:jar (default-jar) @ jaxws-interop ---
[INFO] [INFO] Building jar: <https://builds.apache.org/job/Axis2/org.apache.axis2$distribution/ws/target/axis2-1.8.0-SNAPSHOT/samples/jaxws-interop/target/jaxws-interop-1.8.0-SNAPSHOT.jar>
[INFO] [INFO] 
[INFO] [INFO] --- maven-site-plugin:3.4:attach-descriptor (attach-descriptor) @ jaxws-interop
---
[INFO] [INFO] 
[INFO] [INFO] --- maven-assembly-plugin:2.6:single (source-release-assembly) @ jaxws-interop
---
[INFO] [INFO] Assemblies have been skipped per configuration of the skipAssembly parameter.
[INFO] [INFO] 
[INFO] [INFO] --- maven-source-plugin:2.4:jar-no-fork (source-jars) @ jaxws-interop ---
[INFO] [INFO] Building jar: <https://builds.apache.org/job/Axis2/org.apache.axis2$distribution/ws/target/axis2-1.8.0-SNAPSHOT/samples/jaxws-interop/target/jaxws-interop-1.8.0-SNAPSHOT-sources.jar>
[INFO] [INFO] 
[INFO] [INFO] --- maven-javadoc-plugin:2.10.3:jar (attach-javadocs) @ jaxws-interop ---
[INFO] [INFO] 
[INFO] Loading source files for package org.apache.axis2.jaxws.interop...
[INFO] Loading source files for package org.tempuri...
[INFO] Loading source files for package org.datacontract.schemas._2004._07.system...
[INFO] Loading source files for package com.microsoft.schemas._2003._10.serialization...
[INFO] Constructing Javadoc information...
[INFO] Standard Doclet version 1.8.0_66
[INFO] Building tree for all the packages and classes...
[INFO] Generating <https://builds.apache.org/job/Axis2/org.apache.axis2$distribution/ws/target/axis2-1.8.0-SNAPSHOT/samples/jaxws-interop/target/apidocs/org/apache/axis2/jaxws/interop/InteropSampleClient.html...>
[INFO] Generating <https://builds.apache.org/job/Axis2/org.apache.axis2$distribution/ws/target/axis2-1.8.0-SNAPSHOT/samples/jaxws-interop/target/apidocs/org/apache/axis2/jaxws/interop/InteropSampleService.html...>
[INFO] Generating <https://builds.apache.org/job/Axis2/org.apache.axis2$distribution/ws/target/axis2-1.8.0-SNAPSHOT/samples/jaxws-interop/target/apidocs/org/tempuri/BaseDataTypesDocLitBService.html...>
[INFO] Generating <https://builds.apache.org/job/Axis2/org.apache.axis2$distribution/ws/target/axis2-1.8.0-SNAPSHOT/samples/jaxws-interop/target/apidocs/org/tempuri/IBaseDataTypesDocLitB.html...>
[INFO] Generating <https://builds.apache.org/job/Axis2/org.apache.axis2$distribution/ws/target/axis2-1.8.0-SNAPSHOT/samples/jaxws-interop/target/apidocs/org/tempuri/ObjectFactory.html...>
[INFO] Generating <https://builds.apache.org/job/Axis2/org.apache.axis2$distribution/ws/target/axis2-1.8.0-SNAPSHOT/samples/jaxws-interop/target/apidocs/org/datacontract/schemas/_2004/_07/system/DateTimeOffset.html...>
[INFO] Generating <https://builds.apache.org/job/Axis2/org.apache.axis2$distribution/ws/target/axis2-1.8.0-SNAPSHOT/samples/jaxws-interop/target/apidocs/org/datacontract/schemas/_2004/_07/system/ObjectFactory.html...>
[INFO] Generating <https://builds.apache.org/job/Axis2/org.apache.axis2$distribution/ws/target/axis2-1.8.0-SNAPSHOT/samples/jaxws-interop/target/apidocs/com/microsoft/schemas/_2003/_10/serialization/ObjectFactory.html...>
[INFO] Generating <https://builds.apache.org/job/Axis2/org.apache.axis2$distribution/ws/target/axis2-1.8.0-SNAPSHOT/samples/jaxws-interop/target/apidocs/overview-frame.html...>
[INFO] Generating <https://builds.apache.org/job/Axis2/org.apache.axis2$distribution/ws/target/axis2-1.8.0-SNAPSHOT/samples/jaxws-interop/target/apidocs/com/microsoft/schemas/_2003/_10/serialization/package-frame.html...>
[INFO] Generating <https://builds.apache.org/job/Axis2/org.apache.axis2$distribution/ws/target/axis2-1.8.0-SNAPSHOT/samples/jaxws-interop/target/apidocs/com/microsoft/schemas/_2003/_10/serialization/package-summary.html...>
[INFO] Generating <https://builds.apache.org/job/Axis2/org.apache.axis2$distribution/ws/target/axis2-1.8.0-SNAPSHOT/samples/jaxws-interop/target/apidocs/com/microsoft/schemas/_2003/_10/serialization/package-tree.html...>
[INFO] Generating <https://builds.apache.org/job/Axis2/org.apache.axis2$distribution/ws/target/axis2-1.8.0-SNAPSHOT/samples/jaxws-interop/target/apidocs/org/apache/axis2/jaxws/interop/package-frame.html...>
[INFO] Generating <https://builds.apache.org/job/Axis2/org.apache.axis2$distribution/ws/target/axis2-1.8.0-SNAPSHOT/samples/jaxws-interop/target/apidocs/org/apache/axis2/jaxws/interop/package-summary.html...>
[INFO] Generating <https://builds.apache.org/job/Axis2/org.apache.axis2$distribution/ws/target/axis2-1.8.0-SNAPSHOT/samples/jaxws-interop/target/apidocs/org/apache/axis2/jaxws/interop/package-tree.html...>
[INFO] Generating <https://builds.apache.org/job/Axis2/org.apache.axis2$distribution/ws/target/axis2-1.8.0-SNAPSHOT/samples/jaxws-interop/target/apidocs/org/datacontract/schemas/_2004/_07/system/package-frame.html...>
[INFO] Generating <https://builds.apache.org/job/Axis2/org.apache.axis2$distribution/ws/target/axis2-1.8.0-SNAPSHOT/samples/jaxws-interop/target/apidocs/org/datacontract/schemas/_2004/_07/system/package-summary.html...>
[INFO] Generating <https://builds.apache.org/job/Axis2/org.apache.axis2$distribution/ws/target/axis2-1.8.0-SNAPSHOT/samples/jaxws-interop/target/apidocs/org/datacontract/schemas/_2004/_07/system/package-tree.html...>
[INFO] Generating <https://builds.apache.org/job/Axis2/org.apache.axis2$distribution/ws/target/axis2-1.8.0-SNAPSHOT/samples/jaxws-interop/target/apidocs/org/tempuri/package-frame.html...>
[INFO] Generating <https://builds.apache.org/job/Axis2/org.apache.axis2$distribution/ws/target/axis2-1.8.0-SNAPSHOT/samples/jaxws-interop/target/apidocs/org/tempuri/package-summary.html...>
[INFO] Generating <https://builds.apache.org/job/Axis2/org.apache.axis2$distribution/ws/target/axis2-1.8.0-SNAPSHOT/samples/jaxws-interop/target/apidocs/org/tempuri/package-tree.html...>
[INFO] Generating <https://builds.apache.org/job/Axis2/org.apache.axis2$distribution/ws/target/axis2-1.8.0-SNAPSHOT/samples/jaxws-interop/target/apidocs/constant-values.html...>
[INFO] Generating <https://builds.apache.org/job/Axis2/org.apache.axis2$distribution/ws/target/axis2-1.8.0-SNAPSHOT/samples/jaxws-interop/target/apidocs/org/apache/axis2/jaxws/interop/class-use/InteropSampleService.html...>
[INFO] Generating <https://builds.apache.org/job/Axis2/org.apache.axis2$distribution/ws/target/axis2-1.8.0-SNAPSHOT/samples/jaxws-interop/target/apidocs/org/apache/axis2/jaxws/interop/class-use/InteropSampleClient.html...>
[INFO] Generating <https://builds.apache.org/job/Axis2/org.apache.axis2$distribution/ws/target/axis2-1.8.0-SNAPSHOT/samples/jaxws-interop/target/apidocs/org/tempuri/class-use/IBaseDataTypesDocLitB.html...>
[INFO] Generating <https://builds.apache.org/job/Axis2/org.apache.axis2$distribution/ws/target/axis2-1.8.0-SNAPSHOT/samples/jaxws-interop/target/apidocs/org/tempuri/class-use/ObjectFactory.html...>
[INFO] Generating <https://builds.apache.org/job/Axis2/org.apache.axis2$distribution/ws/target/axis2-1.8.0-SNAPSHOT/samples/jaxws-interop/target/apidocs/org/tempuri/class-use/BaseDataTypesDocLitBService.html...>
[INFO] Generating <https://builds.apache.org/job/Axis2/org.apache.axis2$distribution/ws/target/axis2-1.8.0-SNAPSHOT/samples/jaxws-interop/target/apidocs/org/datacontract/schemas/_2004/_07/system/class-use/DateTimeOffset.html...>
[INFO] Generating <https://builds.apache.org/job/Axis2/org.apache.axis2$distribution/ws/target/axis2-1.8.0-SNAPSHOT/samples/jaxws-interop/target/apidocs/org/datacontract/schemas/_2004/_07/system/class-use/ObjectFactory.html...>
[INFO] Generating <https://builds.apache.org/job/Axis2/org.apache.axis2$distribution/ws/target/axis2-1.8.0-SNAPSHOT/samples/jaxws-interop/target/apidocs/com/microsoft/schemas/_2003/_10/serialization/class-use/ObjectFactory.html...>
[INFO] Generating <https://builds.apache.org/job/Axis2/org.apache.axis2$distribution/ws/target/axis2-1.8.0-SNAPSHOT/samples/jaxws-interop/target/apidocs/com/microsoft/schemas/_2003/_10/serialization/package-use.html...>
[INFO] Generating <https://builds.apache.org/job/Axis2/org.apache.axis2$distribution/ws/target/axis2-1.8.0-SNAPSHOT/samples/jaxws-interop/target/apidocs/org/apache/axis2/jaxws/interop/package-use.html...>
[INFO] Generating <https://builds.apache.org/job/Axis2/org.apache.axis2$distribution/ws/target/axis2-1.8.0-SNAPSHOT/samples/jaxws-interop/target/apidocs/org/datacontract/schemas/_2004/_07/system/package-use.html...>
[INFO] Generating <https://builds.apache.org/job/Axis2/org.apache.axis2$distribution/ws/target/axis2-1.8.0-SNAPSHOT/samples/jaxws-interop/target/apidocs/org/tempuri/package-use.html...>
[INFO] Building index for all the packages and classes...
[INFO] Generating <https://builds.apache.org/job/Axis2/org.apache.axis2$distribution/ws/target/axis2-1.8.0-SNAPSHOT/samples/jaxws-interop/target/apidocs/overview-tree.html...>
[INFO] Generating <https://builds.apache.org/job/Axis2/org.apache.axis2$distribution/ws/target/axis2-1.8.0-SNAPSHOT/samples/jaxws-interop/target/apidocs/index-all.html...>
[INFO] Generating <https://builds.apache.org/job/Axis2/org.apache.axis2$distribution/ws/target/axis2-1.8.0-SNAPSHOT/samples/jaxws-interop/target/apidocs/deprecated-list.html...>
[INFO] Building index for all classes...
[INFO] Generating <https://builds.apache.org/job/Axis2/org.apache.axis2$distribution/ws/target/axis2-1.8.0-SNAPSHOT/samples/jaxws-interop/target/apidocs/allclasses-frame.html...>
[INFO] Generating <https://builds.apache.org/job/Axis2/org.apache.axis2$distribution/ws/target/axis2-1.8.0-SNAPSHOT/samples/jaxws-interop/target/apidocs/allclasses-noframe.html...>
[INFO] Generating <https://builds.apache.org/job/Axis2/org.apache.axis2$distribution/ws/target/axis2-1.8.0-SNAPSHOT/samples/jaxws-interop/target/apidocs/index.html...>
[INFO] Generating <https://builds.apache.org/job/Axis2/org.apache.axis2$distribution/ws/target/axis2-1.8.0-SNAPSHOT/samples/jaxws-interop/target/apidocs/overview-summary.html...>
[INFO] Generating <https://builds.apache.org/job/Axis2/org.apache.axis2$distribution/ws/target/axis2-1.8.0-SNAPSHOT/samples/jaxws-interop/target/apidocs/help-doc.html...>
[INFO] 9 warnings
[INFO] [WARNING] Javadoc Warnings
[INFO] [WARNING] <https://builds.apache.org/job/Axis2/org.apache.axis2$distribution/ws/target/axis2-1.8.0-SNAPSHOT/samples/jaxws-interop/src/org/tempuri/ObjectFactory.java>:344:
warning - Tag @link: reference not found: byte[]
[INFO] [WARNING] <https://builds.apache.org/job/Axis2/org.apache.axis2$distribution/ws/target/axis2-1.8.0-SNAPSHOT/samples/jaxws-interop/src/org/tempuri/ObjectFactory.java>:164:
warning - Tag @link: reference not found: byte[]
[INFO] [WARNING] <https://builds.apache.org/job/Axis2/org.apache.axis2$distribution/ws/target/axis2-1.8.0-SNAPSHOT/samples/jaxws-interop/src/org/tempuri/ObjectFactory.java>:164:
warning - Tag @link: reference not found: byte[]
[INFO] [WARNING] <https://builds.apache.org/job/Axis2/org.apache.axis2$distribution/ws/target/axis2-1.8.0-SNAPSHOT/samples/jaxws-interop/src/org/tempuri/ObjectFactory.java>:344:
warning - Tag @link: reference not found: byte[]
[INFO] [WARNING] <https://builds.apache.org/job/Axis2/org.apache.axis2$distribution/ws/target/axis2-1.8.0-SNAPSHOT/samples/jaxws-interop/src/com/microsoft/schemas/_2003/_10/serialization/ObjectFactory.java>:228:
warning - Tag @link: reference not found: byte[]
[INFO] [WARNING] <https://builds.apache.org/job/Axis2/org.apache.axis2$distribution/ws/target/axis2-1.8.0-SNAPSHOT/samples/jaxws-interop/src/com/microsoft/schemas/_2003/_10/serialization/ObjectFactory.java>:228:
warning - Tag @link: reference not found: byte[]
[INFO] [WARNING] <https://builds.apache.org/job/Axis2/org.apache.axis2$distribution/ws/target/axis2-1.8.0-SNAPSHOT/samples/jaxws-interop/src/com/microsoft/schemas/_2003/_10/serialization/ObjectFactory.java>:228:
warning - Tag @link: reference not found: byte[]
[INFO] [WARNING] <https://builds.apache.org/job/Axis2/org.apache.axis2$distribution/ws/target/axis2-1.8.0-SNAPSHOT/samples/jaxws-interop/src/org/tempuri/ObjectFactory.java>:344:
warning - Tag @link: reference not found: byte[]
[INFO] [WARNING] <https://builds.apache.org/job/Axis2/org.apache.axis2$distribution/ws/target/axis2-1.8.0-SNAPSHOT/samples/jaxws-interop/src/org/tempuri/ObjectFactory.java>:164:
warning - Tag @link: reference not found: byte[]
[INFO] [INFO] Building jar: <https://builds.apache.org/job/Axis2/org.apache.axis2$distribution/ws/target/axis2-1.8.0-SNAPSHOT/samples/jaxws-interop/target/jaxws-interop-1.8.0-SNAPSHOT-javadoc.jar>
[INFO] [INFO]                                                                         
[INFO] [INFO] ------------------------------------------------------------------------
[INFO] [INFO] Building JAXWS Samples - Echo, Ping, MTOM 1.8.0-SNAPSHOT
[INFO] [INFO] ------------------------------------------------------------------------
[INFO] [INFO] Downloading: https://repo.maven.apache.org/maven2/org/apache/maven/plugins/maven-dependency-plugin/2.2/maven-dependency-plugin-2.2.pom
[INFO] [INFO] Downloaded: https://repo.maven.apache.org/maven2/org/apache/maven/plugins/maven-dependency-plugin/2.2/maven-dependency-plugin-2.2.pom
(11 KB at 138.6 KB/sec)
[INFO] [INFO] Downloading: https://repo.maven.apache.org/maven2/org/apache/maven/plugins/maven-plugins/19/maven-plugins-19.pom
[INFO] [INFO] Downloaded: https://repo.maven.apache.org/maven2/org/apache/maven/plugins/maven-plugins/19/maven-plugins-19.pom
(11 KB at 158.1 KB/sec)
[INFO] [INFO] Downloading: https://repo.maven.apache.org/maven2/org/apache/maven/plugins/maven-dependency-plugin/2.2/maven-dependency-plugin-2.2.jar
[INFO] [INFO] Downloaded: https://repo.maven.apache.org/maven2/org/apache/maven/plugins/maven-dependency-plugin/2.2/maven-dependency-plugin-2.2.jar
(125 KB at 1401.9 KB/sec)
[INFO] [INFO] Downloading: http://repository.apache.org/snapshots/org/apache/axis2/addressing/1.8.0-SNAPSHOT/addressing-1.8.0-20160319.211321-203.mar
[INFO] [INFO] Downloaded: http://repository.apache.org/snapshots/org/apache/axis2/addressing/1.8.0-SNAPSHOT/addressing-1.8.0-20160319.211321-203.mar
(33 KB at 46.7 KB/sec)
[INFO] [INFO] 
[INFO] [INFO] --- maven-enforcer-plugin:1.1:enforce (default) @ jaxws-samples ---
[INFO] [INFO] 
[INFO] [INFO] --- maven-remote-resources-plugin:1.5:process (default) @ jaxws-samples ---
[INFO] [INFO] 
[INFO] [INFO] --- maven-resources-plugin:2.4.2:resources (default-resources) @ jaxws-samples
---
[INFO] [INFO] Using 'UTF-8' encoding to copy filtered resources.
[INFO] [INFO] Copying 0 resource
[INFO] [INFO] Copying 3 resources
[INFO] [INFO] 
[INFO] [INFO] --- maven-compiler-plugin:2.3.1:compile (default-compile) @ jaxws-samples ---
[INFO] [INFO] Compiling 46 source files to <https://builds.apache.org/job/Axis2/org.apache.axis2$distribution/ws/target/axis2-1.8.0-SNAPSHOT/samples/jaxws-samples/target/classes>
[INFO] [INFO] 
[INFO] [INFO] --- maven-resources-plugin:2.4.2:testResources (default-testResources) @ jaxws-samples
---
[INFO] [INFO] Using 'UTF-8' encoding to copy filtered resources.
[INFO] [INFO] skip non existing resourceDirectory <https://builds.apache.org/job/Axis2/org.apache.axis2$distribution/ws/target/axis2-1.8.0-SNAPSHOT/samples/jaxws-samples/src/test>
[INFO] [INFO] Copying 3 resources
[INFO] [INFO] 
[INFO] [INFO] --- maven-compiler-plugin:2.3.1:testCompile (default-testCompile) @ jaxws-samples
---
[INFO] [INFO] No sources to compile
[INFO] [INFO] 
[INFO] [INFO] --- maven-surefire-plugin:2.13:test (default-test) @ jaxws-samples ---
[INFO] [INFO] 
[INFO] [INFO] --- maven-dependency-plugin:2.2:copy-dependencies (copy-modules) @ jaxws-samples
---
[INFO] [INFO] Downloading: https://repo.maven.apache.org/maven2/org/apache/maven/reporting/maven-reporting-impl/2.0.5/maven-reporting-impl-2.0.5.pom
[INFO] [INFO] Downloaded: https://repo.maven.apache.org/maven2/org/apache/maven/reporting/maven-reporting-impl/2.0.5/maven-reporting-impl-2.0.5.pom
(5 KB at 72.4 KB/sec)
[INFO] [INFO] Downloading: https://repo.maven.apache.org/maven2/org/codehaus/plexus/plexus-utils/1.5.7/plexus-utils-1.5.7.pom
[INFO] [INFO] Downloaded: https://repo.maven.apache.org/maven2/org/codehaus/plexus/plexus-utils/1.5.7/plexus-utils-1.5.7.pom
(8 KB at 140.6 KB/sec)
[INFO] [INFO] Downloading: https://repo.maven.apache.org/maven2/org/apache/maven/shared/maven-doxia-tools/1.0.2/maven-doxia-tools-1.0.2.pom
[INFO] [INFO] Downloaded: https://repo.maven.apache.org/maven2/org/apache/maven/shared/maven-doxia-tools/1.0.2/maven-doxia-tools-1.0.2.pom
(6 KB at 90.9 KB/sec)
[INFO] [INFO] Downloading: https://repo.maven.apache.org/maven2/org/codehaus/plexus/plexus-archiver/1.0-alpha-12/plexus-archiver-1.0-alpha-12.pom
[INFO] [INFO] Downloaded: https://repo.maven.apache.org/maven2/org/codehaus/plexus/plexus-archiver/1.0-alpha-12/plexus-archiver-1.0-alpha-12.pom
(2 KB at 20.8 KB/sec)
[INFO] [INFO] Downloading: https://repo.maven.apache.org/maven2/org/codehaus/plexus/plexus-io/1.0-alpha-4/plexus-io-1.0-alpha-4.pom
[INFO] [INFO] Downloaded: https://repo.maven.apache.org/maven2/org/codehaus/plexus/plexus-io/1.0-alpha-4/plexus-io-1.0-alpha-4.pom
(2 KB at 15.0 KB/sec)
[INFO] [INFO] Downloading: https://repo.maven.apache.org/maven2/org/codehaus/plexus/plexus-io/1.0-alpha-5/plexus-io-1.0-alpha-5.pom
[INFO] [INFO] Downloaded: https://repo.maven.apache.org/maven2/org/codehaus/plexus/plexus-io/1.0-alpha-5/plexus-io-1.0-alpha-5.pom
(2 KB at 16.7 KB/sec)
[INFO] [INFO] Downloading: https://repo.maven.apache.org/maven2/org/apache/maven/shared/maven-dependency-analyzer/1.2/maven-dependency-analyzer-1.2.pom
[INFO] [INFO] Downloaded: https://repo.maven.apache.org/maven2/org/apache/maven/shared/maven-dependency-analyzer/1.2/maven-dependency-analyzer-1.2.pom
(5 KB at 75.3 KB/sec)
[INFO] [INFO] Downloading: https://repo.maven.apache.org/maven2/org/apache/maven/shared/maven-shared-components/16/maven-shared-components-16.pom
[INFO] [INFO] Downloaded: https://repo.maven.apache.org/maven2/org/apache/maven/shared/maven-shared-components/16/maven-shared-components-16.pom
(9 KB at 133.4 KB/sec)
[INFO] [INFO] Downloading: https://repo.maven.apache.org/maven2/org/apache/maven/shared/maven-invoker/2.0.7/maven-invoker-2.0.7.pom
[INFO] [INFO] Downloaded: https://repo.maven.apache.org/maven2/org/apache/maven/shared/maven-invoker/2.0.7/maven-invoker-2.0.7.pom
(3 KB at 28.9 KB/sec)
[INFO] [INFO] Downloading: https://repo.maven.apache.org/maven2/org/apache/maven/reporting/maven-reporting-impl/2.0.5/maven-reporting-impl-2.0.5.jar
[INFO] [INFO] Downloading: https://repo.maven.apache.org/maven2/org/apache/maven/shared/maven-doxia-tools/1.0.2/maven-doxia-tools-1.0.2.jar
[INFO] [INFO] Downloading: https://repo.maven.apache.org/maven2/org/codehaus/plexus/plexus-archiver/1.0-alpha-12/plexus-archiver-1.0-alpha-12.jar
[INFO] [INFO] Downloading: https://repo.maven.apache.org/maven2/org/apache/maven/shared/maven-dependency-analyzer/1.2/maven-dependency-analyzer-1.2.jar
[INFO] [INFO] Downloading: https://repo.maven.apache.org/maven2/org/codehaus/plexus/plexus-io/1.0-alpha-5/plexus-io-1.0-alpha-5.jar
[INFO] [INFO] Downloaded: https://repo.maven.apache.org/maven2/org/apache/maven/reporting/maven-reporting-impl/2.0.5/maven-reporting-impl-2.0.5.jar
(21 KB at 68.2 KB/sec)
[INFO] [INFO] Downloading: https://repo.maven.apache.org/maven2/org/apache/maven/shared/maven-invoker/2.0.7/maven-invoker-2.0.7.jar
[INFO] [INFO] Downloaded: https://repo.maven.apache.org/maven2/org/apache/maven/shared/maven-doxia-tools/1.0.2/maven-doxia-tools-1.0.2.jar
(41 KB at 345.9 KB/sec)
[INFO] [INFO] Downloaded: https://repo.maven.apache.org/maven2/org/apache/maven/shared/maven-invoker/2.0.7/maven-invoker-2.0.7.jar
(25 KB at 173.6 KB/sec)
[INFO] [INFO] Downloaded: https://repo.maven.apache.org/maven2/org/apache/maven/shared/maven-dependency-analyzer/1.2/maven-dependency-analyzer-1.2.jar
(28 KB at 133.8 KB/sec)
[INFO] [INFO] Downloaded: https://repo.maven.apache.org/maven2/org/codehaus/plexus/plexus-io/1.0-alpha-5/plexus-io-1.0-alpha-5.jar
(50 KB at 216.4 KB/sec)
[INFO] [INFO] Downloaded: https://repo.maven.apache.org/maven2/org/codehaus/plexus/plexus-archiver/1.0-alpha-12/plexus-archiver-1.0-alpha-12.jar
(173 KB at 517.3 KB/sec)
[INFO] [INFO] Copying addressing-1.8.0-SNAPSHOT.mar to <https://builds.apache.org/job/Axis2/org.apache.axis2$distribution/ws/target/axis2-1.8.0-SNAPSHOT/samples/jaxws-samples/target/modules/addressing-1.8.0-20160319.211321-203.mar>
[INFO] [INFO] 
[INFO] [INFO] --- maven-war-plugin:2.1.1:war (default-war) @ jaxws-samples ---
[INFO] [INFO] Packaging webapp
[INFO] [INFO] Assembling webapp [jaxws-samples] in [<https://builds.apache.org/job/Axis2/org.apache.axis2$distribution/ws/target/axis2-1.8.0-SNAPSHOT/samples/jaxws-samples/target/jaxws-samples-1.8.0-SNAPSHOT]>
[INFO] [INFO] Processing war project
[INFO] [INFO] Copying webapp webResources [<https://builds.apache.org/job/Axis2/org.apache.axis2$distribution/ws/target/axis2-1.8.0-SNAPSHOT/samples/jaxws-samples/target/modules/]>
to [<https://builds.apache.org/job/Axis2/org.apache.axis2$distribution/ws/target/axis2-1.8.0-SNAPSHOT/samples/jaxws-samples/target/jaxws-samples-1.8.0-SNAPSHOT]>
[INFO] [INFO] Copying webapp resources [<https://builds.apache.org/job/Axis2/org.apache.axis2$distribution/ws/target/axis2-1.8.0-SNAPSHOT/samples/jaxws-samples/src/webapp]>
[INFO] [INFO] Webapp assembled in [308 msecs]
[INFO] [INFO] Building war: <https://builds.apache.org/job/Axis2/org.apache.axis2$distribution/ws/target/axis2-1.8.0-SNAPSHOT/samples/jaxws-samples/target/jaxws-samples.war>
[INFO] [INFO] WEB-INF/web.xml already added, skipping
[INFO] [INFO] 
[INFO] [INFO] --- maven-site-plugin:3.4:attach-descriptor (attach-descriptor) @ jaxws-samples
---
[INFO] [INFO] 
[INFO] [INFO] --- maven-assembly-plugin:2.6:single (source-release-assembly) @ jaxws-samples
---
[INFO] [INFO] Assemblies have been skipped per configuration of the skipAssembly parameter.
[INFO] [INFO] 
[INFO] [INFO] --- maven-source-plugin:2.4:jar-no-fork (source-jars) @ jaxws-samples ---
[INFO] [INFO] Building jar: <https://builds.apache.org/job/Axis2/org.apache.axis2$distribution/ws/target/axis2-1.8.0-SNAPSHOT/samples/jaxws-samples/target/jaxws-samples-1.8.0-SNAPSHOT-sources.jar>
[INFO] [INFO] 
[INFO] [INFO] --- maven-javadoc-plugin:2.10.3:jar (attach-javadocs) @ jaxws-samples ---
[INFO] [INFO] ------------------------------------------------------------------------
[INFO] [INFO] Reactor Summary:
[INFO] [INFO] 
[INFO] [INFO] Samples parent POM ................................. SUCCESS [ 13.751 s]
[INFO] [INFO] JAXWS - Starting from Java Example ................. SUCCESS [ 24.183 s]
[INFO] [INFO] JAXWS Addressbook Service .......................... SUCCESS [ 13.891 s]
[INFO] [INFO] JAXWS Calculator Service ........................... SUCCESS [ 13.712 s]
[INFO] [INFO] JAXWS Interop Sample ............................... SUCCESS [ 14.181 s]
[INFO] [INFO] JAXWS Samples - Echo, Ping, MTOM ................... FAILURE [ 13.472 s]
[INFO] [INFO] Apache Axis2 -JAXWS Version Service ................ SKIPPED
[INFO] [INFO] Apache Axis2 Transport-HTTPS sample ................ SKIPPED
[INFO] [INFO] httpsService ....................................... SKIPPED
[INFO] [INFO] httpsClient ........................................ SKIPPED
[INFO] [INFO] Apache Axis2 Transport-JMS sample .................. SKIPPED
[INFO] [INFO] jmsService ......................................... SKIPPED
[INFO] [INFO] ------------------------------------------------------------------------
[INFO] [INFO] BUILD FAILURE
[INFO] [INFO] ------------------------------------------------------------------------
[INFO] [INFO] Total time: 01:35 min
[INFO] [INFO] Finished at: 2016-03-19T22:35:36+00:00
[INFO] [INFO] Final Memory: 65M/314M
[INFO] [INFO] ------------------------------------------------------------------------
[INFO] [ERROR] Failed to execute goal org.apache.maven.plugins:maven-javadoc-plugin:2.10.3:jar
(attach-javadocs) on project jaxws-samples: MavenReportException: Error while generating Javadoc:
Unable to find javadoc command: The javadoc executable '/home/jenkins/jenkins-slave/tools/hudson.model.JDK/JDK_1.7_latest_/bin/javadoc'
doesn't exist or is not a file. Verify the JAVA_HOME environment variable. -> [Help 1]
[INFO] [ERROR] 
[INFO] [ERROR] To see the full stack trace of the errors, re-run Maven with the -e switch.
[INFO] [ERROR] Re-run Maven using the -X switch to enable full debug logging.
[INFO] [ERROR] 
[INFO] [ERROR] For more information about the errors and possible solutions, please read the
following articles:
[INFO] [ERROR] [Help 1] http://cwiki.apache.org/confluence/display/MAVEN/MojoExecutionException
[INFO] [ERROR] 
[INFO] [ERROR] After correcting the problems, you can resume the build with the command
[INFO] [ERROR]   mvn <goals> -rf :jaxws-samples
[INFO] ..FAILED (102.1 s)
[INFO]   The build exited with code 1. See <https://builds.apache.org/job/Axis2/org.apache.axis2$distribution/ws/target/axis2-1.8.0-SNAPSHOT/samples/build.log>
for details.
[INFO] -------------------------------------------------
[INFO] Build Summary:
[INFO]   Passed: 0, Failed: 1, Errors: 0, Skipped: 0
[INFO] -------------------------------------------------
[ERROR] The following builds failed:
[ERROR] *  pom.xml
[INFO] -------------------------------------------------

---------------------------------------------------------------------
To unsubscribe, e-mail: java-dev-unsubscribe@axis.apache.org
For additional commands, e-mail: java-dev-help@axis.apache.org


Mime
View raw message