axis-java-dev mailing list archives

Site index · List index
Message view « Date » · « Thread »
Top « Date » · « Thread »
From Apache Jenkins Server <jenk...@builds.apache.org>
Subject Build failed in Jenkins: Rampart #2106
Date Sat, 16 Jan 2016 20:42:04 GMT
See <https://builds.apache.org/job/Rampart/2106/>

------------------------------------------
Started by upstream project "Axis2" build number 3190
originally caused by:
 Started by an SCM change
[EnvInject] - Loading node environment variables.
Building remotely on ubuntu3 (Ubuntu ubuntu legacy-ubuntu) in workspace <https://builds.apache.org/job/Rampart/ws/>
Updating http://svn.apache.org/repos/asf/axis/axis2/java/rampart/trunk at revision '2016-01-16T20:41:40.182
+0000'
At revision 1725030
no change for http://svn.apache.org/repos/asf/axis/axis2/java/rampart/trunk since the previous
build
[locks-and-latches] Checking to see if we really have the locks
[locks-and-latches] Have all the locks, build can start
Parsing POMs
Established TCP socket on 42670
maven3-agent.jar already up to date
maven3-interceptor.jar already up to date
maven3-interceptor-commons.jar already up to date
[trunk] $ /home/jenkins/tools/java/jdk1.7.0_79-unlimited-security/bin/java -Xmx2g -Xms256m
-XX:MaxPermSize=512m -cp /home/jenkins/jenkins-slave/maven3-agent.jar:/home/jenkins/jenkins-slave/tools/hudson.tasks.Maven_MavenInstallation/Maven_3.0.3/boot/plexus-classworlds-2.4.jar
org.jvnet.hudson.maven3.agent.Maven3Main /home/jenkins/jenkins-slave/tools/hudson.tasks.Maven_MavenInstallation/Maven_3.0.3
/x1/jenkins/jenkins-slave/slave.jar /home/jenkins/jenkins-slave/maven3-interceptor.jar /home/jenkins/jenkins-slave/maven3-interceptor-commons.jar
42670
<===[JENKINS REMOTING CAPACITY]===>   channel started
Executing Maven:  -B -f <https://builds.apache.org/job/Rampart/ws/trunk/pom.xml> -Dmaven.repo.local=<https://builds.apache.org/job/Rampart/ws/.repository>
-U clean deploy -Papache-release -Dgpg.skip=true
[INFO] Scanning for projects...
Downloading: http://repository.apache.org/snapshots/org/apache/axis2/axis2-mar-maven-plugin/1.7.0-SNAPSHOT/maven-metadata.xml
Downloaded: http://repository.apache.org/snapshots/org/apache/axis2/axis2-mar-maven-plugin/1.7.0-SNAPSHOT/maven-metadata.xml
(2 KB at 0.8 KB/sec)
Downloading: http://repository.apache.org/snapshots/org/apache/axis2/axis2-mar-maven-plugin/1.7.0-SNAPSHOT/axis2-mar-maven-plugin-1.7.0-20160116.201852-2287.pom
Downloaded: http://repository.apache.org/snapshots/org/apache/axis2/axis2-mar-maven-plugin/1.7.0-SNAPSHOT/axis2-mar-maven-plugin-1.7.0-20160116.201852-2287.pom
(6 KB at 241.8 KB/sec)
Downloading: http://repository.apache.org/snapshots/org/apache/axis2/axis2/1.7.0-SNAPSHOT/maven-metadata.xml
Downloaded: http://repository.apache.org/snapshots/org/apache/axis2/axis2/1.7.0-SNAPSHOT/maven-metadata.xml
(818 B at 1.1 KB/sec)
Downloading: http://repository.apache.org/snapshots/org/apache/axis2/axis2/1.7.0-SNAPSHOT/axis2-1.7.0-20160116.200108-2164.pom
Downloaded: http://repository.apache.org/snapshots/org/apache/axis2/axis2/1.7.0-SNAPSHOT/axis2-1.7.0-20160116.200108-2164.pom
(58 KB at 113.8 KB/sec)
Downloading: http://repository.apache.org/snapshots/org/apache/axis2/axis2-mar-maven-plugin/1.7.0-SNAPSHOT/axis2-mar-maven-plugin-1.7.0-20160116.201852-2287.jar
Downloaded: http://repository.apache.org/snapshots/org/apache/axis2/axis2-mar-maven-plugin/1.7.0-SNAPSHOT/axis2-mar-maven-plugin-1.7.0-20160116.201852-2287.jar
(18 KB at 933.4 KB/sec)
[INFO] ------------------------------------------------------------------------
[INFO] Reactor Build Order:
[INFO] 
[INFO] Apache Rampart
[INFO] Rampart - Policy
[INFO] Rampart - Trust
[INFO] Rampart - Core
[INFO] Javadoc
[INFO] Rampart - Test Suite
[INFO] Rampart - Mar
[INFO] Rampart - Trust-Mar
[INFO] Rampart - Integration
[INFO] Rampart - Samples
[INFO] Rampart - Distribution
[INFO] Code Coverage Report
[INFO]                                                                         
[INFO] ------------------------------------------------------------------------
[INFO] Building Apache Rampart 1.7.0-SNAPSHOT
[INFO] ------------------------------------------------------------------------
[INFO] 
[INFO] --- maven-clean-plugin:2.5:clean (default-clean) @ rampart-project ---
[INFO] Deleting <https://builds.apache.org/job/Rampart/ws/trunk/target>
[INFO] 
[INFO] --- maven-enforcer-plugin:1.1:enforce (default) @ rampart-project ---
[INFO] 
[INFO] --- gmavenplus-plugin:1.5:execute (initialize) @ rampart-project ---
[INFO] Using Groovy 2.4.4 to perform execute.
[INFO] 
[INFO] --- jacoco-maven-plugin:0.6.1.201212231917:prepare-agent (prepare-agent-for-surefire)
@ rampart-project ---
[INFO] Skipping JaCoCo for project with packaging type 'pom'
[INFO] jacoco.surefireArgLine set to 
[INFO] 
[INFO] --- maven-remote-resources-plugin:1.5:process (default) @ rampart-project ---
[INFO] 
[INFO] --- build-helper-maven-plugin:1.7:attach-artifact (attach-jacoco-exec) @ rampart-project
---
[INFO] Skip attaching artifacts
[INFO] 
[INFO] --- maven-site-plugin:3.4:attach-descriptor (attach-descriptor) @ rampart-project ---
[INFO] 
[INFO] --- maven-assembly-plugin:2.6:single (source-release-assembly) @ rampart-project ---
[INFO] Assemblies have been skipped per configuration of the skipAssembly parameter.
[INFO] 
[INFO] --- maven-source-plugin:2.4:jar-no-fork (source-jars) @ rampart-project ---
[INFO] 
[INFO] --- maven-javadoc-plugin:2.10.3:jar (attach-javadocs) @ rampart-project ---
[INFO] Not executing Javadoc as the project is not a Java classpath-capable package
[INFO] 
[INFO] --- animal-sniffer-maven-plugin:1.14:check (check) @ rampart-project ---
[INFO] Checking unresolved references to org.codehaus.mojo.signature:java15:1.0
[INFO] 
[INFO] --- maven-gpg-plugin:1.5:sign (default) @ rampart-project ---
[INFO] 
[INFO] --- maven-install-plugin:2.5.2:install (default-install) @ rampart-project ---
[INFO] Installing <https://builds.apache.org/job/Rampart/ws/trunk/pom.xml> to <https://builds.apache.org/job/Rampart/ws/.repository/org/apache/rampart/rampart-project/1.7.0-SNAPSHOT/rampart-project-1.7.0-SNAPSHOT.pom>
[INFO] Installing <https://builds.apache.org/job/Rampart/ws/trunk/target/rampart-project-1.7.0-SNAPSHOT-site.xml>
to <https://builds.apache.org/job/Rampart/ws/.repository/org/apache/rampart/rampart-project/1.7.0-SNAPSHOT/rampart-project-1.7.0-SNAPSHOT-site.xml>
[INFO] 
[INFO] --- maven-deploy-plugin:2.8.2:deploy (default-deploy) @ rampart-project ---
Downloading: https://repository.apache.org/content/repositories/snapshots/org/apache/rampart/rampart-project/1.7.0-SNAPSHOT/maven-metadata.xml
Downloaded: https://repository.apache.org/content/repositories/snapshots/org/apache/rampart/rampart-project/1.7.0-SNAPSHOT/maven-metadata.xml
(830 B at 0.8 KB/sec)
Uploading: https://repository.apache.org/content/repositories/snapshots/org/apache/rampart/rampart-project/1.7.0-SNAPSHOT/rampart-project-1.7.0-20160116.204207-1677.pom
Uploaded: https://repository.apache.org/content/repositories/snapshots/org/apache/rampart/rampart-project/1.7.0-SNAPSHOT/rampart-project-1.7.0-20160116.204207-1677.pom
(26 KB at 108.0 KB/sec)
Downloading: https://repository.apache.org/content/repositories/snapshots/org/apache/rampart/rampart-project/maven-metadata.xml
Downloaded: https://repository.apache.org/content/repositories/snapshots/org/apache/rampart/rampart-project/maven-metadata.xml
(393 B at 3.5 KB/sec)
Uploading: https://repository.apache.org/content/repositories/snapshots/org/apache/rampart/rampart-project/1.7.0-SNAPSHOT/maven-metadata.xml
Uploaded: https://repository.apache.org/content/repositories/snapshots/org/apache/rampart/rampart-project/1.7.0-SNAPSHOT/maven-metadata.xml
(830 B at 7.4 KB/sec)
Uploading: https://repository.apache.org/content/repositories/snapshots/org/apache/rampart/rampart-project/maven-metadata.xml
Uploaded: https://repository.apache.org/content/repositories/snapshots/org/apache/rampart/rampart-project/maven-metadata.xml
(393 B at 3.7 KB/sec)
Uploading: https://repository.apache.org/content/repositories/snapshots/org/apache/rampart/rampart-project/1.7.0-SNAPSHOT/rampart-project-1.7.0-20160116.204207-1677-site.xml
Uploaded: https://repository.apache.org/content/repositories/snapshots/org/apache/rampart/rampart-project/1.7.0-SNAPSHOT/rampart-project-1.7.0-20160116.204207-1677-site.xml
(4 KB at 68.1 KB/sec)
Uploading: https://repository.apache.org/content/repositories/snapshots/org/apache/rampart/rampart-project/1.7.0-SNAPSHOT/maven-metadata.xml
Uploaded: https://repository.apache.org/content/repositories/snapshots/org/apache/rampart/rampart-project/1.7.0-SNAPSHOT/maven-metadata.xml
(830 B at 13.7 KB/sec)
[INFO]                                                                         
[INFO] ------------------------------------------------------------------------
[INFO] Building Rampart - Policy 1.7.0-SNAPSHOT
[INFO] ------------------------------------------------------------------------
Downloading: http://repository.apache.org/snapshots/org/apache/axis2/axis2-kernel/1.7.0-SNAPSHOT/maven-metadata.xml
Downloaded: http://repository.apache.org/snapshots/org/apache/axis2/axis2-kernel/1.7.0-SNAPSHOT/maven-metadata.xml
(2 KB at 12.4 KB/sec)
Downloading: http://repository.apache.org/snapshots/org/apache/axis2/axis2-kernel/1.7.0-SNAPSHOT/axis2-kernel-1.7.0-20160116.200200-2415.pom
Downloaded: http://repository.apache.org/snapshots/org/apache/axis2/axis2-kernel/1.7.0-SNAPSHOT/axis2-kernel-1.7.0-20160116.200200-2415.pom
(11 KB at 56.1 KB/sec)
Downloading: http://repository.apache.org/snapshots/org/apache/ws/commons/axiom/axiom-api/1.2.17-SNAPSHOT/maven-metadata.xml
Downloading: http://repository.apache.org/snapshots/org/apache/ws/commons/axiom/axiom-api/1.2.17-SNAPSHOT/maven-metadata.xml
Downloading: http://repository.apache.org/snapshots/org/apache/ws/commons/axiom/axiom-api/1.2.17-SNAPSHOT/axiom-api-1.2.17-SNAPSHOT.pom
[WARNING] The POM for org.apache.ws.commons.axiom:axiom-api:jar:1.2.17-SNAPSHOT is missing,
no dependency information available
Downloading: http://repository.apache.org/snapshots/org/apache/ws/commons/axiom/axiom-impl/1.2.17-SNAPSHOT/maven-metadata.xml
Downloading: http://repository.apache.org/snapshots/org/apache/ws/commons/axiom/axiom-impl/1.2.17-SNAPSHOT/maven-metadata.xml
Downloading: http://repository.apache.org/snapshots/org/apache/ws/commons/axiom/axiom-impl/1.2.17-SNAPSHOT/axiom-impl-1.2.17-SNAPSHOT.pom
[WARNING] The POM for org.apache.ws.commons.axiom:axiom-impl:jar:1.2.17-SNAPSHOT is missing,
no dependency information available
Downloading: http://repository.apache.org/snapshots/org/apache/woden/woden-core/1.0M11-SNAPSHOT/maven-metadata.xml
Downloaded: http://repository.apache.org/snapshots/org/apache/woden/woden-core/1.0M11-SNAPSHOT/maven-metadata.xml
(2 KB at 35.8 KB/sec)
Downloading: http://repository.apache.org/snapshots/org/apache/woden/woden/1.0M11-SNAPSHOT/maven-metadata.xml
Downloaded: http://repository.apache.org/snapshots/org/apache/woden/woden/1.0M11-SNAPSHOT/maven-metadata.xml
(812 B at 29.4 KB/sec)
Downloading: http://repository.apache.org/snapshots/org/apache/axis2/axis2-kernel/1.7.0-SNAPSHOT/axis2-kernel-1.7.0-20160116.200200-2415.jar
Downloading: http://repository.apache.org/snapshots/org/apache/ws/commons/axiom/axiom-impl/1.2.17-SNAPSHOT/axiom-impl-1.2.17-SNAPSHOT.jar
Downloading: http://repository.apache.org/snapshots/org/apache/ws/commons/axiom/axiom-api/1.2.17-SNAPSHOT/axiom-api-1.2.17-SNAPSHOT.jar
Downloaded: http://repository.apache.org/snapshots/org/apache/axis2/axis2-kernel/1.7.0-SNAPSHOT/axis2-kernel-1.7.0-20160116.200200-2415.jar
(1032 KB at 3061.3 KB/sec)
[INFO] ------------------------------------------------------------------------
[INFO] Reactor Summary:
[INFO] 
[INFO] Apache Rampart .................................... SUCCESS [6.996s]
[INFO] Rampart - Policy .................................. FAILURE [0.900s]
[INFO] Rampart - Trust ................................... SKIPPED
[INFO] Rampart - Core .................................... SKIPPED
[INFO] Javadoc ........................................... SKIPPED
[INFO] Rampart - Test Suite .............................. SKIPPED
[INFO] Rampart - Mar ..................................... SKIPPED
[INFO] Rampart - Trust-Mar ............................... SKIPPED
[INFO] Rampart - Integration ............................. SKIPPED
[INFO] Rampart - Samples ................................. SKIPPED
[INFO] Rampart - Distribution ............................ SKIPPED
[INFO] Code Coverage Report .............................. SKIPPED
[INFO] ------------------------------------------------------------------------
[INFO] BUILD FAILURE
[INFO] ------------------------------------------------------------------------
[INFO] Total time: 12.170s
[INFO] Finished at: Sat Jan 16 20:42:10 UTC 2016
[INFO] Final Memory: 33M/453M
[INFO] ------------------------------------------------------------------------
Waiting for Jenkins to finish collecting data
[ERROR] Failed to execute goal on project rampart-policy: Could not resolve dependencies for
project org.apache.rampart:rampart-policy:jar:1.7.0-SNAPSHOT: The following artifacts could
not be resolved: org.apache.ws.commons.axiom:axiom-impl:jar:1.2.17-SNAPSHOT, org.apache.ws.commons.axiom:axiom-api:jar:1.2.17-SNAPSHOT:
Could not find artifact org.apache.ws.commons.axiom:axiom-impl:jar:1.2.17-SNAPSHOT in Nexus
(http://repository.apache.org/snapshots) -> [Help 1]
[ERROR] 
[ERROR] To see the full stack trace of the errors, re-run Maven with the -e switch.
[ERROR] Re-run Maven using the -X switch to enable full debug logging.
[ERROR] 
[ERROR] For more information about the errors and possible solutions, please read the following
articles:
[ERROR] [Help 1] http://cwiki.apache.org/confluence/display/MAVEN/DependencyResolutionException
[ERROR] 
[ERROR] After correcting the problems, you can resume the build with the command
[ERROR]   mvn <goals> -rf :rampart-policy
[JENKINS] Archiving <https://builds.apache.org/job/Rampart/ws/trunk/modules/rampart-trust-mar/pom.xml>
to org.apache.rampart/rahas/1.7.0-SNAPSHOT/rahas-1.7.0-SNAPSHOT.pom
[JENKINS] Archiving <https://builds.apache.org/job/Rampart/ws/trunk/modules/rampart-core/pom.xml>
to org.apache.rampart/rampart-core/1.7.0-SNAPSHOT/rampart-core-1.7.0-SNAPSHOT.pom
[JENKINS] Archiving <https://builds.apache.org/job/Rampart/ws/trunk/modules/rampart-samples/pom.xml>
to org.apache.rampart/rampart-sample/1.7.0-SNAPSHOT/rampart-sample-1.7.0-SNAPSHOT.pom
[JENKINS] Archiving <https://builds.apache.org/job/Rampart/ws/trunk/modules/rampart-trust/pom.xml>
to org.apache.rampart/rampart-trust/1.7.0-SNAPSHOT/rampart-trust-1.7.0-SNAPSHOT.pom
[JENKINS] Archiving <https://builds.apache.org/job/Rampart/ws/trunk/modules/rampart-policy/pom.xml>
to org.apache.rampart/rampart-policy/1.7.0-SNAPSHOT/rampart-policy-1.7.0-SNAPSHOT.pom
[JENKINS] Archiving <https://builds.apache.org/job/Rampart/ws/trunk/modules/rampart-mar/pom.xml>
to org.apache.rampart/rampart/1.7.0-SNAPSHOT/rampart-1.7.0-SNAPSHOT.pom
[JENKINS] Archiving <https://builds.apache.org/job/Rampart/ws/trunk/apidocs/pom.xml>
to org.apache.rampart/apidocs/1.7.0-SNAPSHOT/apidocs-1.7.0-SNAPSHOT.pom
[JENKINS] Archiving <https://builds.apache.org/job/Rampart/ws/trunk/modules/rampart-integration/pom.xml>
to org.apache.rampart/rampart-integration/1.7.0-SNAPSHOT/rampart-integration-1.7.0-SNAPSHOT.pom
[JENKINS] Archiving <https://builds.apache.org/job/Rampart/ws/trunk/pom.xml> to org.apache.rampart/rampart-project/1.7.0-SNAPSHOT/rampart-project-1.7.0-SNAPSHOT.pom
[JENKINS] Archiving <https://builds.apache.org/job/Rampart/ws/trunk/target/rampart-project-1.7.0-SNAPSHOT-site.xml>
to org.apache.rampart/rampart-project/1.7.0-20160116.204207-1677/rampart-project-1.7.0-20160116.204207-1677-site.xml
[JENKINS] Archiving <https://builds.apache.org/job/Rampart/ws/trunk/modules/distribution/pom.xml>
to org.apache.rampart/rampart-dist/1.7.0-SNAPSHOT/rampart-dist-1.7.0-SNAPSHOT.pom
[JENKINS] Archiving <https://builds.apache.org/job/Rampart/ws/trunk/modules/rampart-tests/pom.xml>
to org.apache.rampart/rampart-tests/1.7.0-SNAPSHOT/rampart-tests-1.7.0-SNAPSHOT.pom
[JENKINS] Archiving <https://builds.apache.org/job/Rampart/ws/trunk/code-coverage/pom.xml>
to org.apache.rampart/code-coverage/1.7.0-SNAPSHOT/code-coverage-1.7.0-SNAPSHOT.pom
Sending e-mails to: java-dev@axis.apache.org
[locks-and-latches] Releasing all the locks
[locks-and-latches] All the locks released
channel stopped

---------------------------------------------------------------------
To unsubscribe, e-mail: java-dev-unsubscribe@axis.apache.org
For additional commands, e-mail: java-dev-help@axis.apache.org


Mime
View raw message