axis-java-dev mailing list archives

Site index · List index
Message view « Date » · « Thread »
Top « Date » · « Thread »
From Apache Jenkins Server <jenk...@builds.apache.org>
Subject Build failed in Jenkins: Rampart #2079
Date Tue, 22 Dec 2015 02:28:53 GMT
See <https://builds.apache.org/job/Rampart/2079/>

------------------------------------------
[...truncated 2072 lines...]
Downloading: http://repo1.maven.org/maven2/org/apache/maven/shared/file-management/1.1/file-management-1.1.pom
Downloaded: http://repo1.maven.org/maven2/org/apache/maven/shared/file-management/1.1/file-management-1.1.pom
(3 KB at 39.3 KB/sec)
Downloading: http://repo1.maven.org/maven2/org/apache/maven/shared/maven-shared-components/4/maven-shared-components-4.pom
Downloaded: http://repo1.maven.org/maven2/org/apache/maven/shared/maven-shared-components/4/maven-shared-components-4.pom
(3 KB at 33.2 KB/sec)
Downloading: http://repo1.maven.org/maven2/org/apache/maven/shared/maven-shared-io/1.0/maven-shared-io-1.0.pom
Downloaded: http://repo1.maven.org/maven2/org/apache/maven/shared/maven-shared-io/1.0/maven-shared-io-1.0.pom
(3 KB at 44.8 KB/sec)
Downloading: http://repo1.maven.org/maven2/org/codehaus/plexus/plexus-utils/1.2/plexus-utils-1.2.pom
Downloaded: http://repo1.maven.org/maven2/org/codehaus/plexus/plexus-utils/1.2/plexus-utils-1.2.pom
(767 B at 11.5 KB/sec)
Downloading: http://repo1.maven.org/maven2/org/codehaus/plexus/plexus/1.0.5/plexus-1.0.5.pom
Downloaded: http://repo1.maven.org/maven2/org/codehaus/plexus/plexus/1.0.5/plexus-1.0.5.pom
(6 KB at 86.6 KB/sec)
Downloading: http://repo1.maven.org/maven2/org/apache/maven/shared/maven-filtering/1.3/maven-filtering-1.3.pom
Downloaded: http://repo1.maven.org/maven2/org/apache/maven/shared/maven-filtering/1.3/maven-filtering-1.3.pom
(7 KB at 90.3 KB/sec)
Downloading: http://repo1.maven.org/maven2/org/apache/maven/shared/maven-shared-utils/0.6/maven-shared-utils-0.6.pom
Downloaded: http://repo1.maven.org/maven2/org/apache/maven/shared/maven-shared-utils/0.6/maven-shared-utils-0.6.pom
(5 KB at 70.1 KB/sec)
Downloading: http://repo1.maven.org/maven2/org/apache/maven/shared/maven-shared-components/19/maven-shared-components-19.pom
Downloaded: http://repo1.maven.org/maven2/org/apache/maven/shared/maven-shared-components/19/maven-shared-components-19.pom
(7 KB at 95.5 KB/sec)
Downloading: http://repo1.maven.org/maven2/org/codehaus/plexus/plexus-utils/3.0.18/plexus-utils-3.0.18.pom
Downloaded: http://repo1.maven.org/maven2/org/codehaus/plexus/plexus-utils/3.0.18/plexus-utils-3.0.18.pom
(4 KB at 51.0 KB/sec)
Downloading: http://repo1.maven.org/maven2/org/codehaus/plexus/plexus-interpolation/1.19/plexus-interpolation-1.19.pom
Downloaded: http://repo1.maven.org/maven2/org/codehaus/plexus/plexus-interpolation/1.19/plexus-interpolation-1.19.pom
(2 KB at 15.5 KB/sec)
Downloading: http://repo1.maven.org/maven2/org/codehaus/plexus/plexus-utils/3.0.21/plexus-utils-3.0.21.pom
Downloaded: http://repo1.maven.org/maven2/org/codehaus/plexus/plexus-utils/3.0.21/plexus-utils-3.0.21.pom
(4 KB at 57.2 KB/sec)
Downloading: http://repo1.maven.org/maven2/org/apache/maven/shared/maven-repository-builder/1.0/maven-repository-builder-1.0.pom
Downloaded: http://repo1.maven.org/maven2/org/apache/maven/shared/maven-repository-builder/1.0/maven-repository-builder-1.0.pom
(5 KB at 67.4 KB/sec)
Downloading: http://repo1.maven.org/maven2/org/apache/maven/shared/maven-shared-components/21/maven-shared-components-21.pom
Downloaded: http://repo1.maven.org/maven2/org/apache/maven/shared/maven-shared-components/21/maven-shared-components-21.pom
(5 KB at 75.6 KB/sec)
Downloading: http://repo1.maven.org/maven2/org/apache/maven/maven-parent/25/maven-parent-25.pom
Downloaded: http://repo1.maven.org/maven2/org/apache/maven/maven-parent/25/maven-parent-25.pom
(37 KB at 545.7 KB/sec)
Downloading: http://repo1.maven.org/maven2/org/apache/apache/15/apache-15.pom
Downloaded: http://repo1.maven.org/maven2/org/apache/apache/15/apache-15.pom (15 KB at 228.9
KB/sec)
Downloading: http://repo1.maven.org/maven2/org/apache/maven/maven-artifact/2.0.4/maven-artifact-2.0.4.pom
Downloaded: http://repo1.maven.org/maven2/org/apache/maven/maven-artifact/2.0.4/maven-artifact-2.0.4.pom
(765 B at 11.5 KB/sec)
Downloading: http://repo1.maven.org/maven2/org/apache/maven/maven/2.0.4/maven-2.0.4.pom
Downloaded: http://repo1.maven.org/maven2/org/apache/maven/maven/2.0.4/maven-2.0.4.pom (12
KB at 174.5 KB/sec)
Downloading: http://repo1.maven.org/maven2/org/apache/maven/maven-artifact-manager/2.0.4/maven-artifact-manager-2.0.4.pom
Downloaded: http://repo1.maven.org/maven2/org/apache/maven/maven-artifact-manager/2.0.4/maven-artifact-manager-2.0.4.pom
(2 KB at 20.1 KB/sec)
Downloading: http://repo1.maven.org/maven2/org/apache/maven/maven-repository-metadata/2.0.4/maven-repository-metadata-2.0.4.pom
Downloaded: http://repo1.maven.org/maven2/org/apache/maven/maven-repository-metadata/2.0.4/maven-repository-metadata-2.0.4.pom
(2 KB at 22.3 KB/sec)
Downloading: http://repo1.maven.org/maven2/org/apache/maven/maven-project/2.0.4/maven-project-2.0.4.pom
Downloaded: http://repo1.maven.org/maven2/org/apache/maven/maven-project/2.0.4/maven-project-2.0.4.pom
(2 KB at 27.7 KB/sec)
Downloading: http://repo1.maven.org/maven2/org/apache/maven/maven-settings/2.0.4/maven-settings-2.0.4.pom
Downloaded: http://repo1.maven.org/maven2/org/apache/maven/maven-settings/2.0.4/maven-settings-2.0.4.pom
(2 KB at 24.1 KB/sec)
Downloading: http://repo1.maven.org/maven2/org/apache/maven/maven-model/2.0.4/maven-model-2.0.4.pom
Downloaded: http://repo1.maven.org/maven2/org/apache/maven/maven-model/2.0.4/maven-model-2.0.4.pom
(3 KB at 40.7 KB/sec)
Downloading: http://repo1.maven.org/maven2/org/apache/maven/maven-profile/2.0.4/maven-profile-2.0.4.pom
Downloaded: http://repo1.maven.org/maven2/org/apache/maven/maven-profile/2.0.4/maven-profile-2.0.4.pom
(2 KB at 24.3 KB/sec)
Downloading: http://repo1.maven.org/maven2/commons-codec/commons-codec/1.6/commons-codec-1.6.pom
Downloaded: http://repo1.maven.org/maven2/commons-codec/commons-codec/1.6/commons-codec-1.6.pom
(11 KB at 165.1 KB/sec)
Downloading: http://repo1.maven.org/maven2/org/apache/commons/commons-parent/22/commons-parent-22.pom
Downloaded: http://repo1.maven.org/maven2/org/apache/commons/commons-parent/22/commons-parent-22.pom
(41 KB at 620.2 KB/sec)
Downloading: http://repo1.maven.org/maven2/org/apache/apache/resources/apache-source-release-assembly-descriptor/1.0.5/apache-source-release-assembly-descriptor-1.0.5.jar
Downloading: http://repo1.maven.org/maven2/org/codehaus/plexus/plexus-archiver/3.0.1/plexus-archiver-3.0.1.jar
Downloading: http://repo1.maven.org/maven2/org/iq80/snappy/snappy/0.3/snappy-0.3.jar
Downloading: http://repo1.maven.org/maven2/org/codehaus/plexus/plexus-interpolation/1.22/plexus-interpolation-1.22.jar
Downloading: http://repo1.maven.org/maven2/org/apache/maven/shared/file-management/1.1/file-management-1.1.jar
Downloaded: http://repo1.maven.org/maven2/org/apache/apache/resources/apache-source-release-assembly-descriptor/1.0.5/apache-source-release-assembly-descriptor-1.0.5.jar
(12 KB at 176.5 KB/sec)
Downloading: http://repo1.maven.org/maven2/commons-io/commons-io/2.2/commons-io-2.2.jar
Downloaded: http://repo1.maven.org/maven2/org/apache/maven/shared/file-management/1.1/file-management-1.1.jar
(31 KB at 454.3 KB/sec)
Downloading: http://repo1.maven.org/maven2/org/apache/maven/shared/maven-filtering/1.3/maven-filtering-1.3.jar
Downloaded: http://repo1.maven.org/maven2/org/iq80/snappy/snappy/0.3/snappy-0.3.jar (48 KB
at 700.3 KB/sec)
Downloading: http://repo1.maven.org/maven2/org/apache/maven/shared/maven-shared-utils/0.6/maven-shared-utils-0.6.jar
Downloaded: http://repo1.maven.org/maven2/org/codehaus/plexus/plexus-interpolation/1.22/plexus-interpolation-1.22.jar
(76 KB at 1057.2 KB/sec)
Downloading: http://repo1.maven.org/maven2/org/codehaus/plexus/plexus-io/2.6/plexus-io-2.6.jar
Downloaded: http://repo1.maven.org/maven2/org/codehaus/plexus/plexus-archiver/3.0.1/plexus-archiver-3.0.1.jar
(373 KB at 3720.0 KB/sec)
Downloading: http://repo1.maven.org/maven2/org/codehaus/plexus/plexus-utils/3.0.21/plexus-utils-3.0.21.jar
Downloaded: http://repo1.maven.org/maven2/org/apache/maven/shared/maven-filtering/1.3/maven-filtering-1.3.jar
(50 KB at 746.0 KB/sec)
Downloading: http://repo1.maven.org/maven2/org/apache/maven/shared/maven-repository-builder/1.0/maven-repository-builder-1.0.jar
Downloaded: http://repo1.maven.org/maven2/commons-io/commons-io/2.2/commons-io-2.2.jar (170
KB at 2421.7 KB/sec)
Downloading: http://repo1.maven.org/maven2/commons-codec/commons-codec/1.6/commons-codec-1.6.jar
Downloaded: http://repo1.maven.org/maven2/org/apache/maven/shared/maven-shared-utils/0.6/maven-shared-utils-0.6.jar
(161 KB at 2296.8 KB/sec)
Downloaded: http://repo1.maven.org/maven2/org/codehaus/plexus/plexus-io/2.6/plexus-io-2.6.jar
(83 KB at 1157.1 KB/sec)
Downloaded: http://repo1.maven.org/maven2/org/codehaus/plexus/plexus-utils/3.0.21/plexus-utils-3.0.21.jar
(240 KB at 3104.3 KB/sec)
Downloaded: http://repo1.maven.org/maven2/org/apache/maven/shared/maven-repository-builder/1.0/maven-repository-builder-1.0.jar
(22 KB at 327.0 KB/sec)
Downloaded: http://repo1.maven.org/maven2/commons-codec/commons-codec/1.6/commons-codec-1.6.jar
(228 KB at 3247.4 KB/sec)
[INFO] Assemblies have been skipped per configuration of the skipAssembly parameter.
[INFO] 
[INFO] --- maven-source-plugin:2.4:jar-no-fork (source-jars) @ rampart-project ---
Downloading: http://repo1.maven.org/maven2/org/codehaus/plexus/plexus-archiver/2.6.3/plexus-archiver-2.6.3.pom
Downloaded: http://repo1.maven.org/maven2/org/codehaus/plexus/plexus-archiver/2.6.3/plexus-archiver-2.6.3.pom
(4 KB at 53.5 KB/sec)
Downloading: http://repo1.maven.org/maven2/org/codehaus/plexus/plexus-io/2.1.3/plexus-io-2.1.3.pom
Downloaded: http://repo1.maven.org/maven2/org/codehaus/plexus/plexus-io/2.1.3/plexus-io-2.1.3.pom
(3 KB at 33.7 KB/sec)
Downloading: http://repo1.maven.org/maven2/org/apache/commons/commons-compress/1.8.1/commons-compress-1.8.1.pom
Downloaded: http://repo1.maven.org/maven2/org/apache/commons/commons-compress/1.8.1/commons-compress-1.8.1.pom
(12 KB at 169.2 KB/sec)
Downloading: http://repo1.maven.org/maven2/org/apache/commons/commons-parent/33/commons-parent-33.pom
Downloaded: http://repo1.maven.org/maven2/org/apache/commons/commons-parent/33/commons-parent-33.pom
(52 KB at 773.8 KB/sec)
Downloading: http://repo1.maven.org/maven2/org/codehaus/plexus/plexus-archiver/2.6.3/plexus-archiver-2.6.3.jar
Downloading: http://repo1.maven.org/maven2/org/codehaus/plexus/plexus-io/2.1.3/plexus-io-2.1.3.jar
Downloading: http://repo1.maven.org/maven2/org/apache/commons/commons-compress/1.8.1/commons-compress-1.8.1.jar
Downloading: http://repo1.maven.org/maven2/org/codehaus/plexus/plexus-utils/3.0.18/plexus-utils-3.0.18.jar
Downloaded: http://repo1.maven.org/maven2/org/codehaus/plexus/plexus-archiver/2.6.3/plexus-archiver-2.6.3.jar
(129 KB at 1886.3 KB/sec)
Downloaded: http://repo1.maven.org/maven2/org/codehaus/plexus/plexus-io/2.1.3/plexus-io-2.1.3.jar
(65 KB at 927.0 KB/sec)
Downloaded: http://repo1.maven.org/maven2/org/apache/commons/commons-compress/1.8.1/commons-compress-1.8.1.jar
(357 KB at 3534.5 KB/sec)
Downloaded: http://repo1.maven.org/maven2/org/codehaus/plexus/plexus-utils/3.0.18/plexus-utils-3.0.18.jar
(238 KB at 2349.6 KB/sec)
[INFO] 
[INFO] --- maven-javadoc-plugin:2.10.3:jar (attach-javadocs) @ rampart-project ---
Downloading: http://repo1.maven.org/maven2/org/apache/maven/maven-toolchain/2.2.1/maven-toolchain-2.2.1.pom
Downloaded: http://repo1.maven.org/maven2/org/apache/maven/maven-toolchain/2.2.1/maven-toolchain-2.2.1.pom
(4 KB at 49.5 KB/sec)
Downloading: http://repo1.maven.org/maven2/org/apache/maven/shared/maven-invoker/2.0.9/maven-invoker-2.0.9.pom
Downloaded: http://repo1.maven.org/maven2/org/apache/maven/shared/maven-invoker/2.0.9/maven-invoker-2.0.9.pom
(6 KB at 85.5 KB/sec)
Downloading: http://repo1.maven.org/maven2/org/apache/maven/shared/maven-common-artifact-filters/1.3/maven-common-artifact-filters-1.3.pom
Downloaded: http://repo1.maven.org/maven2/org/apache/maven/shared/maven-common-artifact-filters/1.3/maven-common-artifact-filters-1.3.pom
(4 KB at 55.6 KB/sec)
Downloading: http://repo1.maven.org/maven2/org/apache/maven/doxia/doxia-sink-api/1.4/doxia-sink-api-1.4.pom
Downloaded: http://repo1.maven.org/maven2/org/apache/maven/doxia/doxia-sink-api/1.4/doxia-sink-api-1.4.pom
(2 KB at 22.3 KB/sec)
Downloading: http://repo1.maven.org/maven2/org/apache/maven/doxia/doxia/1.4/doxia-1.4.pom
Downloaded: http://repo1.maven.org/maven2/org/apache/maven/doxia/doxia/1.4/doxia-1.4.pom (18
KB at 265.7 KB/sec)
Downloading: http://repo1.maven.org/maven2/org/apache/maven/doxia/doxia-logging-api/1.4/doxia-logging-api-1.4.pom
Downloaded: http://repo1.maven.org/maven2/org/apache/maven/doxia/doxia-logging-api/1.4/doxia-logging-api-1.4.pom
(2 KB at 22.7 KB/sec)
Downloading: http://repo1.maven.org/maven2/org/apache/maven/doxia/doxia-site-renderer/1.4/doxia-site-renderer-1.4.pom
Downloaded: http://repo1.maven.org/maven2/org/apache/maven/doxia/doxia-site-renderer/1.4/doxia-site-renderer-1.4.pom
(6 KB at 89.1 KB/sec)
Downloading: http://repo1.maven.org/maven2/org/apache/maven/doxia/doxia-sitetools/1.4/doxia-sitetools-1.4.pom
Downloaded: http://repo1.maven.org/maven2/org/apache/maven/doxia/doxia-sitetools/1.4/doxia-sitetools-1.4.pom
(17 KB at 254.0 KB/sec)
Downloading: http://repo1.maven.org/maven2/org/apache/maven/doxia/doxia-core/1.4/doxia-core-1.4.pom
Downloaded: http://repo1.maven.org/maven2/org/apache/maven/doxia/doxia-core/1.4/doxia-core-1.4.pom
(4 KB at 59.3 KB/sec)
Downloading: http://repo1.maven.org/maven2/org/codehaus/plexus/plexus-utils/3.0.10/plexus-utils-3.0.10.pom
Downloaded: http://repo1.maven.org/maven2/org/codehaus/plexus/plexus-utils/3.0.10/plexus-utils-3.0.10.pom
(4 KB at 39.4 KB/sec)
Downloading: http://repo1.maven.org/maven2/org/apache/maven/doxia/doxia-decoration-model/1.4/doxia-decoration-model-1.4.pom
Downloaded: http://repo1.maven.org/maven2/org/apache/maven/doxia/doxia-decoration-model/1.4/doxia-decoration-model-1.4.pom
(3 KB at 39.0 KB/sec)
Downloading: http://repo1.maven.org/maven2/org/apache/maven/doxia/doxia-module-xhtml/1.4/doxia-module-xhtml-1.4.pom
Downloaded: http://repo1.maven.org/maven2/org/apache/maven/doxia/doxia-module-xhtml/1.4/doxia-module-xhtml-1.4.pom
(2 KB at 24.1 KB/sec)
Downloading: http://repo1.maven.org/maven2/org/apache/maven/doxia/doxia-modules/1.4/doxia-modules-1.4.pom
Downloaded: http://repo1.maven.org/maven2/org/apache/maven/doxia/doxia-modules/1.4/doxia-modules-1.4.pom
(3 KB at 38.8 KB/sec)
Downloading: http://repo1.maven.org/maven2/org/apache/maven/doxia/doxia-module-fml/1.4/doxia-module-fml-1.4.pom
Downloaded: http://repo1.maven.org/maven2/org/apache/maven/doxia/doxia-module-fml/1.4/doxia-module-fml-1.4.pom
(5 KB at 71.1 KB/sec)
Downloading: http://repo1.maven.org/maven2/org/apache/maven/wagon/wagon-provider-api/1.0-beta-6/wagon-provider-api-1.0-beta-6.pom
Downloaded: http://repo1.maven.org/maven2/org/apache/maven/wagon/wagon-provider-api/1.0-beta-6/wagon-provider-api-1.0-beta-6.pom
(2 KB at 26.0 KB/sec)
Downloading: http://repo1.maven.org/maven2/org/apache/maven/wagon/wagon/1.0-beta-6/wagon-1.0-beta-6.pom
Downloaded: http://repo1.maven.org/maven2/org/apache/maven/wagon/wagon/1.0-beta-6/wagon-1.0-beta-6.pom
(13 KB at 183.3 KB/sec)
Downloading: http://repo1.maven.org/maven2/org/apache/httpcomponents/httpclient/4.2.3/httpclient-4.2.3.pom
Downloaded: http://repo1.maven.org/maven2/org/apache/httpcomponents/httpclient/4.2.3/httpclient-4.2.3.pom
(6 KB at 88.8 KB/sec)
Downloading: http://repo1.maven.org/maven2/org/apache/httpcomponents/httpcomponents-client/4.2.3/httpcomponents-client-4.2.3.pom
Downloaded: http://repo1.maven.org/maven2/org/apache/httpcomponents/httpcomponents-client/4.2.3/httpcomponents-client-4.2.3.pom
(15 KB at 219.4 KB/sec)
Downloading: http://repo1.maven.org/maven2/org/apache/httpcomponents/project/6/project-6.pom
Downloaded: http://repo1.maven.org/maven2/org/apache/httpcomponents/project/6/project-6.pom
(24 KB at 354.9 KB/sec)
Downloading: http://repo1.maven.org/maven2/org/apache/httpcomponents/httpcore/4.2.2/httpcore-4.2.2.pom
Downloaded: http://repo1.maven.org/maven2/org/apache/httpcomponents/httpcore/4.2.2/httpcore-4.2.2.pom
(6 KB at 84.1 KB/sec)
Downloading: http://repo1.maven.org/maven2/org/apache/httpcomponents/httpcomponents-core/4.2.2/httpcomponents-core-4.2.2.pom
Downloaded: http://repo1.maven.org/maven2/org/apache/httpcomponents/httpcomponents-core/4.2.2/httpcomponents-core-4.2.2.pom
(12 KB at 169.8 KB/sec)
Downloading: http://repo1.maven.org/maven2/log4j/log4j/1.2.14/log4j-1.2.14.pom
Downloaded: http://repo1.maven.org/maven2/log4j/log4j/1.2.14/log4j-1.2.14.pom (3 KB at 34.6
KB/sec)
Downloading: http://repo1.maven.org/maven2/com/thoughtworks/qdox/qdox/1.12.1/qdox-1.12.1.pom
Downloaded: http://repo1.maven.org/maven2/com/thoughtworks/qdox/qdox/1.12.1/qdox-1.12.1.pom
(18 KB at 260.4 KB/sec)
Downloading: http://repo1.maven.org/maven2/org/codehaus/plexus/plexus-archiver/2.9/plexus-archiver-2.9.pom
Downloaded: http://repo1.maven.org/maven2/org/codehaus/plexus/plexus-archiver/2.9/plexus-archiver-2.9.pom
(5 KB at 64.6 KB/sec)
Downloading: http://repo1.maven.org/maven2/org/codehaus/plexus/plexus-io/2.4/plexus-io-2.4.pom
Downloaded: http://repo1.maven.org/maven2/org/codehaus/plexus/plexus-io/2.4/plexus-io-2.4.pom
(4 KB at 55.2 KB/sec)
Downloading: http://repo1.maven.org/maven2/org/apache/commons/commons-compress/1.9/commons-compress-1.9.pom
Downloaded: http://repo1.maven.org/maven2/org/apache/commons/commons-compress/1.9/commons-compress-1.9.pom
(12 KB at 169.2 KB/sec)
Downloading: http://repo1.maven.org/maven2/org/apache/commons/commons-parent/34/commons-parent-34.pom
Downloaded: http://repo1.maven.org/maven2/org/apache/commons/commons-parent/34/commons-parent-34.pom
(55 KB at 815.4 KB/sec)
Downloading: http://repo1.maven.org/maven2/org/apache/maven/shared/maven-invoker/2.0.9/maven-invoker-2.0.9.jar
Downloading: http://repo1.maven.org/maven2/org/apache/maven/shared/maven-common-artifact-filters/1.3/maven-common-artifact-filters-1.3.jar
Downloading: http://repo1.maven.org/maven2/org/apache/maven/doxia/doxia-sink-api/1.4/doxia-sink-api-1.4.jar
Downloading: http://repo1.maven.org/maven2/org/apache/maven/doxia/doxia-logging-api/1.4/doxia-logging-api-1.4.jar
Downloading: http://repo1.maven.org/maven2/org/apache/maven/doxia/doxia-site-renderer/1.4/doxia-site-renderer-1.4.jar
Downloaded: http://repo1.maven.org/maven2/org/apache/maven/shared/maven-common-artifact-filters/1.3/maven-common-artifact-filters-1.3.jar
(31 KB at 466.6 KB/sec)
Downloading: http://repo1.maven.org/maven2/org/apache/maven/doxia/doxia-core/1.4/doxia-core-1.4.jar
Downloaded: http://repo1.maven.org/maven2/org/apache/maven/doxia/doxia-sink-api/1.4/doxia-sink-api-1.4.jar
(11 KB at 165.8 KB/sec)
Downloading: http://repo1.maven.org/maven2/xerces/xercesImpl/2.9.1/xercesImpl-2.9.1.jar
Downloaded: http://repo1.maven.org/maven2/org/apache/maven/doxia/doxia-logging-api/1.4/doxia-logging-api-1.4.jar
(12 KB at 167.4 KB/sec)
Downloading: http://repo1.maven.org/maven2/xml-apis/xml-apis/1.3.04/xml-apis-1.3.04.jar
Downloaded: http://repo1.maven.org/maven2/org/apache/maven/shared/maven-invoker/2.0.9/maven-invoker-2.0.9.jar
(28 KB at 406.2 KB/sec)
Downloading: http://repo1.maven.org/maven2/org/apache/maven/doxia/doxia-decoration-model/1.4/doxia-decoration-model-1.4.jar
Downloaded: http://repo1.maven.org/maven2/org/apache/maven/doxia/doxia-site-renderer/1.4/doxia-site-renderer-1.4.jar
(52 KB at 773.7 KB/sec)
Downloading: http://repo1.maven.org/maven2/org/apache/maven/doxia/doxia-module-xhtml/1.4/doxia-module-xhtml-1.4.jar
Downloaded: http://repo1.maven.org/maven2/org/apache/maven/doxia/doxia-core/1.4/doxia-core-1.4.jar
(162 KB at 2236.5 KB/sec)
Downloaded: http://repo1.maven.org/maven2/xml-apis/xml-apis/1.3.04/xml-apis-1.3.04.jar (190
KB at 2673.2 KB/sec)
Downloading: http://repo1.maven.org/maven2/org/apache/maven/doxia/doxia-module-fml/1.4/doxia-module-fml-1.4.jar
Downloaded: http://repo1.maven.org/maven2/org/apache/maven/doxia/doxia-decoration-model/1.4/doxia-decoration-model-1.4.jar
(60 KB at 842.6 KB/sec)
Downloaded: http://repo1.maven.org/maven2/org/apache/maven/doxia/doxia-module-xhtml/1.4/doxia-module-xhtml-1.4.jar
(16 KB at 211.6 KB/sec)
Downloading: http://repo1.maven.org/maven2/org/apache/httpcomponents/httpclient/4.2.3/httpclient-4.2.3.jar
Downloading: http://repo1.maven.org/maven2/log4j/log4j/1.2.14/log4j-1.2.14.jar
Downloading: http://repo1.maven.org/maven2/org/apache/httpcomponents/httpcore/4.2.2/httpcore-4.2.2.jar
Downloaded: http://repo1.maven.org/maven2/xerces/xercesImpl/2.9.1/xercesImpl-2.9.1.jar (1201
KB at 9233.2 KB/sec)
Downloading: http://repo1.maven.org/maven2/com/thoughtworks/qdox/qdox/1.12.1/qdox-1.12.1.jar
Downloaded: http://repo1.maven.org/maven2/org/apache/maven/doxia/doxia-module-fml/1.4/doxia-module-fml-1.4.jar
(37 KB at 535.3 KB/sec)
Downloading: http://repo1.maven.org/maven2/org/codehaus/plexus/plexus-archiver/2.9/plexus-archiver-2.9.jar
Downloaded: http://repo1.maven.org/maven2/org/apache/httpcomponents/httpcore/4.2.2/httpcore-4.2.2.jar
(219 KB at 2481.0 KB/sec)
Downloading: http://repo1.maven.org/maven2/org/codehaus/plexus/plexus-io/2.4/plexus-io-2.4.jar
Downloaded: http://repo1.maven.org/maven2/org/apache/httpcomponents/httpclient/4.2.3/httpclient-4.2.3.jar
(423 KB at 3810.1 KB/sec)
Downloading: http://repo1.maven.org/maven2/org/apache/commons/commons-compress/1.9/commons-compress-1.9.jar
Downloaded: http://repo1.maven.org/maven2/log4j/log4j/1.2.14/log4j-1.2.14.jar (359 KB at 3175.5
KB/sec)
Downloading: http://repo1.maven.org/maven2/org/codehaus/plexus/plexus-utils/3.0.20/plexus-utils-3.0.20.jar
Downloaded: http://repo1.maven.org/maven2/com/thoughtworks/qdox/qdox/1.12.1/qdox-1.12.1.jar
(176 KB at 2545.0 KB/sec)
Downloaded: http://repo1.maven.org/maven2/org/codehaus/plexus/plexus-archiver/2.9/plexus-archiver-2.9.jar
(142 KB at 2028.1 KB/sec)
Downloaded: http://repo1.maven.org/maven2/org/codehaus/plexus/plexus-io/2.4/plexus-io-2.4.jar
(80 KB at 1179.4 KB/sec)
Downloaded: http://repo1.maven.org/maven2/org/apache/commons/commons-compress/1.9/commons-compress-1.9.jar
(370 KB at 5059.6 KB/sec)
Downloaded: http://repo1.maven.org/maven2/org/codehaus/plexus/plexus-utils/3.0.20/plexus-utils-3.0.20.jar
(238 KB at 3297.6 KB/sec)
[INFO] Not executing Javadoc as the project is not a Java classpath-capable package
[INFO] 
[INFO] --- maven-gpg-plugin:1.5:sign (default) @ rampart-project ---
[INFO] 
[INFO] --- maven-install-plugin:2.5.2:install (default-install) @ rampart-project ---
Downloading: http://repo1.maven.org/maven2/org/apache/maven/shared/maven-shared-utils/0.4/maven-shared-utils-0.4.pom
Downloaded: http://repo1.maven.org/maven2/org/apache/maven/shared/maven-shared-utils/0.4/maven-shared-utils-0.4.pom
(4 KB at 54.1 KB/sec)
Downloading: http://repo1.maven.org/maven2/org/apache/maven/shared/maven-shared-utils/0.4/maven-shared-utils-0.4.jar
Downloaded: http://repo1.maven.org/maven2/org/apache/maven/shared/maven-shared-utils/0.4/maven-shared-utils-0.4.jar
(152 KB at 2200.1 KB/sec)
[INFO] Installing <https://builds.apache.org/job/Rampart/ws/trunk/pom.xml> to <https://builds.apache.org/job/Rampart/ws/.repository/org/apache/rampart/rampart-project/1.7.0-SNAPSHOT/rampart-project-1.7.0-SNAPSHOT.pom>
[INFO] Installing <https://builds.apache.org/job/Rampart/ws/trunk/target/rampart-project-1.7.0-SNAPSHOT-site.xml>
to <https://builds.apache.org/job/Rampart/ws/.repository/org/apache/rampart/rampart-project/1.7.0-SNAPSHOT/rampart-project-1.7.0-SNAPSHOT-site.xml>
[INFO] 
[INFO] --- maven-deploy-plugin:2.8.2:deploy (default-deploy) @ rampart-project ---
Downloading: https://repository.apache.org/content/repositories/snapshots/org/apache/rampart/rampart-project/1.7.0-SNAPSHOT/maven-metadata.xml
[WARNING] Could not transfer metadata org.apache.rampart:rampart-project:1.7.0-SNAPSHOT/maven-metadata.xml
from/to apache.snapshots.https (https://repository.apache.org/content/repositories/snapshots):
Error transferring file: java.lang.RuntimeException: Could not generate DH keypair
[INFO] ------------------------------------------------------------------------
[INFO] Reactor Summary:
[INFO] 
[INFO] Apache Rampart .................................... FAILURE [45.912s]
[INFO] Rampart - Policy .................................. SKIPPED
[INFO] Rampart - Trust ................................... SKIPPED
[INFO] Rampart - Core .................................... SKIPPED
[INFO] Javadoc ........................................... SKIPPED
[INFO] Rampart - Test Suite .............................. SKIPPED
[INFO] Rampart - Mar ..................................... SKIPPED
[INFO] Rampart - Trust-Mar ............................... SKIPPED
[INFO] Rampart - Integration ............................. SKIPPED
[INFO] Rampart - Samples ................................. SKIPPED
[INFO] Rampart - Distribution ............................ SKIPPED
[INFO] Code Coverage Report .............................. SKIPPED
[INFO] ------------------------------------------------------------------------
[INFO] BUILD FAILURE
[INFO] ------------------------------------------------------------------------
[INFO] Total time: 50.619s
[INFO] Finished at: Tue Dec 22 02:28:51 UTC 2015
[INFO] Final Memory: 22M/240M
[INFO] ------------------------------------------------------------------------
Waiting for Jenkins to finish collecting data[ERROR] Failed to execute goal org.apache.maven.plugins:maven-deploy-plugin:2.8.2:deploy
(default-deploy) on project rampart-project: Failed to retrieve remote metadata org.apache.rampart:rampart-project:1.7.0-SNAPSHOT/maven-metadata.xml:
Could not transfer metadata org.apache.rampart:rampart-project:1.7.0-SNAPSHOT/maven-metadata.xml
from/to apache.snapshots.https (https://repository.apache.org/content/repositories/snapshots):
Error transferring file: java.lang.RuntimeException: Could not generate DH keypair: Prime
size must be multiple of 64, and can only range from 512 to 1024 (inclusive) -> [Help 1]
[ERROR] 
[ERROR] To see the full stack trace of the errors, re-run Maven with the -e switch.
[ERROR] Re-run Maven using the -X switch to enable full debug logging.
[ERROR] 
[ERROR] For more information about the errors and possible solutions, please read the following
articles:
[ERROR] [Help 1] http://cwiki.apache.org/confluence/display/MAVEN/MojoExecutionException

[JENKINS] Archiving <https://builds.apache.org/job/Rampart/ws/trunk/modules/rampart-trust-mar/pom.xml>
to org.apache.rampart/rahas/1.7.0-SNAPSHOT/rahas-1.7.0-SNAPSHOT.pom
[JENKINS] Archiving <https://builds.apache.org/job/Rampart/ws/trunk/modules/rampart-core/pom.xml>
to org.apache.rampart/rampart-core/1.7.0-SNAPSHOT/rampart-core-1.7.0-SNAPSHOT.pom
[JENKINS] Archiving <https://builds.apache.org/job/Rampart/ws/trunk/modules/rampart-samples/pom.xml>
to org.apache.rampart/rampart-sample/1.7.0-SNAPSHOT/rampart-sample-1.7.0-SNAPSHOT.pom
[JENKINS] Archiving <https://builds.apache.org/job/Rampart/ws/trunk/modules/rampart-trust/pom.xml>
to org.apache.rampart/rampart-trust/1.7.0-SNAPSHOT/rampart-trust-1.7.0-SNAPSHOT.pom
[JENKINS] Archiving <https://builds.apache.org/job/Rampart/ws/trunk/modules/rampart-policy/pom.xml>
to org.apache.rampart/rampart-policy/1.7.0-SNAPSHOT/rampart-policy-1.7.0-SNAPSHOT.pom
[JENKINS] Archiving <https://builds.apache.org/job/Rampart/ws/trunk/modules/rampart-mar/pom.xml>
to org.apache.rampart/rampart/1.7.0-SNAPSHOT/rampart-1.7.0-SNAPSHOT.pom
[JENKINS] Archiving <https://builds.apache.org/job/Rampart/ws/trunk/apidocs/pom.xml>
to org.apache.rampart/apidocs/1.7.0-SNAPSHOT/apidocs-1.7.0-SNAPSHOT.pom
[JENKINS] Archiving <https://builds.apache.org/job/Rampart/ws/trunk/modules/rampart-integration/pom.xml>
to org.apache.rampart/rampart-integration/1.7.0-SNAPSHOT/rampart-integration-1.7.0-SNAPSHOT.pom
[JENKINS] Archiving <https://builds.apache.org/job/Rampart/ws/trunk/pom.xml> to org.apache.rampart/rampart-project/1.7.0-SNAPSHOT/rampart-project-1.7.0-SNAPSHOT.pom
[JENKINS] Archiving <https://builds.apache.org/job/Rampart/ws/trunk/target/rampart-project-1.7.0-SNAPSHOT-site.xml>
to org.apache.rampart/rampart-project/1.7.0-SNAPSHOT/rampart-project-1.7.0-SNAPSHOT-site.xml
[JENKINS] Archiving <https://builds.apache.org/job/Rampart/ws/trunk/modules/distribution/pom.xml>
to org.apache.rampart/rampart-dist/1.7.0-SNAPSHOT/rampart-dist-1.7.0-SNAPSHOT.pom
[JENKINS] Archiving <https://builds.apache.org/job/Rampart/ws/trunk/modules/rampart-tests/pom.xml>
to org.apache.rampart/rampart-tests/1.7.0-SNAPSHOT/rampart-tests-1.7.0-SNAPSHOT.pom
[JENKINS] Archiving <https://builds.apache.org/job/Rampart/ws/trunk/code-coverage/pom.xml>
to org.apache.rampart/code-coverage/1.7.0-SNAPSHOT/code-coverage-1.7.0-SNAPSHOT.pom
Sending e-mails to: java-dev@axis.apache.org
channel stopped
[locks-and-latches] Releasing all the locks
[locks-and-latches] All the locks released

---------------------------------------------------------------------
To unsubscribe, e-mail: java-dev-unsubscribe@axis.apache.org
For additional commands, e-mail: java-dev-help@axis.apache.org


Mime
View raw message