axis-java-dev mailing list archives

Site index · List index
Message view « Date » · « Thread »
Top « Date » · « Thread »
From Apache Jenkins Server <jenk...@builds.apache.org>
Subject Build failed in Jenkins: rampart-1.6 #281
Date Sun, 06 Dec 2015 12:09:07 GMT
See <https://builds.apache.org/job/rampart-1.6/281/changes>

Changes:

[veithen] Merge r1470135 to the 1.6 branch.

[veithen] Merge r1455319 to the 1.6 branch.

[veithen] Merge r1718154 and r1718156 to the 1.6 branch.

------------------------------------------
[...truncated 1137 lines...]
Downloading: http://repo1.maven.org/maven2/org/mortbay/jetty/jetty/6.1.25/jetty-6.1.25.pom
Downloaded: http://repo1.maven.org/maven2/org/mortbay/jetty/jetty/6.1.25/jetty-6.1.25.pom
(7 KB at 124.7 KB/sec)
Downloading: http://repo1.maven.org/maven2/org/mortbay/jetty/project/6.1.25/project-6.1.25.pom
Downloaded: http://repo1.maven.org/maven2/org/mortbay/jetty/project/6.1.25/project-6.1.25.pom
(9 KB at 183.5 KB/sec)
Downloading: http://repo1.maven.org/maven2/org/mortbay/jetty/jetty-parent/10/jetty-parent-10.pom
Downloaded: http://repo1.maven.org/maven2/org/mortbay/jetty/jetty-parent/10/jetty-parent-10.pom
(4 KB at 66.9 KB/sec)
Downloading: http://repo1.maven.org/maven2/org/eclipse/jetty/jetty-parent/14/jetty-parent-14.pom
Downloaded: http://repo1.maven.org/maven2/org/eclipse/jetty/jetty-parent/14/jetty-parent-14.pom
(17 KB at 328.5 KB/sec)
Downloading: http://repo1.maven.org/maven2/org/mortbay/jetty/jetty-util/6.1.25/jetty-util-6.1.25.pom
Downloaded: http://repo1.maven.org/maven2/org/mortbay/jetty/jetty-util/6.1.25/jetty-util-6.1.25.pom
(4 KB at 78.9 KB/sec)
Downloading: http://repo1.maven.org/maven2/org/mortbay/jetty/servlet-api/2.5-20081211/servlet-api-2.5-20081211.pom
Downloaded: http://repo1.maven.org/maven2/org/mortbay/jetty/servlet-api/2.5-20081211/servlet-api-2.5-20081211.pom
(3 KB at 53.4 KB/sec)
Downloading: http://repo1.maven.org/maven2/org/mortbay/jetty/jetty-parent/7/jetty-parent-7.pom
Downloaded: http://repo1.maven.org/maven2/org/mortbay/jetty/jetty-parent/7/jetty-parent-7.pom
(13 KB at 270.8 KB/sec)
Downloading: http://repo1.maven.org/maven2/commons-lang/commons-lang/2.5/commons-lang-2.5.pom
Downloaded: http://repo1.maven.org/maven2/commons-lang/commons-lang/2.5/commons-lang-2.5.pom
(17 KB at 334.5 KB/sec)
Downloading: http://repo1.maven.org/maven2/org/apache/commons/commons-parent/12/commons-parent-12.pom
Downloaded: http://repo1.maven.org/maven2/org/apache/commons/commons-parent/12/commons-parent-12.pom
(27 KB at 536.5 KB/sec)
Downloading: http://repo1.maven.org/maven2/org/apache/maven/reporting/maven-reporting-exec/1.0.2/maven-reporting-exec-1.0.2.jar
Downloading: http://repo1.maven.org/maven2/org/apache/maven/reporting/maven-reporting-api/3.0/maven-reporting-api-3.0.jar
Downloading: http://repo1.maven.org/maven2/velocity/velocity/1.5/velocity-1.5.jar
Downloading: http://repo1.maven.org/maven2/org/sonatype/aether/aether-util/1.7/aether-util-1.7.jar
Downloading: http://repo1.maven.org/maven2/org/sonatype/sisu/sisu-inject-bean/1.4.2/sisu-inject-bean-1.4.2.jar
Downloaded: http://repo1.maven.org/maven2/org/apache/maven/reporting/maven-reporting-exec/1.0.2/maven-reporting-exec-1.0.2.jar
(22 KB at 420.5 KB/sec)
Downloading: http://repo1.maven.org/maven2/org/sonatype/sisu/sisu-guice/2.1.7/sisu-guice-2.1.7-noaop.jar
Downloaded: http://repo1.maven.org/maven2/org/apache/maven/reporting/maven-reporting-api/3.0/maven-reporting-api-3.0.jar
(11 KB at 103.7 KB/sec)
Downloading: http://repo1.maven.org/maven2/org/codehaus/plexus/plexus-interpolation/1.14/plexus-interpolation-1.14.jar
Downloaded: http://repo1.maven.org/maven2/org/sonatype/sisu/sisu-guice/2.1.7/sisu-guice-2.1.7-noaop.jar
(461 KB at 6061.6 KB/sec)
Downloading: http://repo1.maven.org/maven2/org/codehaus/plexus/plexus-component-annotations/1.5.5/plexus-component-annotations-1.5.5.jar
Downloaded: http://repo1.maven.org/maven2/org/sonatype/sisu/sisu-inject-bean/1.4.2/sisu-inject-bean-1.4.2.jar
(150 KB at 878.8 KB/sec)
Downloading: http://repo1.maven.org/maven2/org/sonatype/plexus/plexus-sec-dispatcher/1.3/plexus-sec-dispatcher-1.3.jar
Downloaded: http://repo1.maven.org/maven2/org/codehaus/plexus/plexus-component-annotations/1.5.5/plexus-component-annotations-1.5.5.jar
(5 KB at 83.9 KB/sec)
Downloading: http://repo1.maven.org/maven2/org/sonatype/plexus/plexus-cipher/1.4/plexus-cipher-1.4.jar
Downloaded: http://repo1.maven.org/maven2/org/sonatype/aether/aether-util/1.7/aether-util-1.7.jar
(106 KB at 602.4 KB/sec)
Downloading: http://repo1.maven.org/maven2/org/apache/maven/maven-archiver/2.4.2/maven-archiver-2.4.2.jar
Downloaded: http://repo1.maven.org/maven2/org/codehaus/plexus/plexus-interpolation/1.14/plexus-interpolation-1.14.jar
(60 KB at 655.4 KB/sec)
Downloading: http://repo1.maven.org/maven2/org/apache/maven/doxia/doxia-sink-api/1.3/doxia-sink-api-1.3.jar
Downloaded: http://repo1.maven.org/maven2/velocity/velocity/1.5/velocity-1.5.jar (383 KB at
1764.7 KB/sec)
Downloading: http://repo1.maven.org/maven2/org/apache/maven/doxia/doxia-logging-api/1.3/doxia-logging-api-1.3.jar
Downloaded: http://repo1.maven.org/maven2/org/sonatype/plexus/plexus-sec-dispatcher/1.3/plexus-sec-dispatcher-1.3.jar
(28 KB at 581.0 KB/sec)
Downloading: http://repo1.maven.org/maven2/org/apache/maven/doxia/doxia-core/1.3/doxia-core-1.3.jar
Downloaded: http://repo1.maven.org/maven2/org/sonatype/plexus/plexus-cipher/1.4/plexus-cipher-1.4.jar
(14 KB at 268.9 KB/sec)
Downloading: http://repo1.maven.org/maven2/xerces/xercesImpl/2.9.1/xercesImpl-2.9.1.jar
Downloaded: http://repo1.maven.org/maven2/org/apache/maven/maven-archiver/2.4.2/maven-archiver-2.4.2.jar
(20 KB at 403.0 KB/sec)
Downloading: http://repo1.maven.org/maven2/xml-apis/xml-apis/1.3.04/xml-apis-1.3.04.jar
Downloaded: http://repo1.maven.org/maven2/org/apache/maven/doxia/doxia-sink-api/1.3/doxia-sink-api-1.3.jar
(11 KB at 233.5 KB/sec)
Downloading: http://repo1.maven.org/maven2/org/apache/httpcomponents/httpclient/4.0.2/httpclient-4.0.2.jar
Downloaded: http://repo1.maven.org/maven2/org/apache/maven/doxia/doxia-logging-api/1.3/doxia-logging-api-1.3.jar
(12 KB at 230.9 KB/sec)
Downloading: http://repo1.maven.org/maven2/commons-logging/commons-logging/1.1.1/commons-logging-1.1.1.jar
Downloaded: http://repo1.maven.org/maven2/xml-apis/xml-apis/1.3.04/xml-apis-1.3.04.jar (190
KB at 2433.3 KB/sec)
Downloading: http://repo1.maven.org/maven2/commons-codec/commons-codec/1.3/commons-codec-1.3.jar
Downloaded: http://repo1.maven.org/maven2/xerces/xercesImpl/2.9.1/xercesImpl-2.9.1.jar (1201
KB at 13486.7 KB/sec)
Downloading: http://repo1.maven.org/maven2/org/apache/httpcomponents/httpcore/4.0.1/httpcore-4.0.1.jar
Downloaded: http://repo1.maven.org/maven2/commons-logging/commons-logging/1.1.1/commons-logging-1.1.1.jar
(60 KB at 1234.7 KB/sec)
Downloading: http://repo1.maven.org/maven2/org/apache/maven/doxia/doxia-module-xhtml/1.3/doxia-module-xhtml-1.3.jar
Downloaded: http://repo1.maven.org/maven2/org/apache/maven/doxia/doxia-core/1.3/doxia-core-1.3.jar
(156 KB at 1648.9 KB/sec)
Downloading: http://repo1.maven.org/maven2/org/apache/maven/doxia/doxia-module-apt/1.3/doxia-module-apt-1.3.jar
Downloaded: http://repo1.maven.org/maven2/org/apache/httpcomponents/httpclient/4.0.2/httpclient-4.0.2.jar
(287 KB at 3178.1 KB/sec)
Downloading: http://repo1.maven.org/maven2/org/apache/maven/doxia/doxia-module-xdoc/1.3/doxia-module-xdoc-1.3.jar
Downloaded: http://repo1.maven.org/maven2/commons-codec/commons-codec/1.3/commons-codec-1.3.jar
(46 KB at 931.2 KB/sec)
Downloading: http://repo1.maven.org/maven2/org/apache/maven/doxia/doxia-module-fml/1.3/doxia-module-fml-1.3.jar
Downloaded: http://repo1.maven.org/maven2/org/apache/maven/doxia/doxia-module-xhtml/1.3/doxia-module-xhtml-1.3.jar
(15 KB at 307.2 KB/sec)
Downloading: http://repo1.maven.org/maven2/javax/servlet/servlet-api/2.5/servlet-api-2.5.jar
Downloaded: http://repo1.maven.org/maven2/org/apache/httpcomponents/httpcore/4.0.1/httpcore-4.0.1.jar
(169 KB at 3310.5 KB/sec)
Downloading: http://repo1.maven.org/maven2/org/apache/maven/doxia/doxia-decoration-model/1.3/doxia-decoration-model-1.3.jar
Downloaded: http://repo1.maven.org/maven2/org/apache/maven/doxia/doxia-module-apt/1.3/doxia-module-apt-1.3.jar
(51 KB at 994.8 KB/sec)
Downloading: http://repo1.maven.org/maven2/org/apache/maven/doxia/doxia-site-renderer/1.3/doxia-site-renderer-1.3.jar
Downloaded: http://repo1.maven.org/maven2/org/apache/maven/doxia/doxia-module-xdoc/1.3/doxia-module-xdoc-1.3.jar
(36 KB at 729.2 KB/sec)
Downloading: http://repo1.maven.org/maven2/org/apache/velocity/velocity-tools/2.0/velocity-tools-2.0.jar
Downloaded: http://repo1.maven.org/maven2/org/apache/maven/doxia/doxia-module-fml/1.3/doxia-module-fml-1.3.jar
(37 KB at 739.4 KB/sec)
Downloading: http://repo1.maven.org/maven2/commons-digester/commons-digester/1.8/commons-digester-1.8.jar
Downloaded: http://repo1.maven.org/maven2/javax/servlet/servlet-api/2.5/servlet-api-2.5.jar
(103 KB at 2094.9 KB/sec)
Downloading: http://repo1.maven.org/maven2/commons-chain/commons-chain/1.1/commons-chain-1.1.jar
Downloaded: http://repo1.maven.org/maven2/org/apache/maven/doxia/doxia-site-renderer/1.3/doxia-site-renderer-1.3.jar
(53 KB at 1086.9 KB/sec)
Downloading: http://repo1.maven.org/maven2/commons-validator/commons-validator/1.3.1/commons-validator-1.3.1.jar
Downloaded: http://repo1.maven.org/maven2/org/apache/maven/doxia/doxia-decoration-model/1.3/doxia-decoration-model-1.3.jar
(60 KB at 1191.1 KB/sec)
Downloading: http://repo1.maven.org/maven2/dom4j/dom4j/1.1/dom4j-1.1.jar
Downloaded: http://repo1.maven.org/maven2/org/apache/velocity/velocity-tools/2.0/velocity-tools-2.0.jar
(339 KB at 4700.8 KB/sec)
Downloading: http://repo1.maven.org/maven2/sslext/sslext/1.2-0/sslext-1.2-0.jar
Downloaded: http://repo1.maven.org/maven2/commons-chain/commons-chain/1.1/commons-chain-1.1.jar
(88 KB at 1831.1 KB/sec)
Downloading: http://repo1.maven.org/maven2/org/apache/struts/struts-core/1.3.8/struts-core-1.3.8.jar
Downloaded: http://repo1.maven.org/maven2/commons-validator/commons-validator/1.3.1/commons-validator-1.3.1.jar
(136 KB at 2714.0 KB/sec)
Downloading: http://repo1.maven.org/maven2/antlr/antlr/2.7.2/antlr-2.7.2.jar
Downloaded: http://repo1.maven.org/maven2/dom4j/dom4j/1.1/dom4j-1.1.jar (447 KB at 7693.2
KB/sec)
Downloading: http://repo1.maven.org/maven2/org/apache/struts/struts-taglib/1.3.8/struts-taglib-1.3.8.jar
Downloaded: http://repo1.maven.org/maven2/commons-digester/commons-digester/1.8/commons-digester-1.8.jar
(141 KB at 1975.2 KB/sec)
Downloading: http://repo1.maven.org/maven2/org/apache/struts/struts-tiles/1.3.8/struts-tiles-1.3.8.jar
Downloaded: http://repo1.maven.org/maven2/sslext/sslext/1.2-0/sslext-1.2-0.jar (26 KB at 533.3
KB/sec)
Downloading: http://repo1.maven.org/maven2/commons-collections/commons-collections/3.2.1/commons-collections-3.2.1.jar
Downloaded: http://repo1.maven.org/maven2/org/apache/struts/struts-tiles/1.3.8/struts-tiles-1.3.8.jar
(117 KB at 2204.7 KB/sec)
Downloading: http://repo1.maven.org/maven2/org/apache/maven/doxia/doxia-integration-tools/1.5/doxia-integration-tools-1.5.jar
Downloaded: http://repo1.maven.org/maven2/org/apache/struts/struts-taglib/1.3.8/struts-taglib-1.3.8.jar
(246 KB at 4465.9 KB/sec)
Downloading: http://repo1.maven.org/maven2/org/codehaus/plexus/plexus-archiver/1.0/plexus-archiver-1.0.jar
Downloaded: http://repo1.maven.org/maven2/org/apache/struts/struts-core/1.3.8/struts-core-1.3.8.jar
(322 KB at 4460.9 KB/sec)
Downloading: http://repo1.maven.org/maven2/org/codehaus/plexus/plexus-io/1.0/plexus-io-1.0.jar
Downloaded: http://repo1.maven.org/maven2/antlr/antlr/2.7.2/antlr-2.7.2.jar (350 KB at 4859.4
KB/sec)
Downloading: http://repo1.maven.org/maven2/org/codehaus/plexus/plexus-utils/1.5.10/plexus-utils-1.5.10.jar
Downloaded: http://repo1.maven.org/maven2/org/apache/maven/doxia/doxia-integration-tools/1.5/doxia-integration-tools-1.5.jar
(45 KB at 863.7 KB/sec)
Downloaded: http://repo1.maven.org/maven2/org/codehaus/plexus/plexus-io/1.0/plexus-io-1.0.jar
(50 KB at 1033.6 KB/sec)
Downloading: http://repo1.maven.org/maven2/org/mortbay/jetty/jetty/6.1.25/jetty-6.1.25.jar
Downloading: http://repo1.maven.org/maven2/org/mortbay/jetty/servlet-api/2.5-20081211/servlet-api-2.5-20081211.jar
Downloaded: http://repo1.maven.org/maven2/commons-collections/commons-collections/3.2.1/commons-collections-3.2.1.jar
(562 KB at 7393.5 KB/sec)
Downloading: http://repo1.maven.org/maven2/org/mortbay/jetty/jetty-util/6.1.25/jetty-util-6.1.25.jar
Downloaded: http://repo1.maven.org/maven2/org/codehaus/plexus/plexus-utils/1.5.10/plexus-utils-1.5.10.jar
(274 KB at 5371.4 KB/sec)
Downloading: http://repo1.maven.org/maven2/commons-lang/commons-lang/2.5/commons-lang-2.5.jar
Downloaded: http://repo1.maven.org/maven2/org/codehaus/plexus/plexus-archiver/1.0/plexus-archiver-1.0.jar
(174 KB at 2370.0 KB/sec)
Downloading: http://repo1.maven.org/maven2/commons-io/commons-io/1.4/commons-io-1.4.jar
Downloaded: http://repo1.maven.org/maven2/org/mortbay/jetty/servlet-api/2.5-20081211/servlet-api-2.5-20081211.jar
(131 KB at 2619.8 KB/sec)
Downloaded: http://repo1.maven.org/maven2/org/mortbay/jetty/jetty-util/6.1.25/jetty-util-6.1.25.jar
(174 KB at 3145.8 KB/sec)
Downloaded: http://repo1.maven.org/maven2/commons-lang/commons-lang/2.5/commons-lang-2.5.jar
(273 KB at 5144.3 KB/sec)
Downloaded: http://repo1.maven.org/maven2/commons-io/commons-io/1.4/commons-io-1.4.jar (107
KB at 2129.7 KB/sec)
Downloaded: http://repo1.maven.org/maven2/org/mortbay/jetty/jetty/6.1.25/jetty-6.1.25.jar
(526 KB at 7107.5 KB/sec)
[INFO] 
[INFO] --- maven-install-plugin:2.3.1:install (default-install) @ rampart-project ---
Downloading: http://repo1.maven.org/maven2/org/codehaus/plexus/plexus-digest/1.0/plexus-digest-1.0.pom
Downloaded: http://repo1.maven.org/maven2/org/codehaus/plexus/plexus-digest/1.0/plexus-digest-1.0.pom
(2 KB at 22.0 KB/sec)
Downloading: http://repo1.maven.org/maven2/org/codehaus/plexus/plexus-components/1.1.7/plexus-components-1.1.7.pom
Downloaded: http://repo1.maven.org/maven2/org/codehaus/plexus/plexus-components/1.1.7/plexus-components-1.1.7.pom
(5 KB at 103.4 KB/sec)
Downloading: http://repo1.maven.org/maven2/org/codehaus/plexus/plexus-utils/2.0.5/plexus-utils-2.0.5.jar
Downloading: http://repo1.maven.org/maven2/org/codehaus/plexus/plexus-digest/1.0/plexus-digest-1.0.jar
Downloaded: http://repo1.maven.org/maven2/org/codehaus/plexus/plexus-digest/1.0/plexus-digest-1.0.jar
(12 KB at 241.3 KB/sec)
Downloaded: http://repo1.maven.org/maven2/org/codehaus/plexus/plexus-utils/2.0.5/plexus-utils-2.0.5.jar
(218 KB at 4191.2 KB/sec)
[INFO] Installing <https://builds.apache.org/job/rampart-1.6/ws/rampart/pom.xml> to
<https://builds.apache.org/job/rampart-1.6/ws/.repository/org/apache/rampart/rampart-project/1.6.3-SNAPSHOT/rampart-project-1.6.3-SNAPSHOT.pom>
[INFO] Installing <https://builds.apache.org/job/rampart-1.6/ws/rampart/target/rampart-project-1.6.3-SNAPSHOT-site.xml>
to <https://builds.apache.org/job/rampart-1.6/ws/.repository/org/apache/rampart/rampart-project/1.6.3-SNAPSHOT/rampart-project-1.6.3-SNAPSHOT-site.xml>
[INFO]                                                                         
[INFO] ------------------------------------------------------------------------
[INFO] Building Rampart - Policy 1.6.3-SNAPSHOT
[INFO] ------------------------------------------------------------------------
Downloading: http://repo1.maven.org/maven2/org/apache/maven/plugins/maven-resources-plugin/2.6/maven-resources-plugin-2.6.pom
Downloaded: http://repo1.maven.org/maven2/org/apache/maven/plugins/maven-resources-plugin/2.6/maven-resources-plugin-2.6.pom
(8 KB at 168.6 KB/sec)
Downloading: http://repo1.maven.org/maven2/org/apache/maven/plugins/maven-resources-plugin/2.6/maven-resources-plugin-2.6.jar
Downloaded: http://repo1.maven.org/maven2/org/apache/maven/plugins/maven-resources-plugin/2.6/maven-resources-plugin-2.6.jar
(29 KB at 613.3 KB/sec)
Downloading: http://repo1.maven.org/maven2/org/apache/maven/plugins/maven-compiler-plugin/2.0/maven-compiler-plugin-2.0.pom
Downloaded: http://repo1.maven.org/maven2/org/apache/maven/plugins/maven-compiler-plugin/2.0/maven-compiler-plugin-2.0.pom
(2 KB at 24.1 KB/sec)
Downloading: http://repo1.maven.org/maven2/org/apache/maven/plugins/maven-plugin-parent/2.0/maven-plugin-parent-2.0.pom
Downloaded: http://repo1.maven.org/maven2/org/apache/maven/plugins/maven-plugin-parent/2.0/maven-plugin-parent-2.0.pom
(7 KB at 136.2 KB/sec)
Downloading: http://repo1.maven.org/maven2/org/apache/maven/plugins/maven-compiler-plugin/2.0/maven-compiler-plugin-2.0.jar
Downloaded: http://repo1.maven.org/maven2/org/apache/maven/plugins/maven-compiler-plugin/2.0/maven-compiler-plugin-2.0.jar
(14 KB at 283.9 KB/sec)
Downloading: http://repo1.maven.org/maven2/org/apache/maven/plugins/maven-surefire-plugin/2.10/maven-surefire-plugin-2.10.pom
Downloaded: http://repo1.maven.org/maven2/org/apache/maven/plugins/maven-surefire-plugin/2.10/maven-surefire-plugin-2.10.pom
(11 KB at 224.0 KB/sec)
Downloading: http://repo1.maven.org/maven2/org/apache/maven/surefire/surefire/2.10/surefire-2.10.pom
Downloaded: http://repo1.maven.org/maven2/org/apache/maven/surefire/surefire/2.10/surefire-2.10.pom
(12 KB at 247.7 KB/sec)
Downloading: http://repo1.maven.org/maven2/org/apache/maven/plugins/maven-surefire-plugin/2.10/maven-surefire-plugin-2.10.jar
Downloaded: http://repo1.maven.org/maven2/org/apache/maven/plugins/maven-surefire-plugin/2.10/maven-surefire-plugin-2.10.jar
(30 KB at 625.3 KB/sec)
Downloading: http://repo1.maven.org/maven2/org/apache/maven/plugins/maven-jar-plugin/2.4/maven-jar-plugin-2.4.pom
Downloaded: http://repo1.maven.org/maven2/org/apache/maven/plugins/maven-jar-plugin/2.4/maven-jar-plugin-2.4.pom
(6 KB at 121.2 KB/sec)
Downloading: http://repo1.maven.org/maven2/org/apache/maven/plugins/maven-jar-plugin/2.4/maven-jar-plugin-2.4.jar
Downloaded: http://repo1.maven.org/maven2/org/apache/maven/plugins/maven-jar-plugin/2.4/maven-jar-plugin-2.4.jar
(34 KB at 692.2 KB/sec)
Downloading: http://repository.apache.org/snapshots/org/apache/axis2/axis2-kernel/1.6.3-SNAPSHOT/maven-metadata.xml
Downloading: http://repository.apache.org/snapshots/org/apache/axis2/axis2-kernel/1.6.3-SNAPSHOT/axis2-kernel-1.6.3-SNAPSHOT.pom
[WARNING] The POM for org.apache.axis2:axis2-kernel:jar:1.6.3-SNAPSHOT is missing, no dependency
information available
Downloading: http://repo1.maven.org/maven2/org/apache/ws/commons/axiom/axiom-api/1.2.14/axiom-api-1.2.14.pom
Downloaded: http://repo1.maven.org/maven2/org/apache/ws/commons/axiom/axiom-api/1.2.14/axiom-api-1.2.14.pom
(15 KB at 310.4 KB/sec)
Downloading: http://repo1.maven.org/maven2/org/apache/ws/commons/axiom/axiom-parent/1.2.14/axiom-parent-1.2.14.pom
Downloaded: http://repo1.maven.org/maven2/org/apache/ws/commons/axiom/axiom-parent/1.2.14/axiom-parent-1.2.14.pom
(21 KB at 427.4 KB/sec)
Downloading: http://repo1.maven.org/maven2/org/apache/geronimo/specs/geronimo-activation_1.1_spec/1.1/geronimo-activation_1.1_spec-1.1.pom
Downloaded: http://repo1.maven.org/maven2/org/apache/geronimo/specs/geronimo-activation_1.1_spec/1.1/geronimo-activation_1.1_spec-1.1.pom
(5 KB at 102.0 KB/sec)
Downloading: http://repo1.maven.org/maven2/org/apache/geronimo/genesis/genesis-java5-flava/2.0/genesis-java5-flava-2.0.pom
Downloaded: http://repo1.maven.org/maven2/org/apache/geronimo/genesis/genesis-java5-flava/2.0/genesis-java5-flava-2.0.pom
(6 KB at 113.9 KB/sec)
Downloading: http://repo1.maven.org/maven2/org/apache/geronimo/genesis/genesis-default-flava/2.0/genesis-default-flava-2.0.pom
Downloaded: http://repo1.maven.org/maven2/org/apache/geronimo/genesis/genesis-default-flava/2.0/genesis-default-flava-2.0.pom
(18 KB at 370.1 KB/sec)
Downloading: http://repo1.maven.org/maven2/org/apache/geronimo/genesis/genesis/2.0/genesis-2.0.pom
Downloaded: http://repo1.maven.org/maven2/org/apache/geronimo/genesis/genesis/2.0/genesis-2.0.pom
(18 KB at 382.7 KB/sec)
Downloading: http://repo1.maven.org/maven2/org/apache/geronimo/specs/geronimo-javamail_1.4_spec/1.7.1/geronimo-javamail_1.4_spec-1.7.1.pom
Downloaded: http://repo1.maven.org/maven2/org/apache/geronimo/specs/geronimo-javamail_1.4_spec/1.7.1/geronimo-javamail_1.4_spec-1.7.1.pom
(7 KB at 142.8 KB/sec)
Downloading: http://repo1.maven.org/maven2/jaxen/jaxen/1.1.4/jaxen-1.1.4.pom
Downloaded: http://repo1.maven.org/maven2/jaxen/jaxen/1.1.4/jaxen-1.1.4.pom (13 KB at 254.1
KB/sec)
Downloading: http://repo1.maven.org/maven2/org/sonatype/oss/oss-parent/7/oss-parent-7.pom
Downloaded: http://repo1.maven.org/maven2/org/sonatype/oss/oss-parent/7/oss-parent-7.pom (5
KB at 100.2 KB/sec)
Downloading: http://repo1.maven.org/maven2/org/apache/geronimo/specs/geronimo-stax-api_1.0_spec/1.0.1/geronimo-stax-api_1.0_spec-1.0.1.pom
Downloaded: http://repo1.maven.org/maven2/org/apache/geronimo/specs/geronimo-stax-api_1.0_spec/1.0.1/geronimo-stax-api_1.0_spec-1.0.1.pom
(3 KB at 46.0 KB/sec)
Downloading: http://repo1.maven.org/maven2/org/apache/geronimo/specs/specs/1.3/specs-1.3.pom
Downloaded: http://repo1.maven.org/maven2/org/apache/geronimo/specs/specs/1.3/specs-1.3.pom
(7 KB at 145.9 KB/sec)
Downloading: http://repo1.maven.org/maven2/org/apache/geronimo/genesis/config/project-config/1.1/project-config-1.1.pom
Downloaded: http://repo1.maven.org/maven2/org/apache/geronimo/genesis/config/project-config/1.1/project-config-1.1.pom
(15 KB at 298.1 KB/sec)
Downloading: http://repo1.maven.org/maven2/org/apache/geronimo/genesis/config/config/1.1/config-1.1.pom
Downloaded: http://repo1.maven.org/maven2/org/apache/geronimo/genesis/config/config/1.1/config-1.1.pom
(670 B at 13.9 KB/sec)
Downloading: http://repo1.maven.org/maven2/org/apache/geronimo/genesis/genesis/1.1/genesis-1.1.pom
Downloaded: http://repo1.maven.org/maven2/org/apache/geronimo/genesis/genesis/1.1/genesis-1.1.pom
(7 KB at 140.7 KB/sec)
Downloading: http://repo1.maven.org/maven2/org/apache/james/apache-mime4j-core/0.7.2/apache-mime4j-core-0.7.2.pom
Downloaded: http://repo1.maven.org/maven2/org/apache/james/apache-mime4j-core/0.7.2/apache-mime4j-core-0.7.2.pom
(3 KB at 50.0 KB/sec)
Downloading: http://repo1.maven.org/maven2/org/apache/james/apache-mime4j-project/0.7.2/apache-mime4j-project-0.7.2.pom
Downloaded: http://repo1.maven.org/maven2/org/apache/james/apache-mime4j-project/0.7.2/apache-mime4j-project-0.7.2.pom
(10 KB at 203.8 KB/sec)
Downloading: http://repo1.maven.org/maven2/org/apache/james/james-project/1.8/james-project-1.8.pom
Downloaded: http://repo1.maven.org/maven2/org/apache/james/james-project/1.8/james-project-1.8.pom
(53 KB at 1095.3 KB/sec)
Downloading: http://repository.apache.org/snapshots/org/apache/axis2/axis2-kernel/1.6.3-SNAPSHOT/axis2-kernel-1.6.3-SNAPSHOT.jar
Downloading: http://repo1.maven.org/maven2/org/apache/ws/commons/axiom/axiom-api/1.2.14/axiom-api-1.2.14.jar
Downloading: http://repo1.maven.org/maven2/org/apache/geronimo/specs/geronimo-activation_1.1_spec/1.1/geronimo-activation_1.1_spec-1.1.jar
Downloading: http://repo1.maven.org/maven2/org/apache/geronimo/specs/geronimo-javamail_1.4_spec/1.7.1/geronimo-javamail_1.4_spec-1.7.1.jar
Downloading: http://repo1.maven.org/maven2/jaxen/jaxen/1.1.4/jaxen-1.1.4.jar
Downloading: http://repo1.maven.org/maven2/org/apache/geronimo/specs/geronimo-stax-api_1.0_spec/1.0.1/geronimo-stax-api_1.0_spec-1.0.1.jar
Downloaded: http://repo1.maven.org/maven2/org/apache/geronimo/specs/geronimo-activation_1.1_spec/1.1/geronimo-activation_1.1_spec-1.1.jar
(47 KB at 965.7 KB/sec)
Downloading: http://repo1.maven.org/maven2/org/apache/james/apache-mime4j-core/0.7.2/apache-mime4j-core-0.7.2.jar
Downloaded: http://repo1.maven.org/maven2/org/apache/geronimo/specs/geronimo-stax-api_1.0_spec/1.0.1/geronimo-stax-api_1.0_spec-1.0.1.jar
(29 KB at 562.6 KB/sec)
Downloaded: http://repo1.maven.org/maven2/org/apache/geronimo/specs/geronimo-javamail_1.4_spec/1.7.1/geronimo-javamail_1.4_spec-1.7.1.jar
(219 KB at 4193.5 KB/sec)
Downloaded: http://repo1.maven.org/maven2/jaxen/jaxen/1.1.4/jaxen-1.1.4.jar (221 KB at 3807.9
KB/sec)
Downloaded: http://repo1.maven.org/maven2/org/apache/ws/commons/axiom/axiom-api/1.2.14/axiom-api-1.2.14.jar
(412 KB at 5882.1 KB/sec)
Downloaded: http://repo1.maven.org/maven2/org/apache/james/apache-mime4j-core/0.7.2/apache-mime4j-core-0.7.2.jar
(94 KB at 1865.9 KB/sec)
[INFO] ------------------------------------------------------------------------
[INFO] Reactor Summary:
[INFO] 
[INFO] Apache Rampart .................................... SUCCESS [29.267s]
[INFO] Rampart - Policy .................................. FAILURE [1.853s]
[INFO] Rampart - Trust ................................... SKIPPED
[INFO] Rampart - Core .................................... SKIPPED
[INFO] Javadoc ........................................... SKIPPED
[INFO] Rampart - Test Suite .............................. SKIPPED
[INFO] Rampart - Mar ..................................... SKIPPED
[INFO] Rampart - Trust-Mar ............................... SKIPPED
[INFO] Rampart - Integration ............................. SKIPPED
[INFO] Rampart - Samples ................................. SKIPPED
[INFO] Code Coverage Report .............................. SKIPPED
[INFO] Rampart - Distribution ............................ SKIPPED
[INFO] ------------------------------------------------------------------------
[INFO] BUILD FAILURE
[INFO] ------------------------------------------------------------------------
[INFO] Total time: 35.725s
[INFO] Finished at: Sun Dec 06 12:09:01 UTC 2015
[INFO] Final Memory: 19M/241M
[INFO] ------------------------------------------------------------------------
Waiting for Jenkins to finish collecting data[ERROR] Failed to execute goal on project rampart-policy:
Could not resolve dependencies for project org.apache.rampart:rampart-policy:jar:1.6.3-SNAPSHOT:
Could not find artifact org.apache.axis2:axis2-kernel:jar:1.6.3-SNAPSHOT in Nexus (http://repository.apache.org/snapshots)
-> [Help 1]
[ERROR] 
[ERROR] To see the full stack trace of the errors, re-run Maven with the -e switch.
[ERROR] Re-run Maven using the -X switch to enable full debug logging.
[ERROR] 
[ERROR] For more information about the errors and possible solutions, please read the following
articles:
[ERROR] [Help 1] http://cwiki.apache.org/confluence/display/MAVEN/DependencyResolutionException
[ERROR] 
[ERROR] After correcting the problems, you can resume the build with the command
[ERROR]   mvn <goals> -rf :rampart-policy

[JENKINS] Archiving <https://builds.apache.org/job/rampart-1.6/ws/rampart/modules/rampart-trust-mar/pom.xml>
to org.apache.rampart/rahas/1.6.3-SNAPSHOT/rahas-1.6.3-SNAPSHOT.pom
[JENKINS] Archiving <https://builds.apache.org/job/rampart-1.6/ws/rampart/modules/rampart-core/pom.xml>
to org.apache.rampart/rampart-core/1.6.3-SNAPSHOT/rampart-core-1.6.3-SNAPSHOT.pom
[JENKINS] Archiving <https://builds.apache.org/job/rampart-1.6/ws/rampart/modules/rampart-samples/pom.xml>
to org.apache.rampart/rampart-sample/1.6.3-SNAPSHOT/rampart-sample-1.6.3-SNAPSHOT.pom
[JENKINS] Archiving <https://builds.apache.org/job/rampart-1.6/ws/rampart/modules/rampart-trust/pom.xml>
to org.apache.rampart/rampart-trust/1.6.3-SNAPSHOT/rampart-trust-1.6.3-SNAPSHOT.pom
[JENKINS] Archiving <https://builds.apache.org/job/rampart-1.6/ws/rampart/modules/rampart-policy/pom.xml>
to org.apache.rampart/rampart-policy/1.6.3-SNAPSHOT/rampart-policy-1.6.3-SNAPSHOT.pom
[JENKINS] Archiving <https://builds.apache.org/job/rampart-1.6/ws/rampart/modules/rampart-mar/pom.xml>
to org.apache.rampart/rampart/1.6.3-SNAPSHOT/rampart-1.6.3-SNAPSHOT.pom
[JENKINS] Archiving <https://builds.apache.org/job/rampart-1.6/ws/rampart/apidocs/pom.xml>
to org.apache.rampart/apidocs/1.6.3-SNAPSHOT/apidocs-1.6.3-SNAPSHOT.pom
[JENKINS] Archiving <https://builds.apache.org/job/rampart-1.6/ws/rampart/modules/rampart-integration/pom.xml>
to org.apache.rampart/rampart-integration/1.6.3-SNAPSHOT/rampart-integration-1.6.3-SNAPSHOT.pom
[JENKINS] Archiving <https://builds.apache.org/job/rampart-1.6/ws/rampart/pom.xml> to
org.apache.rampart/rampart-project/1.6.3-SNAPSHOT/rampart-project-1.6.3-SNAPSHOT.pom
[JENKINS] Archiving <https://builds.apache.org/job/rampart-1.6/ws/rampart/target/rampart-project-1.6.3-SNAPSHOT-site.xml>
to org.apache.rampart/rampart-project/1.6.3-SNAPSHOT/rampart-project-1.6.3-SNAPSHOT-site.xml
[JENKINS] Archiving <https://builds.apache.org/job/rampart-1.6/ws/rampart/modules/distribution/pom.xml>
to org.apache.rampart/rampart-dist/1.6.3-SNAPSHOT/rampart-dist-1.6.3-SNAPSHOT.pom
[JENKINS] Archiving <https://builds.apache.org/job/rampart-1.6/ws/rampart/modules/rampart-tests/pom.xml>
to org.apache.rampart/rampart-tests/1.6.3-SNAPSHOT/rampart-tests-1.6.3-SNAPSHOT.pom
[JENKINS] Archiving <https://builds.apache.org/job/rampart-1.6/ws/rampart/code-coverage/pom.xml>
to org.apache.rampart/code-coverage/1.6.3-SNAPSHOT/code-coverage-1.6.3-SNAPSHOT.pom
No prior successful build to compare, so performing full copy of artifacts
Sending e-mails to: java-dev@axis.apache.org
channel stopped
[locks-and-latches] Releasing all the locks
[locks-and-latches] All the locks released

---------------------------------------------------------------------
To unsubscribe, e-mail: java-dev-unsubscribe@axis.apache.org
For additional commands, e-mail: java-dev-help@axis.apache.org


Mime
View raw message