axis-java-dev mailing list archives

Site index · List index
Message view « Date » · « Thread »
Top « Date » · « Thread »
From Apache Jenkins Server <jenk...@builds.apache.org>
Subject Build failed in Jenkins: rampart-1.6 #301
Date Tue, 22 Dec 2015 02:29:25 GMT
See <https://builds.apache.org/job/rampart-1.6/301/>

------------------------------------------
Started by upstream project "axis2-1.6" build number 381
originally caused by:
 Started by user veithen
 Started by an SCM change
[EnvInject] - Loading node environment variables.
Building remotely on ubuntu-4 (docker Ubuntu ubuntu4 ubuntu) in workspace <https://builds.apache.org/job/rampart-1.6/ws/>
Updating http://svn.apache.org/repos/asf/axis/axis2/java/rampart/branches/1_6 at revision
'2015-12-22T02:28:53.867 +0000'
U         apidocs/pom.xml
U         modules/distribution/pom.xml
U         modules/distribution/bin.xml
 U        .
At revision 1721292
no change for http://svn.apache.org/repos/asf/axis/axis2/java/rampart/branches/1_6 since the
previous build
[locks-and-latches] Checking to see if we really have the locks
[locks-and-latches] Have all the locks, build can start
[rampart-1.6] $ /bin/bash -xe /tmp/hudson1479334707311708959.sh
+ '[' -d <https://builds.apache.org/job/rampart-1.6/ws/.repository> ']'
++ find <https://builds.apache.org/job/rampart-1.6/ws/.repository> -type d -and -name
'*-SNAPSHOT'
+ rm -rf <https://builds.apache.org/job/rampart-1.6/ws/.repository/org/apache/axis2/mex/1.6.4-SNAPSHOT>
<https://builds.apache.org/job/rampart-1.6/ws/.repository/org/apache/axis2/axis2-kernel/1.6.4-SNAPSHOT>
<https://builds.apache.org/job/rampart-1.6/ws/.repository/org/apache/axis2/axis2-codegen/1.6.4-SNAPSHOT>
<https://builds.apache.org/job/rampart-1.6/ws/.repository/org/apache/axis2/axis2-repo-maven-plugin/1.6.4-SNAPSHOT>
<https://builds.apache.org/job/rampart-1.6/ws/.repository/org/apache/axis2/axis2-parent/1.6.4-SNAPSHOT>
<https://builds.apache.org/job/rampart-1.6/ws/.repository/org/apache/axis2/axis2-mtompolicy/1.6.4-SNAPSHOT>
<https://builds.apache.org/job/rampart-1.6/ws/.repository/org/apache/axis2/addressing/1.6.4-SNAPSHOT>
<https://builds.apache.org/job/rampart-1.6/ws/.repository/org/apache/axis2/axis2-transport-http/1.6.4-SNAPSHOT>
<https://builds.apache.org/job/rampart-1.6/ws/.repository/org/apache/axis2/axis2-mar-maven-plugin/1.6.4-SNAPSHOT>
<https://builds.apache.org/job/rampart-1.6/ws/.repository/org/apache/axis2/axis2-xmlbeans/1.6.4-SNAPSHOT>
<https://builds.apache.org/job/rampart-1.6/ws/.repository/org/apache/axis2/axis2-transport-local/1.6.4-SNAPSHOT>
<https://builds.apache.org/job/rampart-1.6/ws/.repository/org/apache/axis2/axis2-adb/1.6.4-SNAPSHOT>
<https://builds.apache.org/job/rampart-1.6/ws/.repository/org/apache/axis2/axis2-adb-codegen/1.6.4-SNAPSHOT>
<https://builds.apache.org/job/rampart-1.6/ws/.repository/org/apache/rampart/rampart-dist/1.6.4-SNAPSHOT>
<https://builds.apache.org/job/rampart-1.6/ws/.repository/org/apache/rampart/rampart-project/1.6.4-SNAPSHOT>
<https://builds.apache.org/job/rampart-1.6/ws/.repository/org/apache/rampart/rampart-trust/1.6.4-SNAPSHOT>
<https://builds.apache.org/job/rampart-1.6/ws/.repository/org/apache/rampart/rampart-integration/1.6.4-SNAPSHOT>
<https://builds.apache.org/job/rampart-1.6/ws/.repository/org/apache/rampart/rampart-tests/1.6.4-SNAPSHOT>
<https://builds.apache.org/job/rampart-1.6/ws/.repository/org/apache/rampart/rampart-policy/1.6.4-SNAPSHOT>
<https://builds.apache.org/job/rampart-1.6/ws/.repository/org/apache/rampart/code-coverage/1.6.4-SNAPSHOT>
<https://builds.apache.org/job/rampart-1.6/ws/.repository/org/apache/rampart/apidocs/1.6.4-SNAPSHOT>
<https://builds.apache.org/job/rampart-1.6/ws/.repository/org/apache/rampart/rampart/1.6.4-SNAPSHOT>
<https://builds.apache.org/job/rampart-1.6/ws/.repository/org/apache/rampart/rampart-core/1.6.4-SNAPSHOT>
<https://builds.apache.org/job/rampart-1.6/ws/.repository/org/apache/rampart/rahas/1.6.4-SNAPSHOT>
<https://builds.apache.org/job/rampart-1.6/ws/.repository/org/apache/rampart/rampart-sample/1.6.4-SNAPSHOT>
Parsing POMs
Established TCP socket on 33018
maven3-agent.jar already up to date
maven3-interceptor.jar already up to date
maven3-interceptor-commons.jar already up to date
[rampart] $ /home/jenkins/tools/java/latest1.6/bin/java -Xmx2g -Xms256m -XX:MaxPermSize=512m
-cp /home/jenkins/jenkins-slave/maven3-agent.jar:/home/jenkins/jenkins-slave/tools/hudson.tasks.Maven_MavenInstallation/Maven_3.0.3/boot/plexus-classworlds-2.4.jar
org.jvnet.hudson.maven3.agent.Maven3Main /home/jenkins/jenkins-slave/tools/hudson.tasks.Maven_MavenInstallation/Maven_3.0.3
/home/jenkins/jenkins-slave/slave.jar /home/jenkins/jenkins-slave/maven3-interceptor.jar /home/jenkins/jenkins-slave/maven3-interceptor-commons.jar
33018
<===[JENKINS REMOTING CAPACITY]===>   channel started
Executing Maven:  -B -f <https://builds.apache.org/job/rampart-1.6/ws/rampart/pom.xml>
-Dmaven.repo.local=<https://builds.apache.org/job/rampart-1.6/ws/.repository> clean
deploy -Papache-release -Dgpg.skip=true
[INFO] Scanning for projects...
Downloading: http://repository.apache.org/snapshots/org/apache/axis2/axis2-mar-maven-plugin/1.6.4-SNAPSHOT/maven-metadata.xml
Downloaded: http://repository.apache.org/snapshots/org/apache/axis2/axis2-mar-maven-plugin/1.6.4-SNAPSHOT/maven-metadata.xml
(2 KB at 2.5 KB/sec)
Downloading: http://repository.apache.org/snapshots/org/apache/axis2/axis2-mar-maven-plugin/1.6.4-SNAPSHOT/axis2-mar-maven-plugin-1.6.4-20151222.015617-23.pom
Downloaded: http://repository.apache.org/snapshots/org/apache/axis2/axis2-mar-maven-plugin/1.6.4-SNAPSHOT/axis2-mar-maven-plugin-1.6.4-20151222.015617-23.pom
(5 KB at 60.3 KB/sec)
Downloading: http://repository.apache.org/snapshots/org/apache/axis2/axis2/1.6.4-SNAPSHOT/maven-metadata.xml
Downloaded: http://repository.apache.org/snapshots/org/apache/axis2/axis2/1.6.4-SNAPSHOT/maven-metadata.xml
(986 B at 7.9 KB/sec)
Downloading: http://repository.apache.org/snapshots/org/apache/axis2/axis2/1.6.4-SNAPSHOT/axis2-1.6.4-20151222.013313-24.pom
Downloaded: http://repository.apache.org/snapshots/org/apache/axis2/axis2/1.6.4-SNAPSHOT/axis2-1.6.4-20151222.013313-24.pom
(53 KB at 473.2 KB/sec)
Downloading: http://repository.apache.org/snapshots/org/apache/axis2/axis2-mar-maven-plugin/1.6.4-SNAPSHOT/axis2-mar-maven-plugin-1.6.4-20151222.015617-23.jar
Downloaded: http://repository.apache.org/snapshots/org/apache/axis2/axis2-mar-maven-plugin/1.6.4-SNAPSHOT/axis2-mar-maven-plugin-1.6.4-20151222.015617-23.jar
(18 KB at 244.6 KB/sec)
[INFO] ------------------------------------------------------------------------
[INFO] Reactor Build Order:
[INFO] 
[INFO] Apache Rampart
[INFO] Rampart - Policy
[INFO] Rampart - Trust
[INFO] Rampart - Core
[INFO] Javadoc
[INFO] Rampart - Test Suite
[INFO] Rampart - Mar
[INFO] Rampart - Trust-Mar
[INFO] Rampart - Integration
[INFO] Rampart - Samples
[INFO] Rampart - Distribution
[INFO] Code Coverage Report
[INFO]                                                                         
[INFO] ------------------------------------------------------------------------
[INFO] Building Apache Rampart 1.6.4-SNAPSHOT
[INFO] ------------------------------------------------------------------------
Downloading: http://repo1.maven.org/maven2/org/apache/maven/plugins/maven-deploy-plugin/2.8.2/maven-deploy-plugin-2.8.2.pom
Downloaded: http://repo1.maven.org/maven2/org/apache/maven/plugins/maven-deploy-plugin/2.8.2/maven-deploy-plugin-2.8.2.pom
(7 KB at 78.3 KB/sec)
Downloading: http://repo1.maven.org/maven2/org/apache/maven/plugins/maven-deploy-plugin/2.8.2/maven-deploy-plugin-2.8.2.jar
Downloaded: http://repo1.maven.org/maven2/org/apache/maven/plugins/maven-deploy-plugin/2.8.2/maven-deploy-plugin-2.8.2.jar
(34 KB at 456.6 KB/sec)
[INFO] 
[INFO] --- maven-clean-plugin:2.5:clean (default-clean) @ rampart-project ---
[INFO] Deleting <https://builds.apache.org/job/rampart-1.6/ws/rampart/target>
[INFO] 
[INFO] --- maven-enforcer-plugin:1.1:enforce (default) @ rampart-project ---
[INFO] 
[INFO] --- gmavenplus-plugin:1.5:execute (initialize) @ rampart-project ---
[WARNING] Module [groovy-all] - Unable to load extension class [org.codehaus.groovy.runtime.NioGroovyMethods]
[INFO] Using Groovy 2.4.4 to perform execute.
[INFO] 
[INFO] --- jacoco-maven-plugin:0.6.1.201212231917:prepare-agent (prepare-agent-for-surefire)
@ rampart-project ---
[INFO] Skipping JaCoCo for project with packaging type 'pom'
[INFO] jacoco.surefireArgLine set to 
[INFO] 
[INFO] --- maven-remote-resources-plugin:1.5:process (default) @ rampart-project ---
[INFO] 
[INFO] --- build-helper-maven-plugin:1.7:attach-artifact (attach-jacoco-exec) @ rampart-project
---
[INFO] Skip attaching artifacts
[INFO] 
[INFO] --- maven-site-plugin:3.4:attach-descriptor (attach-descriptor) @ rampart-project ---
[INFO] 
[INFO] --- maven-assembly-plugin:2.6:single (source-release-assembly) @ rampart-project ---
[INFO] Assemblies have been skipped per configuration of the skipAssembly parameter.
[INFO] 
[INFO] --- maven-source-plugin:2.4:jar-no-fork (source-jars) @ rampart-project ---
[INFO] 
[INFO] --- maven-javadoc-plugin:2.10.3:jar (attach-javadocs) @ rampart-project ---
[INFO] Not executing Javadoc as the project is not a Java classpath-capable package
[INFO] 
[INFO] --- maven-gpg-plugin:1.5:sign (default) @ rampart-project ---
[INFO] 
[INFO] --- maven-install-plugin:2.5.2:install (default-install) @ rampart-project ---
[INFO] Installing <https://builds.apache.org/job/rampart-1.6/ws/rampart/pom.xml> to
<https://builds.apache.org/job/rampart-1.6/ws/.repository/org/apache/rampart/rampart-project/1.6.4-SNAPSHOT/rampart-project-1.6.4-SNAPSHOT.pom>
[INFO] Installing <https://builds.apache.org/job/rampart-1.6/ws/rampart/target/rampart-project-1.6.4-SNAPSHOT-site.xml>
to <https://builds.apache.org/job/rampart-1.6/ws/.repository/org/apache/rampart/rampart-project/1.6.4-SNAPSHOT/rampart-project-1.6.4-SNAPSHOT-site.xml>
[INFO] 
[INFO] --- maven-deploy-plugin:2.8.2:deploy (default-deploy) @ rampart-project ---
Downloading: https://repository.apache.org/content/repositories/snapshots/org/apache/rampart/rampart-project/1.6.4-SNAPSHOT/maven-metadata.xml
[WARNING] Could not transfer metadata org.apache.rampart:rampart-project:1.6.4-SNAPSHOT/maven-metadata.xml
from/to apache.snapshots.https (https://repository.apache.org/content/repositories/snapshots):
Error transferring file: java.lang.RuntimeException: Could not generate DH keypair
[INFO] ------------------------------------------------------------------------
[INFO] Reactor Summary:
[INFO] 
[INFO] Apache Rampart .................................... FAILURE [7.547s]
[INFO] Rampart - Policy .................................. SKIPPED
[INFO] Rampart - Trust ................................... SKIPPED
[INFO] Rampart - Core .................................... SKIPPED
[INFO] Javadoc ........................................... SKIPPED
[INFO] Rampart - Test Suite .............................. SKIPPED
[INFO] Rampart - Mar ..................................... SKIPPED
[INFO] Rampart - Trust-Mar ............................... SKIPPED
[INFO] Rampart - Integration ............................. SKIPPED
[INFO] Rampart - Samples ................................. SKIPPED
[INFO] Rampart - Distribution ............................ SKIPPED
[INFO] Code Coverage Report .............................. SKIPPED
[INFO] ------------------------------------------------------------------------
[INFO] BUILD FAILURE
[INFO] ------------------------------------------------------------------------
[INFO] Total time: 10.068s
[INFO] Finished at: Tue Dec 22 02:29:24 UTC 2015
[INFO] Final Memory: 30M/315M
[INFO] ------------------------------------------------------------------------
Waiting for Jenkins to finish collecting data[ERROR] Failed to execute goal org.apache.maven.plugins:maven-deploy-plugin:2.8.2:deploy
(default-deploy) on project rampart-project: Failed to retrieve remote metadata org.apache.rampart:rampart-project:1.6.4-SNAPSHOT/maven-metadata.xml:
Could not transfer metadata org.apache.rampart:rampart-project:1.6.4-SNAPSHOT/maven-metadata.xml
from/to apache.snapshots.https (https://repository.apache.org/content/repositories/snapshots):
Error transferring file: java.lang.RuntimeException: Could not generate DH keypair: Prime
size must be multiple of 64, and can only range from 512 to 1024 (inclusive) -> [Help 1]
[ERROR] 
[ERROR] To see the full stack trace of the errors, re-run Maven with the -e switch.
[ERROR] Re-run Maven using the -X switch to enable full debug logging.
[ERROR] 
[ERROR] For more information about the errors and possible solutions, please read the following
articles:
[ERROR] [Help 1] http://cwiki.apache.org/confluence/display/MAVEN/MojoExecutionException

[JENKINS] Archiving <https://builds.apache.org/job/rampart-1.6/ws/rampart/modules/rampart-trust-mar/pom.xml>
to org.apache.rampart/rahas/1.6.4-SNAPSHOT/rahas-1.6.4-SNAPSHOT.pom
[JENKINS] Archiving <https://builds.apache.org/job/rampart-1.6/ws/rampart/modules/rampart-core/pom.xml>
to org.apache.rampart/rampart-core/1.6.4-SNAPSHOT/rampart-core-1.6.4-SNAPSHOT.pom
[JENKINS] Archiving <https://builds.apache.org/job/rampart-1.6/ws/rampart/modules/rampart-samples/pom.xml>
to org.apache.rampart/rampart-sample/1.6.4-SNAPSHOT/rampart-sample-1.6.4-SNAPSHOT.pom
[JENKINS] Archiving <https://builds.apache.org/job/rampart-1.6/ws/rampart/modules/rampart-trust/pom.xml>
to org.apache.rampart/rampart-trust/1.6.4-SNAPSHOT/rampart-trust-1.6.4-SNAPSHOT.pom
[JENKINS] Archiving <https://builds.apache.org/job/rampart-1.6/ws/rampart/modules/rampart-policy/pom.xml>
to org.apache.rampart/rampart-policy/1.6.4-SNAPSHOT/rampart-policy-1.6.4-SNAPSHOT.pom
[JENKINS] Archiving <https://builds.apache.org/job/rampart-1.6/ws/rampart/modules/rampart-mar/pom.xml>
to org.apache.rampart/rampart/1.6.4-SNAPSHOT/rampart-1.6.4-SNAPSHOT.pom
[JENKINS] Archiving <https://builds.apache.org/job/rampart-1.6/ws/rampart/apidocs/pom.xml>
to org.apache.rampart/apidocs/1.6.4-SNAPSHOT/apidocs-1.6.4-SNAPSHOT.pom
[JENKINS] Archiving <https://builds.apache.org/job/rampart-1.6/ws/rampart/modules/rampart-integration/pom.xml>
to org.apache.rampart/rampart-integration/1.6.4-SNAPSHOT/rampart-integration-1.6.4-SNAPSHOT.pom
Compressed 53.59 KB of artifacts by 59.7% relative to #300
[JENKINS] Archiving <https://builds.apache.org/job/rampart-1.6/ws/rampart/pom.xml> to
org.apache.rampart/rampart-project/1.6.4-SNAPSHOT/rampart-project-1.6.4-SNAPSHOT.pom
[JENKINS] Archiving <https://builds.apache.org/job/rampart-1.6/ws/rampart/target/rampart-project-1.6.4-SNAPSHOT-site.xml>
to org.apache.rampart/rampart-project/1.6.4-SNAPSHOT/rampart-project-1.6.4-SNAPSHOT-site.xml
[JENKINS] Archiving <https://builds.apache.org/job/rampart-1.6/ws/rampart/modules/distribution/pom.xml>
to org.apache.rampart/rampart-dist/1.6.4-SNAPSHOT/rampart-dist-1.6.4-SNAPSHOT.pom
[JENKINS] Archiving <https://builds.apache.org/job/rampart-1.6/ws/rampart/modules/rampart-tests/pom.xml>
to org.apache.rampart/rampart-tests/1.6.4-SNAPSHOT/rampart-tests-1.6.4-SNAPSHOT.pom
[JENKINS] Archiving <https://builds.apache.org/job/rampart-1.6/ws/rampart/code-coverage/pom.xml>
to org.apache.rampart/code-coverage/1.6.4-SNAPSHOT/code-coverage-1.6.4-SNAPSHOT.pom
Sending e-mails to: java-dev@axis.apache.org
channel stopped
[locks-and-latches] Releasing all the locks
[locks-and-latches] All the locks released

---------------------------------------------------------------------
To unsubscribe, e-mail: java-dev-unsubscribe@axis.apache.org
For additional commands, e-mail: java-dev-help@axis.apache.org


Mime
View raw message