axis-java-dev mailing list archives

Site index · List index
Message view « Date » · « Thread »
Top « Date » · « Thread »
From Apache Jenkins Server <jenk...@builds.apache.org>
Subject Build failed in Jenkins: Rampart #2033
Date Wed, 02 Dec 2015 22:37:18 GMT
See <https://builds.apache.org/job/Rampart/2033/>

------------------------------------------
[...truncated 1424 lines...]
Downloading: http://repo1.maven.org/maven2/org/apache/maven/wagon/wagon-http-lightweight/1.0/wagon-http-lightweight-1.0.jar
Downloaded: http://repo1.maven.org/maven2/org/apache/maven/wagon/wagon-file/1.0/wagon-file-1.0.jar
(11 KB at 163.0 KB/sec)
Downloading: http://repo1.maven.org/maven2/org/apache/maven/wagon/wagon-http-shared/1.0/wagon-http-shared-1.0.jar
Downloaded: http://repo1.maven.org/maven2/org/codehaus/plexus/plexus-interactivity-api/1.0-alpha-6/plexus-interactivity-api-1.0-alpha-6.jar
(12 KB at 100.1 KB/sec)
Downloading: http://repo1.maven.org/maven2/org/jsoup/jsoup/1.6.1/jsoup-1.6.1.jar
Downloaded: http://repo1.maven.org/maven2/org/apache/maven/wagon/wagon-http-shared/1.0/wagon-http-shared-1.0.jar
(25 KB at 364.0 KB/sec)
Downloading: http://repo1.maven.org/maven2/org/apache/maven/scm/maven-scm-api/1.8/maven-scm-api-1.8.jar
Downloaded: http://repo1.maven.org/maven2/org/apache/maven/wagon/wagon-http-lightweight/1.0/wagon-http-lightweight-1.0.jar
(15 KB at 122.6 KB/sec)
Downloading: http://repo1.maven.org/maven2/org/apache/maven/scm/maven-scm-manager-plexus/1.8/maven-scm-manager-plexus-1.8.jar
Downloaded: http://repo1.maven.org/maven2/org/apache/bcel/bcel/5.2/bcel-5.2.jar (521 KB at
1225.5 KB/sec)
Downloading: http://repo1.maven.org/maven2/org/apache/maven/scm/maven-scm-provider-hg/1.8/maven-scm-provider-hg-1.8.jar
Downloaded: http://repo1.maven.org/maven2/com/jcraft/jsch/0.1.44-1/jsch-0.1.44-1.jar (209
KB at 717.4 KB/sec)
Downloading: http://repo1.maven.org/maven2/regexp/regexp/1.3/regexp-1.3.jar
Downloaded: http://repo1.maven.org/maven2/org/jsoup/jsoup/1.6.1/jsoup-1.6.1.jar (275 KB at
2083.2 KB/sec)
Downloading: http://repo1.maven.org/maven2/org/apache/maven/scm/maven-scm-provider-perforce/1.8/maven-scm-provider-perforce-1.8.jar
Downloaded: http://repo1.maven.org/maven2/org/apache/maven/scm/maven-scm-api/1.8/maven-scm-api-1.8.jar
(103 KB at 1060.5 KB/sec)
Downloading: http://repo1.maven.org/maven2/org/apache/maven/scm/maven-scm-provider-starteam/1.8/maven-scm-provider-starteam-1.8.jar
Downloaded: http://repo1.maven.org/maven2/org/apache/maven/scm/maven-scm-manager-plexus/1.8/maven-scm-manager-plexus-1.8.jar
(11 KB at 87.5 KB/sec)
Downloading: http://repo1.maven.org/maven2/org/apache/maven/scm/maven-scm-provider-svn-commons/1.8/maven-scm-provider-svn-commons-1.8.jar
Downloaded: http://repo1.maven.org/maven2/org/apache/maven/scm/maven-scm-provider-hg/1.8/maven-scm-provider-hg-1.8.jar
(65 KB at 592.2 KB/sec)
Downloading: http://repo1.maven.org/maven2/org/apache/maven/scm/maven-scm-provider-svnexe/1.8/maven-scm-provider-svnexe-1.8.jar
Downloaded: http://repo1.maven.org/maven2/org/apache/maven/scm/maven-scm-provider-starteam/1.8/maven-scm-provider-starteam-1.8.jar
(73 KB at 1083.6 KB/sec)
Downloading: http://repo1.maven.org/maven2/commons-lang/commons-lang/2.6/commons-lang-2.6.jar
Downloaded: http://repo1.maven.org/maven2/regexp/regexp/1.3/regexp-1.3.jar (25 KB at 214.1
KB/sec)
Downloading: http://repo1.maven.org/maven2/org/apache/maven/scm/maven-scm-provider-cvs-commons/1.8/maven-scm-provider-cvs-commons-1.8.jar
Downloaded: http://repo1.maven.org/maven2/org/apache/maven/scm/maven-scm-provider-perforce/1.8/maven-scm-provider-perforce-1.8.jar
(80 KB at 665.6 KB/sec)
Downloading: http://repo1.maven.org/maven2/org/apache/maven/scm/maven-scm-provider-cvsexe/1.8/maven-scm-provider-cvsexe-1.8.jar
Downloaded: http://repo1.maven.org/maven2/org/apache/maven/scm/maven-scm-provider-svnexe/1.8/maven-scm-provider-svnexe-1.8.jar
(75 KB at 681.4 KB/sec)
Downloading: http://repo1.maven.org/maven2/org/apache/maven/scm/maven-scm-provider-cvsjava/1.8/maven-scm-provider-cvsjava-1.8.jar
Downloaded: http://repo1.maven.org/maven2/org/apache/maven/scm/maven-scm-provider-svn-commons/1.8/maven-scm-provider-svn-commons-1.8.jar
(40 KB at 331.9 KB/sec)
Downloading: http://repo1.maven.org/maven2/org/netbeans/lib/cvsclient/20060125/cvsclient-20060125.jar
Downloaded: http://repo1.maven.org/maven2/org/apache/maven/scm/maven-scm-provider-cvsexe/1.8/maven-scm-provider-cvsexe-1.8.jar
(30 KB at 303.5 KB/sec)
Downloading: http://repo1.maven.org/maven2/ch/ethz/ganymed/ganymed-ssh2/build210/ganymed-ssh2-build210.jar
Downloaded: http://repo1.maven.org/maven2/org/apache/maven/scm/maven-scm-provider-cvs-commons/1.8/maven-scm-provider-cvs-commons-1.8.jar
(79 KB at 661.1 KB/sec)
Downloading: http://repo1.maven.org/maven2/org/apache/maven/scm/maven-scm-provider-gitexe/1.8/maven-scm-provider-gitexe-1.8.jar
Downloaded: http://repo1.maven.org/maven2/commons-lang/commons-lang/2.6/commons-lang-2.6.jar
(278 KB at 1756.7 KB/sec)
Downloading: http://repo1.maven.org/maven2/org/apache/maven/scm/maven-scm-provider-git-commons/1.8/maven-scm-provider-git-commons-1.8.jar
Downloaded: http://repo1.maven.org/maven2/org/apache/maven/scm/maven-scm-provider-cvsjava/1.8/maven-scm-provider-cvsjava-1.8.jar
(43 KB at 362.6 KB/sec)
Downloading: http://repo1.maven.org/maven2/org/apache/maven/doxia/doxia-logging-api/1.2/doxia-logging-api-1.2.jar
Downloaded: http://repo1.maven.org/maven2/ch/ethz/ganymed/ganymed-ssh2/build210/ganymed-ssh2-build210.jar
(240 KB at 2439.7 KB/sec)
Downloading: http://repo1.maven.org/maven2/org/apache/maven/doxia/doxia-core/1.2/doxia-core-1.2.jar
Downloaded: http://repo1.maven.org/maven2/org/apache/maven/scm/maven-scm-provider-gitexe/1.8/maven-scm-provider-gitexe-1.8.jar
(62 KB at 555.5 KB/sec)
Downloading: http://repo1.maven.org/maven2/org/apache/maven/doxia/doxia-module-xhtml/1.2/doxia-module-xhtml-1.2.jar
Downloaded: http://repo1.maven.org/maven2/org/apache/maven/scm/maven-scm-provider-git-commons/1.8/maven-scm-provider-git-commons-1.8.jar
(37 KB at 310.4 KB/sec)
Downloading: http://repo1.maven.org/maven2/org/apache/maven/doxia/doxia-decoration-model/1.2/doxia-decoration-model-1.2.jar
Downloaded: http://repo1.maven.org/maven2/org/apache/maven/doxia/doxia-core/1.2/doxia-core-1.2.jar
(151 KB at 2213.4 KB/sec)
Downloading: http://repo1.maven.org/maven2/org/apache/maven/doxia/doxia-module-fml/1.2/doxia-module-fml-1.2.jar
Downloaded: http://repo1.maven.org/maven2/org/apache/maven/doxia/doxia-logging-api/1.2/doxia-logging-api-1.2.jar
(12 KB at 95.5 KB/sec)
Downloading: http://repo1.maven.org/maven2/org/codehaus/plexus/plexus-interpolation/1.9/plexus-interpolation-1.9.jar
Downloaded: http://repo1.maven.org/maven2/org/apache/maven/doxia/doxia-module-xhtml/1.2/doxia-module-xhtml-1.2.jar
(15 KB at 137.8 KB/sec)
Downloading: http://repo1.maven.org/maven2/commons-validator/commons-validator/1.4.0/commons-validator-1.4.0.jar
Downloaded: http://repo1.maven.org/maven2/org/apache/maven/doxia/doxia-module-fml/1.2/doxia-module-fml-1.2.jar
(37 KB at 560.2 KB/sec)
Downloading: http://repo1.maven.org/maven2/commons-beanutils/commons-beanutils/1.8.3/commons-beanutils-1.8.3.jar
Downloaded: http://repo1.maven.org/maven2/org/apache/maven/doxia/doxia-decoration-model/1.2/doxia-decoration-model-1.2.jar
(59 KB at 490.2 KB/sec)
Downloading: http://repo1.maven.org/maven2/joda-time/joda-time/1.6.2/joda-time-1.6.2.jar
Downloaded: http://repo1.maven.org/maven2/org/netbeans/lib/cvsclient/20060125/cvsclient-20060125.jar
(605 KB at 1836.2 KB/sec)
Downloaded: http://repo1.maven.org/maven2/commons-beanutils/commons-beanutils/1.8.3/commons-beanutils-1.8.3.jar
(227 KB at 3236.9 KB/sec)
Downloaded: http://repo1.maven.org/maven2/org/codehaus/plexus/plexus-interpolation/1.9/plexus-interpolation-1.9.jar
(50 KB at 421.5 KB/sec)
Downloaded: http://repo1.maven.org/maven2/commons-validator/commons-validator/1.4.0/commons-validator-1.4.0.jar
(173 KB at 1542.4 KB/sec)
Downloaded: http://repo1.maven.org/maven2/joda-time/joda-time/1.6.2/joda-time-1.6.2.jar (531
KB at 2247.1 KB/sec)
[INFO] Parent project loaded from repository: org.apache:apache:pom:13
Downloading: http://repo1.maven.org/maven2/org/apache/apache/13/apache-13-site_en.xml
Downloading: http://repo1.maven.org/maven2/org/apache/apache/13/apache-13-site.xml
[INFO] Relativizing decoration links with respect to project URL: http://axis.apache.org/axis2/java/rampart
Downloading: http://repo1.maven.org/maven2/org/apache/maven/skins/maven-default-skin/1.0/maven-default-skin-1.0.jar
Downloaded: http://repo1.maven.org/maven2/org/apache/maven/skins/maven-default-skin/1.0/maven-default-skin-1.0.jar
(8 KB at 69.4 KB/sec)
[INFO] Rendering site with org.apache.maven.skins:maven-default-skin:jar:1.0 skin.
[INFO] Generating "Project Team" report    --- maven-project-info-reports-plugin:2.6
[INFO] Generating "Dependencies" report    --- maven-project-info-reports-plugin:2.6
[INFO] Generating "Mailing Lists" report    --- maven-project-info-reports-plugin:2.6
[JENKINS] Archiving site from <https://builds.apache.org/job/Rampart/ws/trunk/target/site>
to /x1/jenkins/jenkins-home/jobs/Rampart/site
log4j:WARN No appenders could be found for logger (org.apache.commons.beanutils.converters.BooleanConverter).
log4j:WARN Please initialize the log4j system properly.
[INFO] 
[INFO] --- maven-install-plugin:2.3.1:install (default-install) @ rampart-project ---
Downloading: http://repo1.maven.org/maven2/org/codehaus/plexus/plexus-utils/2.0.5/plexus-utils-2.0.5.jar
Downloaded: http://repo1.maven.org/maven2/org/codehaus/plexus/plexus-utils/2.0.5/plexus-utils-2.0.5.jar
(218 KB at 923.5 KB/sec)
[INFO] Installing <https://builds.apache.org/job/Rampart/ws/trunk/pom.xml> to <https://builds.apache.org/job/Rampart/ws/.repository/org/apache/rampart/rampart-project/1.7.0-SNAPSHOT/rampart-project-1.7.0-SNAPSHOT.pom>
[INFO] Installing <https://builds.apache.org/job/Rampart/ws/trunk/target/rampart-project-1.7.0-SNAPSHOT-site.xml>
to <https://builds.apache.org/job/Rampart/ws/.repository/org/apache/rampart/rampart-project/1.7.0-SNAPSHOT/rampart-project-1.7.0-SNAPSHOT-site.xml>
[INFO]                                                                         
[INFO] ------------------------------------------------------------------------
[INFO] Building Rampart - Policy 1.7.0-SNAPSHOT
[INFO] ------------------------------------------------------------------------
Downloading: http://repo1.maven.org/maven2/org/apache/maven/plugins/maven-resources-plugin/2.6/maven-resources-plugin-2.6.pom
Downloaded: http://repo1.maven.org/maven2/org/apache/maven/plugins/maven-resources-plugin/2.6/maven-resources-plugin-2.6.pom
(8 KB at 95.5 KB/sec)
Downloading: http://repo1.maven.org/maven2/org/apache/maven/plugins/maven-resources-plugin/2.6/maven-resources-plugin-2.6.jar
Downloaded: http://repo1.maven.org/maven2/org/apache/maven/plugins/maven-resources-plugin/2.6/maven-resources-plugin-2.6.jar
(29 KB at 443.5 KB/sec)
Downloading: http://repo1.maven.org/maven2/org/apache/maven/plugins/maven-compiler-plugin/2.0/maven-compiler-plugin-2.0.pom
Downloaded: http://repo1.maven.org/maven2/org/apache/maven/plugins/maven-compiler-plugin/2.0/maven-compiler-plugin-2.0.pom
(2 KB at 17.5 KB/sec)
Downloading: http://repo1.maven.org/maven2/org/apache/maven/plugins/maven-plugin-parent/2.0/maven-plugin-parent-2.0.pom
Downloaded: http://repo1.maven.org/maven2/org/apache/maven/plugins/maven-plugin-parent/2.0/maven-plugin-parent-2.0.pom
(7 KB at 99.0 KB/sec)
Downloading: http://repo1.maven.org/maven2/org/apache/maven/plugins/maven-compiler-plugin/2.0/maven-compiler-plugin-2.0.jar
Downloaded: http://repo1.maven.org/maven2/org/apache/maven/plugins/maven-compiler-plugin/2.0/maven-compiler-plugin-2.0.jar
(14 KB at 206.5 KB/sec)
Downloading: http://repo1.maven.org/maven2/org/apache/maven/plugins/maven-surefire-plugin/2.10/maven-surefire-plugin-2.10.pom
Downloaded: http://repo1.maven.org/maven2/org/apache/maven/plugins/maven-surefire-plugin/2.10/maven-surefire-plugin-2.10.pom
(11 KB at 162.0 KB/sec)
Downloading: http://repo1.maven.org/maven2/org/apache/maven/surefire/surefire/2.10/surefire-2.10.pom
Downloaded: http://repo1.maven.org/maven2/org/apache/maven/surefire/surefire/2.10/surefire-2.10.pom
(12 KB at 179.1 KB/sec)
Downloading: http://repo1.maven.org/maven2/org/apache/maven/plugins/maven-surefire-plugin/2.10/maven-surefire-plugin-2.10.jar
Downloaded: http://repo1.maven.org/maven2/org/apache/maven/plugins/maven-surefire-plugin/2.10/maven-surefire-plugin-2.10.jar
(30 KB at 452.1 KB/sec)
Downloading: http://repo1.maven.org/maven2/org/apache/maven/plugins/maven-jar-plugin/2.4/maven-jar-plugin-2.4.pom
Downloaded: http://repo1.maven.org/maven2/org/apache/maven/plugins/maven-jar-plugin/2.4/maven-jar-plugin-2.4.pom
(6 KB at 87.7 KB/sec)
Downloading: http://repo1.maven.org/maven2/org/apache/maven/plugins/maven-jar-plugin/2.4/maven-jar-plugin-2.4.jar
Downloaded: http://repo1.maven.org/maven2/org/apache/maven/plugins/maven-jar-plugin/2.4/maven-jar-plugin-2.4.jar
(34 KB at 503.4 KB/sec)
Downloading: http://repository.apache.org/snapshots/org/apache/axis2/axis2-kernel/1.7.0-SNAPSHOT/maven-metadata.xml
Downloaded: http://repository.apache.org/snapshots/org/apache/axis2/axis2-kernel/1.7.0-SNAPSHOT/maven-metadata.xml
(2 KB at 4.7 KB/sec)
Downloading: http://repository.apache.org/snapshots/org/apache/axis2/axis2-kernel/1.7.0-SNAPSHOT/axis2-kernel-1.7.0-20151202.213432-2345.pom
Downloaded: http://repository.apache.org/snapshots/org/apache/axis2/axis2-kernel/1.7.0-SNAPSHOT/axis2-kernel-1.7.0-20151202.213432-2345.pom
(11 KB at 58.7 KB/sec)
Downloading: http://repository.apache.org/snapshots/org/apache/axis2/axis2-parent/1.7.0-SNAPSHOT/maven-metadata.xml
Downloaded: http://repository.apache.org/snapshots/org/apache/axis2/axis2-parent/1.7.0-SNAPSHOT/maven-metadata.xml
(611 B at 3.0 KB/sec)
Downloading: http://repository.apache.org/snapshots/org/apache/axis2/axis2-parent/1.7.0-SNAPSHOT/axis2-parent-1.7.0-20151202.213235-2371.pom
Downloaded: http://repository.apache.org/snapshots/org/apache/axis2/axis2-parent/1.7.0-SNAPSHOT/axis2-parent-1.7.0-20151202.213235-2371.pom
(49 KB at 220.5 KB/sec)
Downloading: http://repo1.maven.org/maven2/org/apache/apache/8/apache-8.pom
Downloaded: http://repo1.maven.org/maven2/org/apache/apache/8/apache-8.pom (14 KB at 211.1
KB/sec)
Downloading: http://repository.apache.org/snapshots/org/apache/ws/commons/axiom/axiom-api/1.2.16-SNAPSHOT/maven-metadata.xml
Downloading: http://repository.apache.org/snapshots/org/apache/ws/commons/axiom/axiom-api/1.2.16-SNAPSHOT/maven-metadata.xml
Downloading: http://repository.apache.org/snapshots/org/apache/ws/commons/axiom/axiom-api/1.2.16-SNAPSHOT/axiom-api-1.2.16-SNAPSHOT.pom
[WARNING] The POM for org.apache.ws.commons.axiom:axiom-api:jar:1.2.16-SNAPSHOT is missing,
no dependency information available
Downloading: http://repository.apache.org/snapshots/org/apache/ws/commons/axiom/axiom-impl/1.2.16-SNAPSHOT/maven-metadata.xml
Downloading: http://repository.apache.org/snapshots/org/apache/ws/commons/axiom/axiom-impl/1.2.16-SNAPSHOT/maven-metadata.xml
Downloading: http://repository.apache.org/snapshots/org/apache/ws/commons/axiom/axiom-impl/1.2.16-SNAPSHOT/axiom-impl-1.2.16-SNAPSHOT.pom
[WARNING] The POM for org.apache.ws.commons.axiom:axiom-impl:jar:1.2.16-SNAPSHOT is missing,
no dependency information available
Downloading: http://repo1.maven.org/maven2/org/apache/geronimo/specs/geronimo-ws-metadata_2.0_spec/1.1.2/geronimo-ws-metadata_2.0_spec-1.1.2.pom
Downloaded: http://repo1.maven.org/maven2/org/apache/geronimo/specs/geronimo-ws-metadata_2.0_spec/1.1.2/geronimo-ws-metadata_2.0_spec-1.1.2.pom
(3 KB at 32.4 KB/sec)
Downloading: http://repo1.maven.org/maven2/org/apache/geronimo/specs/specs/1.4/specs-1.4.pom
Downloaded: http://repo1.maven.org/maven2/org/apache/geronimo/specs/specs/1.4/specs-1.4.pom
(12 KB at 180.3 KB/sec)
Downloading: http://repo1.maven.org/maven2/org/apache/geronimo/genesis/config/project-config/1.2/project-config-1.2.pom
Downloaded: http://repo1.maven.org/maven2/org/apache/geronimo/genesis/config/project-config/1.2/project-config-1.2.pom
(22 KB at 322.5 KB/sec)
Downloading: http://repo1.maven.org/maven2/org/apache/geronimo/genesis/config/config/1.2/config-1.2.pom
Downloaded: http://repo1.maven.org/maven2/org/apache/geronimo/genesis/config/config/1.2/config-1.2.pom
(2 KB at 26.7 KB/sec)
Downloading: http://repo1.maven.org/maven2/org/apache/geronimo/genesis/genesis/1.2/genesis-1.2.pom
Downloaded: http://repo1.maven.org/maven2/org/apache/geronimo/genesis/genesis/1.2/genesis-1.2.pom
(11 KB at 166.7 KB/sec)
Downloading: http://repo1.maven.org/maven2/org/apache/geronimo/specs/geronimo-jta_1.1_spec/1.1/geronimo-jta_1.1_spec-1.1.pom
Downloaded: http://repo1.maven.org/maven2/org/apache/geronimo/specs/geronimo-jta_1.1_spec/1.1/geronimo-jta_1.1_spec-1.1.pom
(2 KB at 22.6 KB/sec)
Downloading: http://repo1.maven.org/maven2/org/apache/geronimo/specs/specs/1.2/specs-1.2.pom
Downloaded: http://repo1.maven.org/maven2/org/apache/geronimo/specs/specs/1.2/specs-1.2.pom
(3 KB at 41.1 KB/sec)
Downloading: http://repo1.maven.org/maven2/org/apache/geronimo/genesis/config/project-config/1.1/project-config-1.1.pom
Downloaded: http://repo1.maven.org/maven2/org/apache/geronimo/genesis/config/project-config/1.1/project-config-1.1.pom
(15 KB at 212.3 KB/sec)
Downloading: http://repo1.maven.org/maven2/org/apache/geronimo/genesis/config/config/1.1/config-1.1.pom
Downloaded: http://repo1.maven.org/maven2/org/apache/geronimo/genesis/config/config/1.1/config-1.1.pom
(670 B at 10.1 KB/sec)
Downloading: http://repo1.maven.org/maven2/org/apache/geronimo/genesis/genesis/1.1/genesis-1.1.pom
Downloaded: http://repo1.maven.org/maven2/org/apache/geronimo/genesis/genesis/1.1/genesis-1.1.pom
(7 KB at 100.2 KB/sec)
Downloading: http://repo1.maven.org/maven2/commons-fileupload/commons-fileupload/1.3.1/commons-fileupload-1.3.1.pom
Downloaded: http://repo1.maven.org/maven2/commons-fileupload/commons-fileupload/1.3.1/commons-fileupload-1.3.1.pom
(10 KB at 150.4 KB/sec)
Downloading: http://repo1.maven.org/maven2/org/apache/commons/commons-parent/32/commons-parent-32.pom
Downloaded: http://repo1.maven.org/maven2/org/apache/commons/commons-parent/32/commons-parent-32.pom
(52 KB at 769.3 KB/sec)
Downloading: http://repo1.maven.org/maven2/commons-io/commons-io/2.2/commons-io-2.2.pom
Downloaded: http://repo1.maven.org/maven2/commons-io/commons-io/2.2/commons-io-2.2.pom (11
KB at 165.8 KB/sec)
Downloading: http://repo1.maven.org/maven2/org/apache/commons/commons-parent/24/commons-parent-24.pom
Downloaded: http://repo1.maven.org/maven2/org/apache/commons/commons-parent/24/commons-parent-24.pom
(47 KB at 710.1 KB/sec)
Downloading: http://repo1.maven.org/maven2/wsdl4j/wsdl4j/1.6.2/wsdl4j-1.6.2.pom
Downloaded: http://repo1.maven.org/maven2/wsdl4j/wsdl4j/1.6.2/wsdl4j-1.6.2.pom (939 B at 14.1
KB/sec)
Downloading: http://repo1.maven.org/maven2/org/apache/ws/xmlschema/xmlschema-core/2.2.1/xmlschema-core-2.2.1.pom
Downloaded: http://repo1.maven.org/maven2/org/apache/ws/xmlschema/xmlschema-core/2.2.1/xmlschema-core-2.2.1.pom
(7 KB at 97.7 KB/sec)
Downloading: http://repo1.maven.org/maven2/org/apache/ws/xmlschema/xmlschema/2.2.1/xmlschema-2.2.1.pom
Downloaded: http://repo1.maven.org/maven2/org/apache/ws/xmlschema/xmlschema/2.2.1/xmlschema-2.2.1.pom
(33 KB at 485.7 KB/sec)
Downloading: http://repo1.maven.org/maven2/org/apache/apache/14/apache-14.pom
Downloaded: http://repo1.maven.org/maven2/org/apache/apache/14/apache-14.pom (15 KB at 220.6
KB/sec)
Downloading: http://repo1.maven.org/maven2/org/apache/neethi/neethi/3.0.3/neethi-3.0.3.pom
Downloaded: http://repo1.maven.org/maven2/org/apache/neethi/neethi/3.0.3/neethi-3.0.3.pom
(13 KB at 194.0 KB/sec)
Downloading: http://repository.apache.org/snapshots/org/apache/woden/woden-core/1.0M11-SNAPSHOT/maven-metadata.xml
Downloaded: http://repository.apache.org/snapshots/org/apache/woden/woden-core/1.0M11-SNAPSHOT/maven-metadata.xml
(2 KB at 4.3 KB/sec)
Downloading: http://repository.apache.org/snapshots/org/apache/woden/woden-core/1.0M11-SNAPSHOT/woden-core-1.0M11-20150912.103838-4.pom
Downloaded: http://repository.apache.org/snapshots/org/apache/woden/woden-core/1.0M11-SNAPSHOT/woden-core-1.0M11-20150912.103838-4.pom
(5 KB at 16.1 KB/sec)
Downloading: http://repository.apache.org/snapshots/org/apache/woden/woden/1.0M11-SNAPSHOT/maven-metadata.xml
Downloaded: http://repository.apache.org/snapshots/org/apache/woden/woden/1.0M11-SNAPSHOT/maven-metadata.xml
(812 B at 1.5 KB/sec)
Downloading: http://repository.apache.org/snapshots/org/apache/woden/woden/1.0M11-SNAPSHOT/woden-1.0M11-20150912.103731-4.pom
Downloaded: http://repository.apache.org/snapshots/org/apache/woden/woden/1.0M11-SNAPSHOT/woden-1.0M11-20150912.103731-4.pom
(12 KB at 29.0 KB/sec)
Downloading: http://repo1.maven.org/maven2/org/apache/ws/ws-parent/1/ws-parent-1.pom
Downloaded: http://repo1.maven.org/maven2/org/apache/ws/ws-parent/1/ws-parent-1.pom (5 KB
at 67.9 KB/sec)
Downloading: http://repo1.maven.org/maven2/org/apache/apache/17/apache-17.pom
Downloaded: http://repo1.maven.org/maven2/org/apache/apache/17/apache-17.pom (16 KB at 241.2
KB/sec)
Downloading: http://repo1.maven.org/maven2/javax/ws/rs/jsr311-api/1.1.1/jsr311-api-1.1.1.pom
Downloaded: http://repo1.maven.org/maven2/javax/ws/rs/jsr311-api/1.1.1/jsr311-api-1.1.1.pom
(6 KB at 83.5 KB/sec)
Downloading: http://repo1.maven.org/maven2/commons-io/commons-io/2.1/commons-io-2.1.pom
Downloaded: http://repo1.maven.org/maven2/commons-io/commons-io/2.1/commons-io-2.1.pom (11
KB at 162.3 KB/sec)
Downloading: http://repo1.maven.org/maven2/org/apache/commons/commons-parent/22/commons-parent-22.pom
Downloaded: http://repo1.maven.org/maven2/org/apache/commons/commons-parent/22/commons-parent-22.pom
(41 KB at 639.6 KB/sec)
Downloading: http://repository.apache.org/snapshots/org/apache/axis2/axis2-kernel/1.7.0-SNAPSHOT/axis2-kernel-1.7.0-20151202.213432-2345.jar
Downloading: http://repository.apache.org/snapshots/org/apache/ws/commons/axiom/axiom-impl/1.2.16-SNAPSHOT/axiom-impl-1.2.16-SNAPSHOT.jar
Downloading: http://repository.apache.org/snapshots/org/apache/woden/woden-core/1.0M11-SNAPSHOT/woden-core-1.0M11-20150912.103838-4.jar
Downloading: http://repository.apache.org/snapshots/org/apache/ws/commons/axiom/axiom-api/1.2.16-SNAPSHOT/axiom-api-1.2.16-SNAPSHOT.jar
Downloaded: http://repository.apache.org/snapshots/org/apache/woden/woden-core/1.0M11-SNAPSHOT/woden-core-1.0M11-20150912.103838-4.jar
(366 KB at 901.8 KB/sec)
Downloaded: http://repository.apache.org/snapshots/org/apache/axis2/axis2-kernel/1.7.0-SNAPSHOT/axis2-kernel-1.7.0-20151202.213432-2345.jar
(1032 KB at 2153.8 KB/sec)
Downloading: http://repo1.maven.org/maven2/org/apache/geronimo/specs/geronimo-ws-metadata_2.0_spec/1.1.2/geronimo-ws-metadata_2.0_spec-1.1.2.jar
Downloading: http://repo1.maven.org/maven2/org/apache/geronimo/specs/geronimo-jta_1.1_spec/1.1/geronimo-jta_1.1_spec-1.1.jar
Downloading: http://repo1.maven.org/maven2/javax/servlet/servlet-api/2.3/servlet-api-2.3.jar
Downloading: http://repo1.maven.org/maven2/commons-fileupload/commons-fileupload/1.3.1/commons-fileupload-1.3.1.jar
Downloading: http://repo1.maven.org/maven2/wsdl4j/wsdl4j/1.6.2/wsdl4j-1.6.2.jar
Downloaded: http://repo1.maven.org/maven2/org/apache/geronimo/specs/geronimo-ws-metadata_2.0_spec/1.1.2/geronimo-ws-metadata_2.0_spec-1.1.2.jar
(15 KB at 219.5 KB/sec)
Downloading: http://repo1.maven.org/maven2/org/apache/ws/xmlschema/xmlschema-core/2.2.1/xmlschema-core-2.2.1.jar
Downloaded: http://repo1.maven.org/maven2/javax/servlet/servlet-api/2.3/servlet-api-2.3.jar
(77 KB at 482.0 KB/sec)
Downloading: http://repo1.maven.org/maven2/org/apache/neethi/neethi/3.0.3/neethi-3.0.3.jar
Downloaded: http://repo1.maven.org/maven2/org/apache/ws/xmlschema/xmlschema-core/2.2.1/xmlschema-core-2.2.1.jar
(168 KB at 1731.5 KB/sec)
Downloading: http://repo1.maven.org/maven2/javax/ws/rs/jsr311-api/1.1.1/jsr311-api-1.1.1.jar
Downloaded: http://repo1.maven.org/maven2/javax/ws/rs/jsr311-api/1.1.1/jsr311-api-1.1.1.jar
(46 KB at 686.1 KB/sec)
Downloading: http://repo1.maven.org/maven2/commons-io/commons-io/2.1/commons-io-2.1.jar
Downloaded: http://repo1.maven.org/maven2/org/apache/geronimo/specs/geronimo-jta_1.1_spec/1.1/geronimo-jta_1.1_spec-1.1.jar
(16 KB at 65.6 KB/sec)
Downloaded: http://repo1.maven.org/maven2/org/apache/neethi/neethi/3.0.3/neethi-3.0.3.jar
(70 KB at 727.2 KB/sec)
Downloaded: http://repo1.maven.org/maven2/commons-fileupload/commons-fileupload/1.3.1/commons-fileupload-1.3.1.jar
(68 KB at 237.3 KB/sec)
Downloaded: http://repo1.maven.org/maven2/commons-io/commons-io/2.1/commons-io-2.1.jar (160
KB at 2343.0 KB/sec)
Downloaded: http://repo1.maven.org/maven2/wsdl4j/wsdl4j/1.6.2/wsdl4j-1.6.2.jar (145 KB at
415.3 KB/sec)
[INFO] ------------------------------------------------------------------------
[INFO] Reactor Summary:
[INFO] 
[INFO] Apache Rampart .................................... SUCCESS [1:10.089s]
[INFO] Rampart - Policy .................................. FAILURE [6.344s]
[INFO] Rampart - Trust ................................... SKIPPED
[INFO] Rampart - Core .................................... SKIPPED
[INFO] Javadoc ........................................... SKIPPED
[INFO] Rampart - Test Suite .............................. SKIPPED
[INFO] Rampart - Mar ..................................... SKIPPED
[INFO] Rampart - Trust-Mar ............................... SKIPPED
[INFO] Rampart - Integration ............................. SKIPPED
[INFO] Rampart - Samples ................................. SKIPPED
[INFO] Rampart - Distribution ............................ SKIPPED
[INFO] ------------------------------------------------------------------------
[INFO] BUILD FAILURE
[INFO] ------------------------------------------------------------------------
[INFO] Total time: 1:21.016s
[INFO] Finished at: Wed Dec 02 22:37:17 UTC 2015
[INFO] Final Memory: 27M/363M
[INFO] ------------------------------------------------------------------------
Waiting for Jenkins to finish collecting data[ERROR] Failed to execute goal on project rampart-policy:
Could not resolve dependencies for project org.apache.rampart:rampart-policy:jar:1.7.0-SNAPSHOT:
The following artifacts could not be resolved: org.apache.ws.commons.axiom:axiom-impl:jar:1.2.16-SNAPSHOT,
org.apache.ws.commons.axiom:axiom-api:jar:1.2.16-SNAPSHOT: Could not find artifact org.apache.ws.commons.axiom:axiom-impl:jar:1.2.16-SNAPSHOT
in Nexus (http://repository.apache.org/snapshots) -> [Help 1]
[ERROR] 
[ERROR] To see the full stack trace of the errors, re-run Maven with the -e switch.
[ERROR] Re-run Maven using the -X switch to enable full debug logging.
[ERROR] 
[ERROR] For more information about the errors and possible solutions, please read the following
articles:
[ERROR] [Help 1] http://cwiki.apache.org/confluence/display/MAVEN/DependencyResolutionException
[ERROR] 
[ERROR] After correcting the problems, you can resume the build with the command
[ERROR]   mvn <goals> -rf :rampart-policy

[JENKINS] Archiving <https://builds.apache.org/job/Rampart/ws/trunk/modules/rampart-trust-mar/pom.xml>
to org.apache.rampart/rahas/1.7.0-SNAPSHOT/rahas-1.7.0-SNAPSHOT.pom
[JENKINS] Archiving <https://builds.apache.org/job/Rampart/ws/trunk/modules/rampart-core/pom.xml>
to org.apache.rampart/rampart-core/1.7.0-SNAPSHOT/rampart-core-1.7.0-SNAPSHOT.pom
[JENKINS] Archiving <https://builds.apache.org/job/Rampart/ws/trunk/modules/rampart-samples/pom.xml>
to org.apache.rampart/rampart-sample/1.7.0-SNAPSHOT/rampart-sample-1.7.0-SNAPSHOT.pom
[JENKINS] Archiving <https://builds.apache.org/job/Rampart/ws/trunk/modules/rampart-trust/pom.xml>
to org.apache.rampart/rampart-trust/1.7.0-SNAPSHOT/rampart-trust-1.7.0-SNAPSHOT.pom
[JENKINS] Archiving <https://builds.apache.org/job/Rampart/ws/trunk/modules/rampart-policy/pom.xml>
to org.apache.rampart/rampart-policy/1.7.0-SNAPSHOT/rampart-policy-1.7.0-SNAPSHOT.pom
[JENKINS] Archiving <https://builds.apache.org/job/Rampart/ws/trunk/modules/rampart-mar/pom.xml>
to org.apache.rampart/rampart/1.7.0-SNAPSHOT/rampart-1.7.0-SNAPSHOT.pom
[JENKINS] Archiving <https://builds.apache.org/job/Rampart/ws/trunk/apidocs/pom.xml>
to org.apache.rampart/apidocs/1.7.0-SNAPSHOT/apidocs-1.7.0-SNAPSHOT.pom
[JENKINS] Archiving <https://builds.apache.org/job/Rampart/ws/trunk/modules/rampart-integration/pom.xml>
to org.apache.rampart/rampart-integration/1.7.0-SNAPSHOT/rampart-integration-1.7.0-SNAPSHOT.pom
[JENKINS] Archiving <https://builds.apache.org/job/Rampart/ws/trunk/pom.xml> to org.apache.rampart/rampart-project/1.7.0-SNAPSHOT/rampart-project-1.7.0-SNAPSHOT.pom
[JENKINS] Archiving <https://builds.apache.org/job/Rampart/ws/trunk/target/rampart-project-1.7.0-SNAPSHOT-site.xml>
to org.apache.rampart/rampart-project/1.7.0-SNAPSHOT/rampart-project-1.7.0-SNAPSHOT-site.xml
[JENKINS] Archiving <https://builds.apache.org/job/Rampart/ws/trunk/modules/distribution/pom.xml>
to org.apache.rampart/rampart-dist/1.7.0-SNAPSHOT/rampart-dist-1.7.0-SNAPSHOT.pom
[JENKINS] Archiving <https://builds.apache.org/job/Rampart/ws/trunk/modules/rampart-tests/pom.xml>
to org.apache.rampart/rampart-tests/1.7.0-SNAPSHOT/rampart-tests-1.7.0-SNAPSHOT.pom
Sending e-mails to: java-dev@axis.apache.org
channel stopped
[locks-and-latches] Releasing all the locks
[locks-and-latches] All the locks released

---------------------------------------------------------------------
To unsubscribe, e-mail: java-dev-unsubscribe@axis.apache.org
For additional commands, e-mail: java-dev-help@axis.apache.org


Mime
View raw message