axis-java-dev mailing list archives

Site index · List index
Message view « Date » · « Thread »
Top « Date » · « Thread »
From "Hudson (JIRA)" <j...@apache.org>
Subject [jira] [Commented] (AXIS2-5307) Build failure with Java 7
Date Sat, 20 Jun 2015 16:57:01 GMT

    [ https://issues.apache.org/jira/browse/AXIS2-5307?page=com.atlassian.jira.plugin.system.issuetabpanels:comment-tabpanel&focusedCommentId=14594691#comment-14594691
] 

Hudson commented on AXIS2-5307:
-------------------------------

SUCCESS: Integrated in Axis2 #2866 (See [https://builds.apache.org/job/Axis2/2866/])
Fix a broken test case introduced by AXIS2-5247. To the author of that test, please repeat
100 times: "A unit test must not depend the side effects of another unit test."

Note that the issue occurs only on Java 7. With this patch, AXIS2-5307 should be completely
fixed. (veithen: rev 1686643)
* /axis/axis2/java/core/trunk/modules/integration/test/org/apache/axis2/rest/RESTfulServiceTest.java


> Build failure with Java 7
> -------------------------
>
>                 Key: AXIS2-5307
>                 URL: https://issues.apache.org/jira/browse/AXIS2-5307
>             Project: Axis2
>          Issue Type: Bug
>    Affects Versions: 1.6.2
>         Environment: Java 7
>            Reporter: Mark
>            Assignee: Andreas Veithen
>            Priority: Minor
>             Fix For: 1.7.0, 1.6.3
>
>
> compile:
>     [mkdir] Created dir: /var/lib/jenkins/workspace/axis2-release-1.6.2-java7/modules/kernel/test-resources/deployment/serviceModule/build/classes
>     [mkdir] Created dir: /var/lib/jenkins/workspace/axis2-release-1.6.2-java7/modules/kernel/test-resources/deployment/serviceModule/build/lib
> jar:
>      [copy] Copying 1 file to /var/lib/jenkins/workspace/axis2-release-1.6.2-java7/modules/kernel/test-resources/deployment/serviceModule/build/classes/META-INF
>     [mkdir] Created dir: /var/lib/jenkins/workspace/axis2-release-1.6.2-java7/modules/kernel/target/test-resources/InvalidDeployment/modules
>       [jar] Building jar: /var/lib/jenkins/workspace/axis2-release-1.6.2-java7/modules/kernel/target/test-resources/InvalidDeployment/modules/serviceModule.jar
>    [delete] Deleting directory /var/lib/jenkins/workspace/axis2-release-1.6.2-java7/modules/kernel/test-resources/deployment/serviceModule/build
> [INFO] Executed tasks
> [INFO] 
> [INFO] --- maven-compiler-plugin:2.3.1:testCompile (default-testCompile) @ axis2-kernel
---
> [INFO] Compiling 108 source files to /var/lib/jenkins/workspace/axis2-release-1.6.2-java7/modules/kernel/target/test-classes
> [INFO] -------------------------------------------------------------
> [ERROR] COMPILATION ERROR : 
> [INFO] -------------------------------------------------------------
> [ERROR] /var/lib/jenkins/workspace/axis2-release-1.6.2-java7/modules/kernel/test/org/apache/axis2/AbstractTestCase.java:[27,22]
error: package junit.framework does not exist
> [ERROR] /var/lib/jenkins/workspace/axis2-release-1.6.2-java7/modules/kernel/test/org/apache/axis2/AbstractTestCase.java:[32,47]
error: cannot find symbol
> [ERROR]  class TestCase
> /var/lib/jenkins/workspace/axis2-release-1.6.2-java7/modules/kernel/test/org/apache/axis2/addressing/AddressingFaultsTest.java:[22,22]
error: package junit.framework does not exist
> [ERROR] /var/lib/jenkins/workspace/axis2-release-1.6.2-java7/modules/kernel/test/org/apache/axis2/addressing/AddressingFaultsTest.java:[23,22]
error: package junit.framework does not exist
> [ERROR] /var/lib/jenkins/workspace/axis2-release-1.6.2-java7/modules/kernel/test/org/apache/axis2/addressing/AddressingFaultsTest.java:[33,42]
error: cannot find symbol
> etc.



--
This message was sent by Atlassian JIRA
(v6.3.4#6332)

---------------------------------------------------------------------
To unsubscribe, e-mail: java-dev-unsubscribe@axis.apache.org
For additional commands, e-mail: java-dev-help@axis.apache.org


Mime
View raw message