axis-java-dev mailing list archives

Site index · List index
Message view « Date » · « Thread »
Top « Date » · « Thread »
From Apache Jenkins Server <jenk...@builds.apache.org>
Subject Build failed in Jenkins: Axis2 » Axis2 quickstart archetype #2746
Date Thu, 30 Apr 2015 07:39:29 GMT
See <https://builds.apache.org/job/Axis2/org.apache.axis2.archetype$quickstart/2746/>

------------------------------------------
[...truncated 165 lines...]
Downloading: http://repo.maven.apache.org/maven2/org/apache/ant/ant-parent/1.8.1/ant-parent-1.8.1.pom
Downloaded: http://repo.maven.apache.org/maven2/org/apache/ant/ant-parent/1.8.1/ant-parent-1.8.1.pom
(5 KB at 77.4 KB/sec)
Downloading: http://repo.maven.apache.org/maven2/org/apache/maven/archetype/archetype-catalog/2.3/archetype-catalog-2.3.jar
Downloading: http://repo.maven.apache.org/maven2/org/apache/maven/archetype/archetype-descriptor/2.3/archetype-descriptor-2.3.jar
Downloading: http://repo.maven.apache.org/maven2/org/apache/maven/archetype/archetype-registry/2.3/archetype-registry-2.3.jar
Downloading: http://repo.maven.apache.org/maven2/org/apache/maven/archetype/archetype-common/2.3/archetype-common-2.3.jar
Downloading: http://repo.maven.apache.org/maven2/net/sourceforge/jchardet/jchardet/1.0/jchardet-1.0.jar
Downloaded: http://repo.maven.apache.org/maven2/org/apache/maven/archetype/archetype-descriptor/2.3/archetype-descriptor-2.3.jar
(23 KB at 396.1 KB/sec)
Downloading: http://repo.maven.apache.org/maven2/dom4j/dom4j/1.6.1/dom4j-1.6.1.jar
Downloaded: http://repo.maven.apache.org/maven2/org/apache/maven/archetype/archetype-catalog/2.3/archetype-catalog-2.3.jar
(19 KB at 176.1 KB/sec)
Downloaded: http://repo.maven.apache.org/maven2/org/apache/maven/archetype/archetype-registry/2.3/archetype-registry-2.3.jar
(17 KB at 157.8 KB/sec)
Downloading: http://repo.maven.apache.org/maven2/jdom/jdom/1.0/jdom-1.0.jar
Downloading: http://repo.maven.apache.org/maven2/org/codehaus/plexus/plexus-interpolation/1.11/plexus-interpolation-1.11.jar
Downloaded: http://repo.maven.apache.org/maven2/net/sourceforge/jchardet/jchardet/1.0/jchardet-1.0.jar
(26 KB at 249.8 KB/sec)
Downloading: http://repo.maven.apache.org/maven2/org/codehaus/plexus/plexus-velocity/1.1.8/plexus-velocity-1.1.8.jar
Downloaded: http://repo.maven.apache.org/maven2/org/codehaus/plexus/plexus-velocity/1.1.8/plexus-velocity-1.1.8.jar
(8 KB at 142.6 KB/sec)
Downloading: http://repo.maven.apache.org/maven2/org/codehaus/plexus/plexus-utils/3.0.21/plexus-utils-3.0.21.jar
Downloaded: http://repo.maven.apache.org/maven2/org/codehaus/plexus/plexus-interpolation/1.11/plexus-interpolation-1.11.jar
(50 KB at 497.4 KB/sec)
Downloading: http://repo.maven.apache.org/maven2/commons-io/commons-io/2.2/commons-io-2.2.jar
Downloaded: http://repo.maven.apache.org/maven2/org/apache/maven/archetype/archetype-common/2.3/archetype-common-2.3.jar
(170 KB at 836.7 KB/sec)
Downloading: http://repo.maven.apache.org/maven2/org/slf4j/slf4j-jdk14/1.5.6/slf4j-jdk14-1.5.6.jar
Downloaded: http://repo.maven.apache.org/maven2/dom4j/dom4j/1.6.1/dom4j-1.6.1.jar (307 KB
at 1771.9 KB/sec)
Downloading: http://repo.maven.apache.org/maven2/org/slf4j/slf4j-api/1.5.6/slf4j-api-1.5.6.jar
Downloaded: http://repo.maven.apache.org/maven2/org/slf4j/slf4j-jdk14/1.5.6/slf4j-jdk14-1.5.6.jar
(9 KB at 165.5 KB/sec)
Downloading: http://repo.maven.apache.org/maven2/org/slf4j/jcl-over-slf4j/1.5.6/jcl-over-slf4j-1.5.6.jar
Downloaded: http://repo.maven.apache.org/maven2/jdom/jdom/1.0/jdom-1.0.jar (150 KB at 865.1
KB/sec)
Downloading: http://repo.maven.apache.org/maven2/org/apache/maven/reporting/maven-reporting-api/2.2.1/maven-reporting-api-2.2.1.jar
Downloaded: http://repo.maven.apache.org/maven2/org/slf4j/slf4j-api/1.5.6/slf4j-api-1.5.6.jar
(22 KB at 411.6 KB/sec)
Downloading: http://repo.maven.apache.org/maven2/org/apache/maven/doxia/doxia-sink-api/1.1/doxia-sink-api-1.1.jar
Downloaded: http://repo.maven.apache.org/maven2/org/slf4j/jcl-over-slf4j/1.5.6/jcl-over-slf4j-1.5.6.jar
(17 KB at 308.1 KB/sec)
Downloading: http://repo.maven.apache.org/maven2/org/apache/maven/doxia/doxia-logging-api/1.1/doxia-logging-api-1.1.jar
Downloaded: http://repo.maven.apache.org/maven2/org/apache/maven/reporting/maven-reporting-api/2.2.1/maven-reporting-api-2.2.1.jar
(10 KB at 177.0 KB/sec)
Downloading: http://repo.maven.apache.org/maven2/org/codehaus/plexus/plexus-interactivity-api/1.0-alpha-6/plexus-interactivity-api-1.0-alpha-6.jar
Downloaded: http://repo.maven.apache.org/maven2/org/apache/maven/doxia/doxia-sink-api/1.1/doxia-sink-api-1.1.jar
(13 KB at 245.4 KB/sec)
Downloading: http://repo.maven.apache.org/maven2/backport-util-concurrent/backport-util-concurrent/3.1/backport-util-concurrent-3.1.jar
Downloaded: http://repo.maven.apache.org/maven2/commons-io/commons-io/2.2/commons-io-2.2.jar
(170 KB at 1137.7 KB/sec)
Downloading: http://repo.maven.apache.org/maven2/org/sonatype/plexus/plexus-sec-dispatcher/1.3/plexus-sec-dispatcher-1.3.jar
Downloaded: http://repo.maven.apache.org/maven2/org/apache/maven/doxia/doxia-logging-api/1.1/doxia-logging-api-1.1.jar
(12 KB at 212.9 KB/sec)
Downloading: http://repo.maven.apache.org/maven2/org/sonatype/plexus/plexus-cipher/1.4/plexus-cipher-1.4.jar
Downloaded: http://repo.maven.apache.org/maven2/org/codehaus/plexus/plexus-interactivity-api/1.0-alpha-6/plexus-interactivity-api-1.0-alpha-6.jar
(12 KB at 217.3 KB/sec)
Downloading: http://repo.maven.apache.org/maven2/org/apache/maven/shared/maven-invoker/2.1.1/maven-invoker-2.1.1.jar
Downloaded: http://repo.maven.apache.org/maven2/org/codehaus/plexus/plexus-utils/3.0.21/plexus-utils-3.0.21.jar
(240 KB at 1043.8 KB/sec)
Downloading: http://repo.maven.apache.org/maven2/commons-collections/commons-collections/3.2.1/commons-collections-3.2.1.jar
Downloaded: http://repo.maven.apache.org/maven2/org/sonatype/plexus/plexus-sec-dispatcher/1.3/plexus-sec-dispatcher-1.3.jar
(28 KB at 526.1 KB/sec)
Downloading: http://repo.maven.apache.org/maven2/org/codehaus/groovy/groovy/1.8.3/groovy-1.8.3.jar
Downloaded: http://repo.maven.apache.org/maven2/org/sonatype/plexus/plexus-cipher/1.4/plexus-cipher-1.4.jar
(14 KB at 253.4 KB/sec)
Downloading: http://repo.maven.apache.org/maven2/asm/asm/3.2/asm-3.2.jar
Downloaded: http://repo.maven.apache.org/maven2/org/apache/maven/shared/maven-invoker/2.1.1/maven-invoker-2.1.1.jar
(30 KB at 547.9 KB/sec)
Downloading: http://repo.maven.apache.org/maven2/asm/asm-commons/3.2/asm-commons-3.2.jar
Downloaded: http://repo.maven.apache.org/maven2/backport-util-concurrent/backport-util-concurrent/3.1/backport-util-concurrent-3.1.jar
(324 KB at 2571.0 KB/sec)
Downloading: http://repo.maven.apache.org/maven2/asm/asm-util/3.2/asm-util-3.2.jar
Downloaded: http://repo.maven.apache.org/maven2/asm/asm/3.2/asm-3.2.jar (43 KB at 799.6 KB/sec)
Downloading: http://repo.maven.apache.org/maven2/asm/asm-analysis/3.2/asm-analysis-3.2.jar
Downloaded: http://repo.maven.apache.org/maven2/asm/asm-commons/3.2/asm-commons-3.2.jar (33
KB at 609.8 KB/sec)
Downloading: http://repo.maven.apache.org/maven2/asm/asm-tree/3.2/asm-tree-3.2.jar
Downloaded: http://repo.maven.apache.org/maven2/asm/asm-util/3.2/asm-util-3.2.jar (36 KB at
661.0 KB/sec)
Downloading: http://repo.maven.apache.org/maven2/org/apache/maven/shared/maven-script-interpreter/1.0/maven-script-interpreter-1.0.jar
Downloaded: http://repo.maven.apache.org/maven2/asm/asm-analysis/3.2/asm-analysis-3.2.jar
(18 KB at 325.2 KB/sec)
Downloading: http://repo.maven.apache.org/maven2/org/apache/ant/ant/1.8.1/ant-1.8.1.jar
Downloaded: http://repo.maven.apache.org/maven2/asm/asm-tree/3.2/asm-tree-3.2.jar (22 KB at
403.1 KB/sec)
Downloaded: http://repo.maven.apache.org/maven2/org/apache/maven/shared/maven-script-interpreter/1.0/maven-script-interpreter-1.0.jar
(21 KB at 375.7 KB/sec)
Downloaded: http://repo.maven.apache.org/maven2/commons-collections/commons-collections/3.2.1/commons-collections-3.2.1.jar
(562 KB at 2741.0 KB/sec)
Downloaded: http://repo.maven.apache.org/maven2/org/apache/ant/ant/1.8.1/ant-1.8.1.jar (1479
KB at 4213.0 KB/sec)
Downloaded: http://repo.maven.apache.org/maven2/org/codehaus/groovy/groovy/1.8.3/groovy-1.8.3.jar
(5394 KB at 6285.6 KB/sec)
[INFO] Building archetype jar: <https://builds.apache.org/job/Axis2/org.apache.axis2.archetype$quickstart/ws/target/quickstart-1.7.0-SNAPSHOT>
[INFO] 
[INFO] --- maven-assembly-plugin:2.2-beta-5:single (source-release-assembly) @ quickstart
---
[INFO] Skipping the assembly in this project because it's not the Execution Root
[INFO] 
[INFO] --- maven-enforcer-plugin:1.1:enforce (default) @ quickstart ---
[WARNING] Failed to getClass for org.apache.maven.plugin.source.SourceJarMojo
[INFO] 
[INFO] --- maven-source-plugin:2.0.4:jar (attach-sources) @ quickstart ---
[INFO] Building jar: <https://builds.apache.org/job/Axis2/org.apache.axis2.archetype$quickstart/ws/target/quickstart-1.7.0-SNAPSHOT-sources.jar>
[INFO] 
[INFO] --- maven-javadoc-plugin:2.5:jar (attach-javadocs) @ quickstart ---
[INFO] Not executing Javadoc as the project is not a Java classpath-capable package
[INFO] 
[INFO] --- maven-archetype-plugin:2.3:integration-test (default-integration-test) @ quickstart
---
[WARNING] No Archetype IT projects: root 'projects' directory not found.
[JENKINS] Recording test results[INFO] 
[INFO] --- maven-gpg-plugin:1.1:sign (default) @ quickstart ---

[INFO] 
[INFO] --- maven-install-plugin:2.2:install (default-install) @ quickstart ---
[INFO] Installing <https://builds.apache.org/job/Axis2/org.apache.axis2.archetype$quickstart/ws/target/quickstart-1.7.0-SNAPSHOT.jar>
to /home/jenkins/jenkins-slave/workspace/Axis2/.repository/org/apache/axis2/archetype/quickstart/1.7.0-SNAPSHOT/quickstart-1.7.0-SNAPSHOT.jar
[INFO] Installing <https://builds.apache.org/job/Axis2/org.apache.axis2.archetype$quickstart/ws/pom.xml>
to /home/jenkins/jenkins-slave/workspace/Axis2/.repository/org/apache/axis2/archetype/quickstart/1.7.0-SNAPSHOT/quickstart-1.7.0-SNAPSHOT.pom
[INFO] Installing <https://builds.apache.org/job/Axis2/org.apache.axis2.archetype$quickstart/ws/target/quickstart-1.7.0-SNAPSHOT-sources.jar>
to /home/jenkins/jenkins-slave/workspace/Axis2/.repository/org/apache/axis2/archetype/quickstart/1.7.0-SNAPSHOT/quickstart-1.7.0-SNAPSHOT-sources.jar
[INFO] 
[INFO] --- maven-archetype-plugin:2.3:update-local-catalog (default-update-local-catalog)
@ quickstart ---
[INFO] 
[INFO] --- maven-deploy-plugin:2.5:deploy (default-deploy) @ quickstart ---
Downloading: https://repository.apache.org/content/repositories/snapshots/org/apache/axis2/archetype/quickstart/1.7.0-SNAPSHOT/maven-metadata.xml
Downloaded: https://repository.apache.org/content/repositories/snapshots/org/apache/axis2/archetype/quickstart/1.7.0-SNAPSHOT/maven-metadata.xml
(1012 B at 0.2 KB/sec)
Uploading: https://repository.apache.org/content/repositories/snapshots/org/apache/axis2/archetype/quickstart/1.7.0-SNAPSHOT/quickstart-1.7.0-20150430.073314-1330.jar
[WARNING] Failed to upload SHA-1 checksum for <https://builds.apache.org/job/Axis2/org.apache.axis2.archetype$quickstart/ws/target/quickstart-1.7.0-SNAPSHOT.jar>:
Failed to transfer file: https://repository.apache.org/content/repositories/snapshots/org/apache/axis2/archetype/quickstart/1.7.0-SNAPSHOT/quickstart-1.7.0-20150430.073314-1330.jar.sha1.
Return code is: 502, ReasonPhrase: Proxy Error.
org.apache.maven.wagon.TransferFailedException: Failed to transfer file: https://repository.apache.org/content/repositories/snapshots/org/apache/axis2/archetype/quickstart/1.7.0-SNAPSHOT/quickstart-1.7.0-20150430.073314-1330.jar.sha1.
Return code is: 502, ReasonPhrase: Proxy Error.
	at org.apache.maven.wagon.shared.http4.AbstractHttpClientWagon.put(AbstractHttpClientWagon.java:626)
	at org.apache.maven.wagon.shared.http4.AbstractHttpClientWagon.put(AbstractHttpClientWagon.java:524)
	at org.apache.maven.wagon.shared.http4.AbstractHttpClientWagon.put(AbstractHttpClientWagon.java:505)
	at org.apache.maven.wagon.shared.http4.AbstractHttpClientWagon.putFromStream(AbstractHttpClientWagon.java:499)
	at org.sonatype.aether.connector.wagon.WagonRepositoryConnector$PutTask.uploadChecksum(WagonRepositoryConnector.java:886)
	at org.sonatype.aether.connector.wagon.WagonRepositoryConnector$PutTask.uploadChecksums(WagonRepositoryConnector.java:861)
	at org.sonatype.aether.connector.wagon.WagonRepositoryConnector$PutTask.run(WagonRepositoryConnector.java:818)
	at org.sonatype.aether.connector.wagon.WagonRepositoryConnector.put(WagonRepositoryConnector.java:467)
	at org.sonatype.aether.impl.internal.DefaultDeployer.deploy(DefaultDeployer.java:274)
	at org.sonatype.aether.impl.internal.DefaultDeployer.deploy(DefaultDeployer.java:211)
	at org.sonatype.aether.impl.internal.DefaultRepositorySystem.deploy(DefaultRepositorySystem.java:443)
	at org.apache.maven.artifact.deployer.DefaultArtifactDeployer.deploy(DefaultArtifactDeployer.java:137)
	at org.apache.maven.plugin.deploy.DeployMojo.execute(DeployMojo.java:156)
	at org.apache.maven.plugin.DefaultBuildPluginManager.executeMojo(DefaultBuildPluginManager.java:101)
	at org.apache.maven.lifecycle.internal.MojoExecutor.execute(MojoExecutor.java:209)
	at org.apache.maven.lifecycle.internal.MojoExecutor.execute(MojoExecutor.java:153)
	at org.apache.maven.lifecycle.internal.MojoExecutor.execute(MojoExecutor.java:145)
	at org.apache.maven.lifecycle.internal.LifecycleModuleBuilder.buildProject(LifecycleModuleBuilder.java:84)
	at org.apache.maven.lifecycle.internal.LifecycleModuleBuilder.buildProject(LifecycleModuleBuilder.java:59)
	at org.apache.maven.lifecycle.internal.LifecycleStarter.singleThreadedBuild(LifecycleStarter.java:183)
	at org.apache.maven.lifecycle.internal.LifecycleStarter.execute(LifecycleStarter.java:161)
	at org.apache.maven.DefaultMaven.doExecute(DefaultMaven.java:320)
	at org.apache.maven.DefaultMaven.execute(DefaultMaven.java:156)
	at org.jvnet.hudson.maven3.launcher.Maven3Launcher.main(Maven3Launcher.java:117)
	at sun.reflect.NativeMethodAccessorImpl.invoke0(Native Method)
	at sun.reflect.NativeMethodAccessorImpl.invoke(NativeMethodAccessorImpl.java:39)
	at sun.reflect.DelegatingMethodAccessorImpl.invoke(DelegatingMethodAccessorImpl.java:25)
	at java.lang.reflect.Method.invoke(Method.java:597)
	at org.codehaus.plexus.classworlds.launcher.Launcher.launchStandard(Launcher.java:329)
	at org.codehaus.plexus.classworlds.launcher.Launcher.launch(Launcher.java:239)
	at org.jvnet.hudson.maven3.agent.Maven3Main.launch(Maven3Main.java:178)
	at sun.reflect.NativeMethodAccessorImpl.invoke0(Native Method)
	at sun.reflect.NativeMethodAccessorImpl.invoke(NativeMethodAccessorImpl.java:39)
	at sun.reflect.DelegatingMethodAccessorImpl.invoke(DelegatingMethodAccessorImpl.java:25)
	at java.lang.reflect.Method.invoke(Method.java:597)
	at hudson.maven.Maven3Builder.call(Maven3Builder.java:136)
	at hudson.maven.Maven3Builder.call(Maven3Builder.java:71)
	at hudson.remoting.UserRequest.perform(UserRequest.java:118)
	at hudson.remoting.UserRequest.perform(UserRequest.java:48)
	at hudson.remoting.Request$2.run(Request.java:328)
	at hudson.remoting.InterceptingExecutorService$1.call(InterceptingExecutorService.java:72)
	at java.util.concurrent.FutureTask$Sync.innerRun(FutureTask.java:303)
	at java.util.concurrent.FutureTask.run(FutureTask.java:138)
	at java.util.concurrent.ThreadPoolExecutor$Worker.runTask(ThreadPoolExecutor.java:895)
	at java.util.concurrent.ThreadPoolExecutor$Worker.run(ThreadPoolExecutor.java:918)
	at java.lang.Thread.run(Thread.java:662)
[WARNING] Failed to upload MD5 checksum for <https://builds.apache.org/job/Axis2/org.apache.axis2.archetype$quickstart/ws/target/quickstart-1.7.0-SNAPSHOT.jar>:
Failed to transfer file: https://repository.apache.org/content/repositories/snapshots/org/apache/axis2/archetype/quickstart/1.7.0-SNAPSHOT/quickstart-1.7.0-20150430.073314-1330.jar.md5.
Return code is: 502, ReasonPhrase: Proxy Error.
org.apache.maven.wagon.TransferFailedException: Failed to transfer file: https://repository.apache.org/content/repositories/snapshots/org/apache/axis2/archetype/quickstart/1.7.0-SNAPSHOT/quickstart-1.7.0-20150430.073314-1330.jar.md5.
Return code is: 502, ReasonPhrase: Proxy Error.
	at org.apache.maven.wagon.shared.http4.AbstractHttpClientWagon.put(AbstractHttpClientWagon.java:626)
	at org.apache.maven.wagon.shared.http4.AbstractHttpClientWagon.put(AbstractHttpClientWagon.java:524)
	at org.apache.maven.wagon.shared.http4.AbstractHttpClientWagon.put(AbstractHttpClientWagon.java:505)
	at org.apache.maven.wagon.shared.http4.AbstractHttpClientWagon.putFromStream(AbstractHttpClientWagon.java:499)
	at org.sonatype.aether.connector.wagon.WagonRepositoryConnector$PutTask.uploadChecksum(WagonRepositoryConnector.java:886)
	at org.sonatype.aether.connector.wagon.WagonRepositoryConnector$PutTask.uploadChecksums(WagonRepositoryConnector.java:861)
	at org.sonatype.aether.connector.wagon.WagonRepositoryConnector$PutTask.run(WagonRepositoryConnector.java:818)
	at org.sonatype.aether.connector.wagon.WagonRepositoryConnector.put(WagonRepositoryConnector.java:467)
	at org.sonatype.aether.impl.internal.DefaultDeployer.deploy(DefaultDeployer.java:274)
	at org.sonatype.aether.impl.internal.DefaultDeployer.deploy(DefaultDeployer.java:211)
	at org.sonatype.aether.impl.internal.DefaultRepositorySystem.deploy(DefaultRepositorySystem.java:443)
	at org.apache.maven.artifact.deployer.DefaultArtifactDeployer.deploy(DefaultArtifactDeployer.java:137)
	at org.apache.maven.plugin.deploy.DeployMojo.execute(DeployMojo.java:156)
	at org.apache.maven.plugin.DefaultBuildPluginManager.executeMojo(DefaultBuildPluginManager.java:101)
	at org.apache.maven.lifecycle.internal.MojoExecutor.execute(MojoExecutor.java:209)
	at org.apache.maven.lifecycle.internal.MojoExecutor.execute(MojoExecutor.java:153)
	at org.apache.maven.lifecycle.internal.MojoExecutor.execute(MojoExecutor.java:145)
	at org.apache.maven.lifecycle.internal.LifecycleModuleBuilder.buildProject(LifecycleModuleBuilder.java:84)
	at org.apache.maven.lifecycle.internal.LifecycleModuleBuilder.buildProject(LifecycleModuleBuilder.java:59)
	at org.apache.maven.lifecycle.internal.LifecycleStarter.singleThreadedBuild(LifecycleStarter.java:183)
	at org.apache.maven.lifecycle.internal.LifecycleStarter.execute(LifecycleStarter.java:161)
	at org.apache.maven.DefaultMaven.doExecute(DefaultMaven.java:320)
	at org.apache.maven.DefaultMaven.execute(DefaultMaven.java:156)
	at org.jvnet.hudson.maven3.launcher.Maven3Launcher.main(Maven3Launcher.java:117)
	at sun.reflect.NativeMethodAccessorImpl.invoke0(Native Method)
	at sun.reflect.NativeMethodAccessorImpl.invoke(NativeMethodAccessorImpl.java:39)
	at sun.reflect.DelegatingMethodAccessorImpl.invoke(DelegatingMethodAccessorImpl.java:25)
	at java.lang.reflect.Method.invoke(Method.java:597)
	at org.codehaus.plexus.classworlds.launcher.Launcher.launchStandard(Launcher.java:329)
	at org.codehaus.plexus.classworlds.launcher.Launcher.launch(Launcher.java:239)
	at org.jvnet.hudson.maven3.agent.Maven3Main.launch(Maven3Main.java:178)
	at sun.reflect.NativeMethodAccessorImpl.invoke0(Native Method)
	at sun.reflect.NativeMethodAccessorImpl.invoke(NativeMethodAccessorImpl.java:39)
	at sun.reflect.DelegatingMethodAccessorImpl.invoke(DelegatingMethodAccessorImpl.java:25)
	at java.lang.reflect.Method.invoke(Method.java:597)
	at hudson.maven.Maven3Builder.call(Maven3Builder.java:136)
	at hudson.maven.Maven3Builder.call(Maven3Builder.java:71)
	at hudson.remoting.UserRequest.perform(UserRequest.java:118)
	at hudson.remoting.UserRequest.perform(UserRequest.java:48)
	at hudson.remoting.Request$2.run(Request.java:328)
	at hudson.remoting.InterceptingExecutorService$1.call(InterceptingExecutorService.java:72)
	at java.util.concurrent.FutureTask$Sync.innerRun(FutureTask.java:303)
	at java.util.concurrent.FutureTask.run(FutureTask.java:138)
	at java.util.concurrent.ThreadPoolExecutor$Worker.runTask(ThreadPoolExecutor.java:895)
	at java.util.concurrent.ThreadPoolExecutor$Worker.run(ThreadPoolExecutor.java:918)
	at java.lang.Thread.run(Thread.java:662)
Uploaded: https://repository.apache.org/content/repositories/snapshots/org/apache/axis2/archetype/quickstart/1.7.0-SNAPSHOT/quickstart-1.7.0-20150430.073314-1330.jar
(9 KB at 0.1 KB/sec)
Uploading: https://repository.apache.org/content/repositories/snapshots/org/apache/axis2/archetype/quickstart/1.7.0-SNAPSHOT/quickstart-1.7.0-20150430.073314-1330.pom
Uploaded: https://repository.apache.org/content/repositories/snapshots/org/apache/axis2/archetype/quickstart/1.7.0-SNAPSHOT/quickstart-1.7.0-20150430.073314-1330.pom
(2 KB at 0.0 KB/sec)
Downloading: https://repository.apache.org/content/repositories/snapshots/org/apache/axis2/archetype/quickstart/maven-metadata.xml
Downloaded: https://repository.apache.org/content/repositories/snapshots/org/apache/axis2/archetype/quickstart/maven-metadata.xml
(370 B at 0.1 KB/sec)
Uploading: https://repository.apache.org/content/repositories/snapshots/org/apache/axis2/archetype/quickstart/1.7.0-SNAPSHOT/maven-metadata.xml
Uploaded: https://repository.apache.org/content/repositories/snapshots/org/apache/axis2/archetype/quickstart/1.7.0-SNAPSHOT/maven-metadata.xml
(1012 B at 0.2 KB/sec)
Uploading: https://repository.apache.org/content/repositories/snapshots/org/apache/axis2/archetype/quickstart/maven-metadata.xml
[WARNING] Failed to upload MD5 checksum for /home/jenkins/jenkins-slave/workspace/Axis2/.repository/org/apache/axis2/archetype/quickstart/maven-metadata-apache.snapshots.https.xml:
Failed to transfer file: https://repository.apache.org/content/repositories/snapshots/org/apache/axis2/archetype/quickstart/maven-metadata.xml.md5.
Return code is: 502, ReasonPhrase: Proxy Error.
org.apache.maven.wagon.TransferFailedException: Failed to transfer file: https://repository.apache.org/content/repositories/snapshots/org/apache/axis2/archetype/quickstart/maven-metadata.xml.md5.
Return code is: 502, ReasonPhrase: Proxy Error.
	at org.apache.maven.wagon.shared.http4.AbstractHttpClientWagon.put(AbstractHttpClientWagon.java:626)
	at org.apache.maven.wagon.shared.http4.AbstractHttpClientWagon.put(AbstractHttpClientWagon.java:524)
	at org.apache.maven.wagon.shared.http4.AbstractHttpClientWagon.put(AbstractHttpClientWagon.java:505)
	at org.apache.maven.wagon.shared.http4.AbstractHttpClientWagon.putFromStream(AbstractHttpClientWagon.java:499)
	at org.sonatype.aether.connector.wagon.WagonRepositoryConnector$PutTask.uploadChecksum(WagonRepositoryConnector.java:886)
	at org.sonatype.aether.connector.wagon.WagonRepositoryConnector$PutTask.uploadChecksums(WagonRepositoryConnector.java:861)
	at org.sonatype.aether.connector.wagon.WagonRepositoryConnector$PutTask.run(WagonRepositoryConnector.java:818)
	at org.sonatype.aether.connector.wagon.WagonRepositoryConnector.put(WagonRepositoryConnector.java:475)
	at org.sonatype.aether.impl.internal.DefaultDeployer.deploy(DefaultDeployer.java:305)
	at org.sonatype.aether.impl.internal.DefaultDeployer.deploy(DefaultDeployer.java:211)
	at org.sonatype.aether.impl.internal.DefaultRepositorySystem.deploy(DefaultRepositorySystem.java:443)
	at org.apache.maven.artifact.deployer.DefaultArtifactDeployer.deploy(DefaultArtifactDeployer.java:137)
	at org.apache.maven.plugin.deploy.DeployMojo.execute(DeployMojo.java:156)
	at org.apache.maven.plugin.DefaultBuildPluginManager.executeMojo(DefaultBuildPluginManager.java:101)
	at org.apache.maven.lifecycle.internal.MojoExecutor.execute(MojoExecutor.java:209)
	at org.apache.maven.lifecycle.internal.MojoExecutor.execute(MojoExecutor.java:153)
	at org.apache.maven.lifecycle.internal.MojoExecutor.execute(MojoExecutor.java:145)
	at org.apache.maven.lifecycle.internal.LifecycleModuleBuilder.buildProject(LifecycleModuleBuilder.java:84)
	at org.apache.maven.lifecycle.internal.LifecycleModuleBuilder.buildProject(LifecycleModuleBuilder.java:59)
	at org.apache.maven.lifecycle.internal.LifecycleStarter.singleThreadedBuild(LifecycleStarter.java:183)
	at org.apache.maven.lifecycle.internal.LifecycleStarter.execute(LifecycleStarter.java:161)
	at org.apache.maven.DefaultMaven.doExecute(DefaultMaven.java:320)
	at org.apache.maven.DefaultMaven.execute(DefaultMaven.java:156)
	at org.jvnet.hudson.maven3.launcher.Maven3Launcher.main(Maven3Launcher.java:117)
	at sun.reflect.NativeMethodAccessorImpl.invoke0(Native Method)
	at sun.reflect.NativeMethodAccessorImpl.invoke(NativeMethodAccessorImpl.java:39)
	at sun.reflect.DelegatingMethodAccessorImpl.invoke(DelegatingMethodAccessorImpl.java:25)
	at java.lang.reflect.Method.invoke(Method.java:597)
	at org.codehaus.plexus.classworlds.launcher.Launcher.launchStandard(Launcher.java:329)
	at org.codehaus.plexus.classworlds.launcher.Launcher.launch(Launcher.java:239)
	at org.jvnet.hudson.maven3.agent.Maven3Main.launch(Maven3Main.java:178)
	at sun.reflect.NativeMethodAccessorImpl.invoke0(Native Method)
	at sun.reflect.NativeMethodAccessorImpl.invoke(NativeMethodAccessorImpl.java:39)
	at sun.reflect.DelegatingMethodAccessorImpl.invoke(DelegatingMethodAccessorImpl.java:25)
	at java.lang.reflect.Method.invoke(Method.java:597)
	at hudson.maven.Maven3Builder.call(Maven3Builder.java:136)
	at hudson.maven.Maven3Builder.call(Maven3Builder.java:71)
	at hudson.remoting.UserRequest.perform(UserRequest.java:118)
	at hudson.remoting.UserRequest.perform(UserRequest.java:48)
	at hudson.remoting.Request$2.run(Request.java:328)
	at hudson.remoting.InterceptingExecutorService$1.call(InterceptingExecutorService.java:72)
	at java.util.concurrent.FutureTask$Sync.innerRun(FutureTask.java:303)
	at java.util.concurrent.FutureTask.run(FutureTask.java:138)
	at java.util.concurrent.ThreadPoolExecutor$Worker.runTask(ThreadPoolExecutor.java:895)
	at java.util.concurrent.ThreadPoolExecutor$Worker.run(ThreadPoolExecutor.java:918)
	at java.lang.Thread.run(Thread.java:662)
Uploaded: https://repository.apache.org/content/repositories/snapshots/org/apache/axis2/archetype/quickstart/maven-metadata.xml
(370 B at 0.0 KB/sec)
Uploading: https://repository.apache.org/content/repositories/snapshots/org/apache/axis2/archetype/quickstart/1.7.0-SNAPSHOT/quickstart-1.7.0-20150430.073314-1330-sources.jar

---------------------------------------------------------------------
To unsubscribe, e-mail: java-dev-unsubscribe@axis.apache.org
For additional commands, e-mail: java-dev-help@axis.apache.org


Mime
View raw message