axis-java-dev mailing list archives

Site index · List index
Message view « Date » · « Thread »
Top « Date » · « Thread »
From Apache Jenkins Server <jenk...@builds.apache.org>
Subject Build failed in Jenkins: Rampart #1697
Date Tue, 15 Jul 2014 20:33:19 GMT
See <https://builds.apache.org/job/Rampart/1697/changes>

Changes:

[veithen] RAMPART-415: Applied Detelin Yordanov's patch to update Bouncy Castle to 1.49.

------------------------------------------
[...truncated 3921 lines...]
Downloaded: http://repo1.maven.org/maven2/org/apache/maven/shared/maven-shared-io/1.0/maven-shared-io-1.0.pom
(3 KB at 59.2 KB/sec)
Downloading: http://repo1.maven.org/maven2/org/apache/maven/shared/maven-filtering/1.0/maven-filtering-1.0.pom
Downloaded: http://repo1.maven.org/maven2/org/apache/maven/shared/maven-filtering/1.0/maven-filtering-1.0.pom
(6 KB at 112.6 KB/sec)
Downloading: http://repo1.maven.org/maven2/org/apache/maven/maven-archiver/2.4.1/maven-archiver-2.4.1.pom
Downloaded: http://repo1.maven.org/maven2/org/apache/maven/maven-archiver/2.4.1/maven-archiver-2.4.1.pom
(4 KB at 77.2 KB/sec)
Downloading: http://repo1.maven.org/maven2/org/apache/maven/shared/maven-repository-builder/1.0-alpha-2/maven-repository-builder-1.0-alpha-2.pom
Downloaded: http://repo1.maven.org/maven2/org/apache/maven/shared/maven-repository-builder/1.0-alpha-2/maven-repository-builder-1.0-alpha-2.pom
(4 KB at 63.1 KB/sec)
Downloading: http://repo1.maven.org/maven2/org/apache/maven/maven-artifact/2.0.4/maven-artifact-2.0.4.pom
Downloaded: http://repo1.maven.org/maven2/org/apache/maven/maven-artifact/2.0.4/maven-artifact-2.0.4.pom
(765 B at 14.9 KB/sec)
Downloading: http://repo1.maven.org/maven2/org/apache/maven/maven-artifact-manager/2.0.4/maven-artifact-manager-2.0.4.pom
Downloaded: http://repo1.maven.org/maven2/org/apache/maven/maven-artifact-manager/2.0.4/maven-artifact-manager-2.0.4.pom
(2 KB at 27.1 KB/sec)
Downloading: http://repo1.maven.org/maven2/org/apache/maven/maven-repository-metadata/2.0.4/maven-repository-metadata-2.0.4.pom
Downloaded: http://repo1.maven.org/maven2/org/apache/maven/maven-repository-metadata/2.0.4/maven-repository-metadata-2.0.4.pom
(2 KB at 29.6 KB/sec)
Downloading: http://repo1.maven.org/maven2/org/apache/maven/maven-project/2.0.4/maven-project-2.0.4.pom
Downloaded: http://repo1.maven.org/maven2/org/apache/maven/maven-project/2.0.4/maven-project-2.0.4.pom
(2 KB at 36.0 KB/sec)
Downloading: http://repo1.maven.org/maven2/org/apache/maven/maven-settings/2.0.4/maven-settings-2.0.4.pom
Downloaded: http://repo1.maven.org/maven2/org/apache/maven/maven-settings/2.0.4/maven-settings-2.0.4.pom
(2 KB at 31.8 KB/sec)
Downloading: http://repo1.maven.org/maven2/org/apache/maven/maven-model/2.0.4/maven-model-2.0.4.pom
Downloaded: http://repo1.maven.org/maven2/org/apache/maven/maven-model/2.0.4/maven-model-2.0.4.pom
(3 KB at 52.9 KB/sec)
Downloading: http://repo1.maven.org/maven2/org/apache/maven/maven-profile/2.0.4/maven-profile-2.0.4.pom
Downloaded: http://repo1.maven.org/maven2/org/apache/maven/maven-profile/2.0.4/maven-profile-2.0.4.pom
(2 KB at 32.2 KB/sec)
Downloading: http://repo1.maven.org/maven2/org/apache/maven/shared/maven-common-artifact-filters/1.0-alpha-1/maven-common-artifact-filters-1.0-alpha-1.pom
Downloaded: http://repo1.maven.org/maven2/org/apache/maven/shared/maven-common-artifact-filters/1.0-alpha-1/maven-common-artifact-filters-1.0-alpha-1.pom
(2 KB at 35.2 KB/sec)
Downloading: http://repo1.maven.org/maven2/org/apache/maven/shared/maven-shared-components/6/maven-shared-components-6.pom
Downloaded: http://repo1.maven.org/maven2/org/apache/maven/shared/maven-shared-components/6/maven-shared-components-6.pom
(4 KB at 60.7 KB/sec)
Downloading: http://repo1.maven.org/maven2/org/slf4j/slf4j-jdk14/1.5.6/slf4j-jdk14-1.5.6.jar
Downloading: http://repo1.maven.org/maven2/org/slf4j/slf4j-api/1.5.6/slf4j-api-1.5.6.jar
Downloading: http://repo1.maven.org/maven2/org/slf4j/jcl-over-slf4j/1.5.6/jcl-over-slf4j-1.5.6.jar
Downloading: http://repo1.maven.org/maven2/org/apache/maven/reporting/maven-reporting-api/2.2.1/maven-reporting-api-2.2.1.jar
Downloading: http://repo1.maven.org/maven2/org/codehaus/plexus/plexus-archiver/1.1/plexus-archiver-1.1.jar
Downloaded: http://repo1.maven.org/maven2/org/slf4j/slf4j-jdk14/1.5.6/slf4j-jdk14-1.5.6.jar
(9 KB at 172.2 KB/sec)
Downloading: http://repo1.maven.org/maven2/org/apache/maven/shared/file-management/1.1/file-management-1.1.jar
Downloaded: http://repo1.maven.org/maven2/org/apache/maven/reporting/maven-reporting-api/2.2.1/maven-reporting-api-2.2.1.jar
(10 KB at 125.8 KB/sec)
Downloading: http://repo1.maven.org/maven2/org/apache/maven/shared/maven-filtering/1.0/maven-filtering-1.0.jar
Downloaded: http://repo1.maven.org/maven2/org/slf4j/jcl-over-slf4j/1.5.6/jcl-over-slf4j-1.5.6.jar
(17 KB at 165.0 KB/sec)
Downloaded: http://repo1.maven.org/maven2/org/apache/maven/shared/file-management/1.1/file-management-1.1.jar
(31 KB at 608.8 KB/sec)
Downloading: http://repo1.maven.org/maven2/org/codehaus/plexus/plexus-io/1.0.1/plexus-io-1.0.1.jar
Downloading: http://repo1.maven.org/maven2/org/apache/maven/maven-archiver/2.4.1/maven-archiver-2.4.1.jar
Downloaded: http://repo1.maven.org/maven2/org/slf4j/slf4j-api/1.5.6/slf4j-api-1.5.6.jar (22
KB at 155.8 KB/sec)
Downloading: http://repo1.maven.org/maven2/org/apache/maven/shared/maven-repository-builder/1.0-alpha-2/maven-repository-builder-1.0-alpha-2.jar
Downloaded: http://repo1.maven.org/maven2/org/codehaus/plexus/plexus-io/1.0.1/plexus-io-1.0.1.jar
(50 KB at 741.4 KB/sec)
Downloaded: http://repo1.maven.org/maven2/org/apache/maven/shared/maven-filtering/1.0/maven-filtering-1.0.jar
(42 KB at 415.2 KB/sec)
Downloaded: http://repo1.maven.org/maven2/org/apache/maven/maven-archiver/2.4.1/maven-archiver-2.4.1.jar
(20 KB at 190.5 KB/sec)
Downloaded: http://repo1.maven.org/maven2/org/apache/maven/shared/maven-repository-builder/1.0-alpha-2/maven-repository-builder-1.0-alpha-2.jar
(23 KB at 289.9 KB/sec)
Downloaded: http://repo1.maven.org/maven2/org/codehaus/plexus/plexus-archiver/1.1/plexus-archiver-1.1.jar
(178 KB at 792.9 KB/sec)
[INFO] Reading assembly descriptor: bin.xml
[INFO] Reading assembly descriptor: src.xml
[WARNING] Cannot include project artifact: org.apache.rampart:rampart-dist:pom:1.7.0-SNAPSHOT;
it doesn't have an associated file or directory.
[WARNING] Cannot include project artifact: org.apache.rampart:rampart-dist:pom:1.7.0-SNAPSHOT;
it doesn't have an associated file or directory.
[WARNING] The following patterns were never triggered in this artifact inclusion filter:
o  'org.apache.xerces:xercesImpl:jar'
o  'org.apache.xerces:resolver:jar'
o  'org.apache.xerces:serializer:jar'

[INFO] Building zip: <https://builds.apache.org/job/Rampart/ws/trunk/modules/distribution/target/rampart-dist-1.7.0-SNAPSHOT-bin.zip>
[INFO] Building zip: <https://builds.apache.org/job/Rampart/ws/trunk/modules/distribution/target/rampart-dist-1.7.0-SNAPSHOT-src.zip>
[INFO] 
[INFO] --- maven-install-plugin:2.3.1:install (default-install) @ rampart-dist ---
[INFO] Installing <https://builds.apache.org/job/Rampart/ws/trunk/modules/distribution/pom.xml>
to <https://builds.apache.org/job/Rampart/ws/.repository/org/apache/rampart/rampart-dist/1.7.0-SNAPSHOT/rampart-dist-1.7.0-SNAPSHOT.pom>
[INFO] Installing <https://builds.apache.org/job/Rampart/ws/trunk/modules/distribution/target/rampart-dist-1.7.0-SNAPSHOT-bin.zip>
to <https://builds.apache.org/job/Rampart/ws/.repository/org/apache/rampart/rampart-dist/1.7.0-SNAPSHOT/rampart-dist-1.7.0-SNAPSHOT-bin.zip>
[INFO] Installing <https://builds.apache.org/job/Rampart/ws/trunk/modules/distribution/target/rampart-dist-1.7.0-SNAPSHOT-src.zip>
to <https://builds.apache.org/job/Rampart/ws/.repository/org/apache/rampart/rampart-dist/1.7.0-SNAPSHOT/rampart-dist-1.7.0-SNAPSHOT-src.zip>
[INFO] ------------------------------------------------------------------------
[INFO] Reactor Summary:
[INFO] 
[INFO] Apache Rampart .................................... SUCCESS [1:36.593s]
[INFO] Rampart - Policy .................................. SUCCESS [20.514s]
[INFO] Rampart - Trust ................................... SUCCESS [29.132s]
[INFO] Rampart - Core .................................... SUCCESS [11.497s]
[INFO] Javadoc ........................................... SUCCESS [2.832s]
[INFO] Rampart - Test Suite .............................. SUCCESS [16.917s]
[INFO] Rampart - Mar ..................................... SUCCESS [6.587s]
[INFO] Rampart - Trust-Mar ............................... SUCCESS [6.251s]
[INFO] Rampart - Integration ............................. SUCCESS [1:50.836s]
[INFO] Rampart - Samples ................................. SUCCESS [8.384s]
[INFO] Rampart - Distribution ............................ SUCCESS [11.225s]
[INFO] ------------------------------------------------------------------------
[INFO] BUILD SUCCESS
[INFO] ------------------------------------------------------------------------
[INFO] Total time: 5:37.746s
[INFO] Finished at: Tue Jul 15 20:33:08 UTC 2014
[INFO] Final Memory: 84M/228M
[INFO] ------------------------------------------------------------------------
Waiting for Jenkins to finish collecting data
[JENKINS] Archiving <https://builds.apache.org/job/Rampart/ws/trunk/modules/rampart-trust-mar/pom.xml>
to org.apache.rampart/rahas/1.7.0-SNAPSHOT/rahas-1.7.0-SNAPSHOT.pom
[JENKINS] Archiving <https://builds.apache.org/job/Rampart/ws/trunk/modules/rampart-trust-mar/target/rahas-1.7.0-SNAPSHOT.mar>
to org.apache.rampart/rahas/1.7.0-SNAPSHOT/rahas-1.7.0-SNAPSHOT.mar
[JENKINS] Archiving <https://builds.apache.org/job/Rampart/ws/trunk/modules/rampart-trust-mar/target/jacoco.exec>
to org.apache.rampart/rahas/1.7.0-SNAPSHOT/rahas-1.7.0-SNAPSHOT-jacoco.exec
[JENKINS] Archiving <https://builds.apache.org/job/Rampart/ws/trunk/modules/rampart-trust-mar/target/rahas-1.7.0-SNAPSHOT-sources.jar>
to org.apache.rampart/rahas/1.7.0-SNAPSHOT/rahas-1.7.0-SNAPSHOT-sources.jar
Sending artifact delta relative to Rampart ? Rampart - Trust-Mar #1696
Archived 4 artifacts
Archive block size is 32768
Received 0 blocks and 22990 bytes
Compression is 0.0%
Took 0.1 sec
[JENKINS] Archiving <https://builds.apache.org/job/Rampart/ws/trunk/modules/rampart-core/pom.xml>
to org.apache.rampart/rampart-core/1.7.0-SNAPSHOT/rampart-core-1.7.0-SNAPSHOT.pom
[JENKINS] Archiving <https://builds.apache.org/job/Rampart/ws/trunk/modules/rampart-core/target/rampart-core-1.7.0-SNAPSHOT.jar>
to org.apache.rampart/rampart-core/1.7.0-SNAPSHOT/rampart-core-1.7.0-SNAPSHOT.jar
[JENKINS] Archiving <https://builds.apache.org/job/Rampart/ws/trunk/modules/rampart-core/target/jacoco.exec>
to org.apache.rampart/rampart-core/1.7.0-SNAPSHOT/rampart-core-1.7.0-SNAPSHOT-jacoco.exec
[JENKINS] Archiving <https://builds.apache.org/job/Rampart/ws/trunk/modules/rampart-core/target/rampart-core-1.7.0-SNAPSHOT-sources.jar>
to org.apache.rampart/rampart-core/1.7.0-SNAPSHOT/rampart-core-1.7.0-SNAPSHOT-sources.jar
Sending artifact delta relative to Rampart ? Rampart - Core #1696
Archived 4 artifacts
Archive block size is 32768
Received 0 blocks and 309171 bytes
Compression is 0.0%
Took 0.35 sec
[JENKINS] Archiving <https://builds.apache.org/job/Rampart/ws/trunk/modules/rampart-samples/pom.xml>
to org.apache.rampart/rampart-sample/1.7.0-SNAPSHOT/rampart-sample-1.7.0-SNAPSHOT.pom
[JENKINS] Archiving <https://builds.apache.org/job/Rampart/ws/trunk/modules/rampart-samples/target/rampart-sample-1.7.0-SNAPSHOT.jar>
to org.apache.rampart/rampart-sample/1.7.0-SNAPSHOT/rampart-sample-1.7.0-SNAPSHOT.jar
[JENKINS] Archiving <https://builds.apache.org/job/Rampart/ws/trunk/modules/rampart-samples/target/jacoco.exec>
to org.apache.rampart/rampart-sample/1.7.0-SNAPSHOT/rampart-sample-1.7.0-SNAPSHOT-jacoco.exec
[JENKINS] Archiving <https://builds.apache.org/job/Rampart/ws/trunk/modules/rampart-samples/target/rampart-sample-1.7.0-SNAPSHOT-sources.jar>
to org.apache.rampart/rampart-sample/1.7.0-SNAPSHOT/rampart-sample-1.7.0-SNAPSHOT-sources.jar
Sending artifact delta relative to Rampart ? Rampart - Samples #1696
Archived 4 artifacts
Archive block size is 32768
Received 0 blocks and 87632 bytes
Compression is 0.0%
Took 0.18 sec
[JENKINS] Archiving <https://builds.apache.org/job/Rampart/ws/trunk/modules/rampart-trust/pom.xml>
to org.apache.rampart/rampart-trust/1.7.0-SNAPSHOT/rampart-trust-1.7.0-SNAPSHOT.pom
[JENKINS] Archiving <https://builds.apache.org/job/Rampart/ws/trunk/modules/rampart-trust/target/rampart-trust-1.7.0-SNAPSHOT.jar>
to org.apache.rampart/rampart-trust/1.7.0-SNAPSHOT/rampart-trust-1.7.0-SNAPSHOT.jar
[JENKINS] Archiving <https://builds.apache.org/job/Rampart/ws/trunk/modules/rampart-trust/target/jacoco.exec>
to org.apache.rampart/rampart-trust/1.7.0-SNAPSHOT/rampart-trust-1.7.0-SNAPSHOT-jacoco.exec
[JENKINS] Archiving <https://builds.apache.org/job/Rampart/ws/trunk/modules/rampart-trust/target/rampart-trust-1.7.0-SNAPSHOT-sources.jar>
to org.apache.rampart/rampart-trust/1.7.0-SNAPSHOT/rampart-trust-1.7.0-SNAPSHOT-sources.jar
Sending artifact delta relative to Rampart ? Rampart - Trust #1696
Archived 4 artifacts
Archive block size is 32768
Received 0 blocks and 392868 bytes
Compression is 0.0%
Took 1.9 sec
[JENKINS] Archiving <https://builds.apache.org/job/Rampart/ws/trunk/modules/rampart-policy/pom.xml>
to org.apache.rampart/rampart-policy/1.7.0-SNAPSHOT/rampart-policy-1.7.0-SNAPSHOT.pom
[JENKINS] Archiving <https://builds.apache.org/job/Rampart/ws/trunk/modules/rampart-policy/target/rampart-policy-1.7.0-SNAPSHOT.jar>
to org.apache.rampart/rampart-policy/1.7.0-SNAPSHOT/rampart-policy-1.7.0-SNAPSHOT.jar
[JENKINS] Archiving <https://builds.apache.org/job/Rampart/ws/trunk/modules/rampart-policy/target/jacoco.exec>
to org.apache.rampart/rampart-policy/1.7.0-SNAPSHOT/rampart-policy-1.7.0-SNAPSHOT-jacoco.exec
[JENKINS] Archiving <https://builds.apache.org/job/Rampart/ws/trunk/modules/rampart-policy/target/rampart-policy-1.7.0-SNAPSHOT-sources.jar>
to org.apache.rampart/rampart-policy/1.7.0-SNAPSHOT/rampart-policy-1.7.0-SNAPSHOT-sources.jar
Sending artifact delta relative to Rampart ? Rampart - Policy #1696
Archived 4 artifacts
Archive block size is 32768
Received 0 blocks and 311370 bytes
Compression is 0.0%
Took 0.27 sec
[JENKINS] Archiving <https://builds.apache.org/job/Rampart/ws/trunk/modules/rampart-mar/pom.xml>
to org.apache.rampart/rampart/1.7.0-SNAPSHOT/rampart-1.7.0-SNAPSHOT.pom
[JENKINS] Archiving <https://builds.apache.org/job/Rampart/ws/trunk/modules/rampart-mar/target/rampart-1.7.0-SNAPSHOT.mar>
to org.apache.rampart/rampart/1.7.0-SNAPSHOT/rampart-1.7.0-SNAPSHOT.mar
[JENKINS] Archiving <https://builds.apache.org/job/Rampart/ws/trunk/modules/rampart-mar/target/jacoco.exec>
to org.apache.rampart/rampart/1.7.0-SNAPSHOT/rampart-1.7.0-SNAPSHOT-jacoco.exec
[JENKINS] Archiving <https://builds.apache.org/job/Rampart/ws/trunk/modules/rampart-mar/target/rampart-1.7.0-SNAPSHOT.mar>
to org.apache.rampart/rampart/1.7.0-SNAPSHOT/rampart-1.7.0-SNAPSHOT.jar
[JENKINS] Archiving <https://builds.apache.org/job/Rampart/ws/trunk/modules/rampart-mar/target/rampart-1.7.0-SNAPSHOT-sources.jar>
to org.apache.rampart/rampart/1.7.0-SNAPSHOT/rampart-1.7.0-SNAPSHOT-sources.jar
Sending artifact delta relative to Rampart ? Rampart - Mar #1696
Archived 5 artifacts
Archive block size is 32768
Received 0 blocks and 33273 bytes
Compression is 0.0%
Took 0.27 sec
[JENKINS] Archiving <https://builds.apache.org/job/Rampart/ws/trunk/apidocs/pom.xml>
to org.apache.rampart/apidocs/1.7.0-SNAPSHOT/apidocs-1.7.0-SNAPSHOT.pom
Sending artifact delta relative to Rampart ? Javadoc #1696
Archived 1 artifacts
Archive block size is 32768
Received 0 blocks and 5257 bytes
Compression is 0.0%
Took 0.17 sec
[JENKINS] Archiving <https://builds.apache.org/job/Rampart/ws/trunk/modules/rampart-integration/pom.xml>
to org.apache.rampart/rampart-integration/1.7.0-SNAPSHOT/rampart-integration-1.7.0-SNAPSHOT.pom
[JENKINS] Archiving <https://builds.apache.org/job/Rampart/ws/trunk/modules/rampart-integration/target/rampart-integration-1.7.0-SNAPSHOT.jar>
to org.apache.rampart/rampart-integration/1.7.0-SNAPSHOT/rampart-integration-1.7.0-SNAPSHOT.jar
[JENKINS] Archiving <https://builds.apache.org/job/Rampart/ws/trunk/modules/rampart-integration/target/jacoco.exec>
to org.apache.rampart/rampart-integration/1.7.0-SNAPSHOT/rampart-integration-1.7.0-SNAPSHOT-jacoco.exec
[JENKINS] Archiving <https://builds.apache.org/job/Rampart/ws/trunk/modules/rampart-integration/target/rampart-integration-1.7.0-SNAPSHOT-sources.jar>
to org.apache.rampart/rampart-integration/1.7.0-SNAPSHOT/rampart-integration-1.7.0-SNAPSHOT-sources.jar
Sending artifact delta relative to Rampart ? Rampart - Integration #1696
Archived 4 artifacts
Archive block size is 32768
Received 0 blocks and 285630 bytes
Compression is 0.0%
Took 0.32 sec
[JENKINS] Archiving <https://builds.apache.org/job/Rampart/ws/trunk/pom.xml> to org.apache.rampart/rampart-project/1.7.0-SNAPSHOT/rampart-project-1.7.0-SNAPSHOT.pom
[JENKINS] Archiving <https://builds.apache.org/job/Rampart/ws/trunk/target/rampart-project-1.7.0-SNAPSHOT-site.xml>
to org.apache.rampart/rampart-project/1.7.0-SNAPSHOT/rampart-project-1.7.0-SNAPSHOT-site.xml
Sending artifact delta relative to Rampart ? Apache Rampart #1696
Archived 2 artifacts
Archive block size is 32768
Received 0 blocks and 25650 bytes
Compression is 0.0%
Took 0.11 sec
[JENKINS] Archiving <https://builds.apache.org/job/Rampart/ws/trunk/modules/distribution/pom.xml>
to org.apache.rampart/rampart-dist/1.7.0-SNAPSHOT/rampart-dist-1.7.0-SNAPSHOT.pom
[JENKINS] Archiving <https://builds.apache.org/job/Rampart/ws/trunk/modules/distribution/target/rampart-dist-1.7.0-SNAPSHOT-bin.zip>
to org.apache.rampart/rampart-dist/1.7.0-SNAPSHOT/rampart-dist-1.7.0-SNAPSHOT-bin.zip
[JENKINS] Archiving <https://builds.apache.org/job/Rampart/ws/trunk/modules/distribution/target/rampart-dist-1.7.0-SNAPSHOT-src.zip>
to org.apache.rampart/rampart-dist/1.7.0-SNAPSHOT/rampart-dist-1.7.0-SNAPSHOT-src.zip
Sending artifact delta relative to Rampart ? Rampart - Distribution #1696
Archived 3 artifacts
Archive block size is 32768
Received 140 blocks and 4496989 bytes
Compression is 50.5%
Took 3 sec
[JENKINS] Archiving <https://builds.apache.org/job/Rampart/ws/trunk/modules/rampart-tests/pom.xml>
to org.apache.rampart/rampart-tests/1.7.0-SNAPSHOT/rampart-tests-1.7.0-SNAPSHOT.pom
[JENKINS] Archiving <https://builds.apache.org/job/Rampart/ws/trunk/modules/rampart-tests/target/rampart-tests-1.7.0-SNAPSHOT.jar>
to org.apache.rampart/rampart-tests/1.7.0-SNAPSHOT/rampart-tests-1.7.0-SNAPSHOT.jar
[JENKINS] Archiving <https://builds.apache.org/job/Rampart/ws/trunk/modules/rampart-tests/target/jacoco.exec>
to org.apache.rampart/rampart-tests/1.7.0-SNAPSHOT/rampart-tests-1.7.0-SNAPSHOT-jacoco.exec
[JENKINS] Archiving <https://builds.apache.org/job/Rampart/ws/trunk/modules/rampart-tests/target/rampart-tests-1.7.0-SNAPSHOT-sources.jar>
to org.apache.rampart/rampart-tests/1.7.0-SNAPSHOT/rampart-tests-1.7.0-SNAPSHOT-sources.jar
Sending artifact delta relative to Rampart ? Rampart - Test Suite #1696
Archived 4 artifacts
Archive block size is 32768
Received 0 blocks and 86479 bytes
Compression is 0.0%
Took 0.19 sec
channel stopped
[locks-and-latches] Releasing all the locks
[locks-and-latches] All the locks released
Maven RedeployPublisher use remote ubuntu-5 maven settings from : /home/jenkins/.m2/settings.xml
[ERROR] uniqueVersion == false is not anymore supported in maven 3
[INFO] Deployment in https://repository.apache.org/content/repositories/snapshots (id=apache.snapshots.https,uniqueVersion=false)
Deploying the main artifact apidocs-1.7.0-SNAPSHOT.pom
Downloading: https://repository.apache.org/content/repositories/snapshots/org/apache/rampart/apidocs/1.7.0-SNAPSHOT/maven-metadata.xml
ERROR: Failed to retrieve remote metadata org.apache.rampart:apidocs:1.7.0-SNAPSHOT/maven-metadata.xml:
Could not transfer metadata org.apache.rampart:apidocs:1.7.0-SNAPSHOT/maven-metadata.xml from/to
apache.snapshots.https (https://repository.apache.org/content/repositories/snapshots): peer
not authenticated
org.apache.maven.artifact.deployer.ArtifactDeploymentException: Failed to retrieve remote
metadata org.apache.rampart:apidocs:1.7.0-SNAPSHOT/maven-metadata.xml: Could not transfer
metadata org.apache.rampart:apidocs:1.7.0-SNAPSHOT/maven-metadata.xml from/to apache.snapshots.https
(https://repository.apache.org/content/repositories/snapshots): peer not authenticated
	at org.apache.maven.artifact.deployer.DefaultArtifactDeployer.deploy(DefaultArtifactDeployer.java:143)
	at hudson.maven.reporters.MavenArtifactRecord.deploy(MavenArtifactRecord.java:193)
	at hudson.maven.RedeployPublisher.perform(RedeployPublisher.java:176)
	at hudson.tasks.BuildStepMonitor$1.perform(BuildStepMonitor.java:20)
	at hudson.model.AbstractBuild$AbstractBuildExecution.perform(AbstractBuild.java:804)
	at hudson.model.AbstractBuild$AbstractBuildExecution.performAllBuildSteps(AbstractBuild.java:776)
	at hudson.maven.MavenModuleSetBuild$MavenModuleSetBuildExecution.post2(MavenModuleSetBuild.java:1040)
	at hudson.model.AbstractBuild$AbstractBuildExecution.post(AbstractBuild.java:725)
	at hudson.model.Run.execute(Run.java:1701)
	at hudson.maven.MavenModuleSetBuild.run(MavenModuleSetBuild.java:529)
	at hudson.model.ResourceController.execute(ResourceController.java:88)
	at hudson.model.Executor.run(Executor.java:231)
Caused by: org.eclipse.aether.deployment.DeploymentException: Failed to retrieve remote metadata
org.apache.rampart:apidocs:1.7.0-SNAPSHOT/maven-metadata.xml: Could not transfer metadata
org.apache.rampart:apidocs:1.7.0-SNAPSHOT/maven-metadata.xml from/to apache.snapshots.https
(https://repository.apache.org/content/repositories/snapshots): peer not authenticated
	at org.eclipse.aether.internal.impl.DefaultDeployer.upload(DefaultDeployer.java:470)
	at org.eclipse.aether.internal.impl.DefaultDeployer.deploy(DefaultDeployer.java:314)
	at org.eclipse.aether.internal.impl.DefaultDeployer.deploy(DefaultDeployer.java:269)
	at org.eclipse.aether.internal.impl.DefaultRepositorySystem.deploy(DefaultRepositorySystem.java:413)
	at org.apache.maven.artifact.deployer.DefaultArtifactDeployer.deploy(DefaultArtifactDeployer.java:139)
	... 11 more
Caused by: org.eclipse.aether.transfer.MetadataTransferException: Could not transfer metadata
org.apache.rampart:apidocs:1.7.0-SNAPSHOT/maven-metadata.xml from/to apache.snapshots.https
(https://repository.apache.org/content/repositories/snapshots): peer not authenticated
	at org.eclipse.aether.connector.wagon.WagonRepositoryConnector$5.wrap(WagonRepositoryConnector.java:995)
	at org.eclipse.aether.connector.wagon.WagonRepositoryConnector$5.wrap(WagonRepositoryConnector.java:983)
	at org.eclipse.aether.connector.wagon.WagonRepositoryConnector$GetTask.run(WagonRepositoryConnector.java:725)
	at org.eclipse.aether.util.concurrency.RunnableErrorForwarder$1.run(RunnableErrorForwarder.java:67)
	at java.util.concurrent.ThreadPoolExecutor.runWorker(ThreadPoolExecutor.java:1145)
	at java.util.concurrent.ThreadPoolExecutor$Worker.run(ThreadPoolExecutor.java:615)
	at java.lang.Thread.run(Thread.java:745)
Caused by: org.apache.maven.wagon.TransferFailedException: peer not authenticated
	at org.apache.maven.wagon.shared.http4.AbstractHttpClientWagon.fillInputData(AbstractHttpClientWagon.java:892)
	at org.apache.maven.wagon.StreamWagon.getInputStream(StreamWagon.java:116)
	at org.apache.maven.wagon.StreamWagon.getIfNewer(StreamWagon.java:88)
	at org.apache.maven.wagon.StreamWagon.get(StreamWagon.java:61)
	at org.eclipse.aether.connector.wagon.WagonRepositoryConnector$GetTask.run(WagonRepositoryConnector.java:660)
	... 4 more
Caused by: javax.net.ssl.SSLPeerUnverifiedException: peer not authenticated
	at sun.security.ssl.SSLSessionImpl.getPeerCertificates(SSLSessionImpl.java:397)
	at org.apache.http.conn.ssl.AbstractVerifier.verify(AbstractVerifier.java:126)
	at org.apache.http.conn.ssl.SSLSocketFactory.connectSocket(SSLSocketFactory.java:437)
	at org.apache.maven.wagon.shared.http4.ConfigurableSSLSocketFactoryDecorator.connectSocket(ConfigurableSSLSocketFactoryDecorator.java:64)
	at org.apache.http.impl.conn.DefaultClientConnectionOperator.openConnection(DefaultClientConnectionOperator.java:180)
	at org.apache.http.impl.conn.ManagedClientConnectionImpl.open(ManagedClientConnectionImpl.java:294)
	at org.apache.http.impl.client.DefaultRequestDirector.tryConnect(DefaultRequestDirector.java:643)
	at org.apache.http.impl.client.DefaultRequestDirector.execute(DefaultRequestDirector.java:479)
	at org.apache.http.impl.client.AbstractHttpClient.execute(AbstractHttpClient.java:906)
	at org.apache.http.impl.client.AbstractHttpClient.execute(AbstractHttpClient.java:805)
	at org.apache.maven.wagon.shared.http4.AbstractHttpClientWagon.execute(AbstractHttpClientWagon.java:746)
	at org.apache.maven.wagon.shared.http4.AbstractHttpClientWagon.fillInputData(AbstractHttpClientWagon.java:886)
	... 8 more
[INFO] Deployment failed after 26 sec
Build step 'Deploy artifacts to Maven repository' changed build result to FAILURE
Updating RAMPART-415

---------------------------------------------------------------------
To unsubscribe, e-mail: java-dev-unsubscribe@axis.apache.org
For additional commands, e-mail: java-dev-help@axis.apache.org


Mime
View raw message