axis-java-dev mailing list archives

Site index · List index
Message view « Date » · « Thread »
Top « Date » · « Thread »
From Apache Jenkins Server <jenk...@builds.apache.org>
Subject Build failed in Jenkins: sandesha2-trunk #1358
Date Wed, 14 May 2014 22:40:27 GMT
See <https://builds.apache.org/job/sandesha2-trunk/1358/>

------------------------------------------
[...truncated 1950 lines...]
[ERROR] ^
[ERROR] <https://builds.apache.org/job/sandesha2-trunk/ws/sandesha2/modules/core/src/main/java/org/apache/sandesha2/util/FaultManager.java>:154:
warning: no description for @param
[ERROR] * @param msgCtx
[ERROR] ^
[ERROR] <https://builds.apache.org/job/sandesha2-trunk/ws/sandesha2/modules/core/src/main/java/org/apache/sandesha2/util/FaultManager.java>:156:
warning: no description for @throws
[ERROR] * @throws SandeshaException
[ERROR] ^
[ERROR] <https://builds.apache.org/job/sandesha2-trunk/ws/sandesha2/modules/core/src/main/java/org/apache/sandesha2/util/FaultManager.java>:158:
warning: no @param for rmMessageContext
[ERROR] public static boolean checkForUnknownSequence(RMMsgContext rmMessageContext, String
sequenceID,
[ERROR] ^
[ERROR] <https://builds.apache.org/job/sandesha2-trunk/ws/sandesha2/modules/core/src/main/java/org/apache/sandesha2/util/FaultManager.java>:158:
warning: no @param for sequenceID
[ERROR] public static boolean checkForUnknownSequence(RMMsgContext rmMessageContext, String
sequenceID,
[ERROR] ^
[ERROR] <https://builds.apache.org/job/sandesha2-trunk/ws/sandesha2/modules/core/src/main/java/org/apache/sandesha2/util/FaultManager.java>:158:
warning: no @param for storageManager
[ERROR] public static boolean checkForUnknownSequence(RMMsgContext rmMessageContext, String
sequenceID,
[ERROR] ^
[ERROR] <https://builds.apache.org/job/sandesha2-trunk/ws/sandesha2/modules/core/src/main/java/org/apache/sandesha2/util/FaultManager.java>:158:
warning: no @param for piggybackedMessage
[ERROR] public static boolean checkForUnknownSequence(RMMsgContext rmMessageContext, String
sequenceID,
[ERROR] ^
[ERROR] <https://builds.apache.org/job/sandesha2-trunk/ws/sandesha2/modules/core/src/main/java/org/apache/sandesha2/util/FaultManager.java>:216:
error: @param name not found
[ERROR] * @param msgCtx
[ERROR] ^
[ERROR] <https://builds.apache.org/job/sandesha2-trunk/ws/sandesha2/modules/core/src/main/java/org/apache/sandesha2/util/FaultManager.java>:216:
warning: no description for @param
[ERROR] * @param msgCtx
[ERROR] ^
[ERROR] <https://builds.apache.org/job/sandesha2-trunk/ws/sandesha2/modules/core/src/main/java/org/apache/sandesha2/util/FaultManager.java>:217:
warning: no description for @return
[ERROR] * @return
[ERROR] ^
[ERROR] <https://builds.apache.org/job/sandesha2-trunk/ws/sandesha2/modules/core/src/main/java/org/apache/sandesha2/util/FaultManager.java>:218:
warning: no description for @throws
[ERROR] * @throws SandeshaException
[ERROR] ^
[ERROR] <https://builds.apache.org/job/sandesha2-trunk/ws/sandesha2/modules/core/src/main/java/org/apache/sandesha2/util/FaultManager.java>:220:
warning: no @param for ackRMMessageContext
[ERROR] public static boolean checkForInvalidAcknowledgement(RMMsgContext ackRMMessageContext,
SequenceAcknowledgement sequenceAcknowledgement,
[ERROR] ^
[ERROR] <https://builds.apache.org/job/sandesha2-trunk/ws/sandesha2/modules/core/src/main/java/org/apache/sandesha2/util/FaultManager.java>:220:
warning: no @param for sequenceAcknowledgement
[ERROR] public static boolean checkForInvalidAcknowledgement(RMMsgContext ackRMMessageContext,
SequenceAcknowledgement sequenceAcknowledgement,
[ERROR] ^
[ERROR] <https://builds.apache.org/job/sandesha2-trunk/ws/sandesha2/modules/core/src/main/java/org/apache/sandesha2/util/FaultManager.java>:220:
warning: no @param for storageManager
[ERROR] public static boolean checkForInvalidAcknowledgement(RMMsgContext ackRMMessageContext,
SequenceAcknowledgement sequenceAcknowledgement,
[ERROR] ^
[ERROR] <https://builds.apache.org/job/sandesha2-trunk/ws/sandesha2/modules/core/src/main/java/org/apache/sandesha2/util/FaultManager.java>:220:
warning: no @param for rmsBean
[ERROR] public static boolean checkForInvalidAcknowledgement(RMMsgContext ackRMMessageContext,
SequenceAcknowledgement sequenceAcknowledgement,
[ERROR] ^
[ERROR] <https://builds.apache.org/job/sandesha2-trunk/ws/sandesha2/modules/core/src/main/java/org/apache/sandesha2/util/FaultManager.java>:220:
warning: no @param for piggybackedMessage
[ERROR] public static boolean checkForInvalidAcknowledgement(RMMsgContext ackRMMessageContext,
SequenceAcknowledgement sequenceAcknowledgement,
[ERROR] ^
[ERROR] <https://builds.apache.org/job/sandesha2-trunk/ws/sandesha2/modules/core/src/main/java/org/apache/sandesha2/util/FaultManager.java>:253:
warning: no description for @param
[ERROR] * @param rmMsgCtx
[ERROR] ^
[ERROR] <https://builds.apache.org/job/sandesha2-trunk/ws/sandesha2/modules/core/src/main/java/org/apache/sandesha2/util/FaultManager.java>:254:
warning: no description for @param
[ERROR] * @param storageManager
[ERROR] ^
[ERROR] <https://builds.apache.org/job/sandesha2-trunk/ws/sandesha2/modules/core/src/main/java/org/apache/sandesha2/util/FaultManager.java>:255:
error: @param name not found
[ERROR] * @param message
[ERROR] ^
[ERROR] <https://builds.apache.org/job/sandesha2-trunk/ws/sandesha2/modules/core/src/main/java/org/apache/sandesha2/util/FaultManager.java>:255:
warning: no description for @param
[ERROR] * @param message
[ERROR] ^
[ERROR] <https://builds.apache.org/job/sandesha2-trunk/ws/sandesha2/modules/core/src/main/java/org/apache/sandesha2/util/FaultManager.java>:256:
warning: no description for @throws
[ERROR] * @throws AxisFault
[ERROR] ^
[ERROR] <https://builds.apache.org/job/sandesha2-trunk/ws/sandesha2/modules/core/src/main/java/org/apache/sandesha2/util/FaultManager.java>:258:
warning: no @param for sequenceAcknowledgement
[ERROR] public static void makeInvalidAcknowledgementFault(RMMsgContext rmMsgCtx,
[ERROR] ^
[ERROR] <https://builds.apache.org/job/sandesha2-trunk/ws/sandesha2/modules/core/src/main/java/org/apache/sandesha2/util/FaultManager.java>:258:
warning: no @param for acknowledgementRange
[ERROR] public static void makeInvalidAcknowledgementFault(RMMsgContext rmMsgCtx,
[ERROR] ^
[ERROR] <https://builds.apache.org/job/sandesha2-trunk/ws/sandesha2/modules/core/src/main/java/org/apache/sandesha2/util/FaultManager.java>:258:
warning: no @param for piggybackedMessage
[ERROR] public static void makeInvalidAcknowledgementFault(RMMsgContext rmMsgCtx,
[ERROR] ^
[ERROR] <https://builds.apache.org/job/sandesha2-trunk/ws/sandesha2/modules/core/src/main/java/org/apache/sandesha2/util/FaultManager.java>:258:
warning: no @param for acksToEPR
[ERROR] public static void makeInvalidAcknowledgementFault(RMMsgContext rmMsgCtx,
[ERROR] ^
[ERROR] <https://builds.apache.org/job/sandesha2-trunk/ws/sandesha2/modules/core/src/main/java/org/apache/sandesha2/util/FaultManager.java>:282:
warning: no @param for rmMessageContext
[ERROR] public static void makeCreateSequenceRefusedFault(RMMsgContext rmMessageContext, String
detail, Exception e, EndpointReference acksToEPR) throws AxisFault {
[ERROR] ^
[ERROR] <https://builds.apache.org/job/sandesha2-trunk/ws/sandesha2/modules/core/src/main/java/org/apache/sandesha2/util/FaultManager.java>:282:
warning: no @param for detail
[ERROR] public static void makeCreateSequenceRefusedFault(RMMsgContext rmMessageContext, String
detail, Exception e, EndpointReference acksToEPR) throws AxisFault {
[ERROR] ^
[ERROR] <https://builds.apache.org/job/sandesha2-trunk/ws/sandesha2/modules/core/src/main/java/org/apache/sandesha2/util/FaultManager.java>:282:
warning: no @param for e
[ERROR] public static void makeCreateSequenceRefusedFault(RMMsgContext rmMessageContext, String
detail, Exception e, EndpointReference acksToEPR) throws AxisFault {
[ERROR] ^
[ERROR] <https://builds.apache.org/job/sandesha2-trunk/ws/sandesha2/modules/core/src/main/java/org/apache/sandesha2/util/FaultManager.java>:282:
warning: no @param for acksToEPR
[ERROR] public static void makeCreateSequenceRefusedFault(RMMsgContext rmMessageContext, String
detail, Exception e, EndpointReference acksToEPR) throws AxisFault {
[ERROR] ^
[ERROR] <https://builds.apache.org/job/sandesha2-trunk/ws/sandesha2/modules/core/src/main/java/org/apache/sandesha2/util/FaultManager.java>:282:
warning: no @throws for org.apache.axis2.AxisFault
[ERROR] public static void makeCreateSequenceRefusedFault(RMMsgContext rmMessageContext, String
detail, Exception e, EndpointReference acksToEPR) throws AxisFault {
[ERROR] ^
[ERROR] <https://builds.apache.org/job/sandesha2-trunk/ws/sandesha2/modules/core/src/main/java/org/apache/sandesha2/util/FaultManager.java>:319:
warning: no @param for rmMessageContext
[ERROR] public static void makeUnsupportedSelectionFault(RMMsgContext rmMessageContext, QName
unsupportedElement) throws AxisFault {
[ERROR] ^
[ERROR] <https://builds.apache.org/job/sandesha2-trunk/ws/sandesha2/modules/core/src/main/java/org/apache/sandesha2/util/FaultManager.java>:319:
warning: no @param for unsupportedElement
[ERROR] public static void makeUnsupportedSelectionFault(RMMsgContext rmMessageContext, QName
unsupportedElement) throws AxisFault {
[ERROR] ^
[ERROR] <https://builds.apache.org/job/sandesha2-trunk/ws/sandesha2/modules/core/src/main/java/org/apache/sandesha2/util/FaultManager.java>:319:
warning: no @throws for org.apache.axis2.AxisFault
[ERROR] public static void makeUnsupportedSelectionFault(RMMsgContext rmMessageContext, QName
unsupportedElement) throws AxisFault {
[ERROR] ^
[ERROR] <https://builds.apache.org/job/sandesha2-trunk/ws/sandesha2/modules/core/src/main/java/org/apache/sandesha2/util/FaultManager.java>:349:
warning: no @param for rmMessageContext
[ERROR] public static void makeMissingSelectionFault(RMMsgContext rmMessageContext) throws
AxisFault {
[ERROR] ^
[ERROR] <https://builds.apache.org/job/sandesha2-trunk/ws/sandesha2/modules/core/src/main/java/org/apache/sandesha2/util/FaultManager.java>:349:
warning: no @throws for org.apache.axis2.AxisFault
[ERROR] public static void makeMissingSelectionFault(RMMsgContext rmMessageContext) throws
AxisFault {
[ERROR] ^
[ERROR] <https://builds.apache.org/job/sandesha2-trunk/ws/sandesha2/modules/core/src/main/java/org/apache/sandesha2/util/FaultManager.java>:415:
warning: no description for @param
[ERROR] * @param referenceRMMessage
[ERROR] ^
[ERROR] <https://builds.apache.org/job/sandesha2-trunk/ws/sandesha2/modules/core/src/main/java/org/apache/sandesha2/util/FaultManager.java>:416:
warning: no description for @param
[ERROR] * @param sequenceID
[ERROR] ^
[ERROR] <https://builds.apache.org/job/sandesha2-trunk/ws/sandesha2/modules/core/src/main/java/org/apache/sandesha2/util/FaultManager.java>:417:
error: @param name not found
[ERROR] * @param rmdBean
[ERROR] ^
[ERROR] <https://builds.apache.org/job/sandesha2-trunk/ws/sandesha2/modules/core/src/main/java/org/apache/sandesha2/util/FaultManager.java>:417:
warning: no description for @param
[ERROR] * @param rmdBean
[ERROR] ^
[ERROR] <https://builds.apache.org/job/sandesha2-trunk/ws/sandesha2/modules/core/src/main/java/org/apache/sandesha2/util/FaultManager.java>:418:
warning: no description for @return
[ERROR] * @return
[ERROR] ^
[ERROR] <https://builds.apache.org/job/sandesha2-trunk/ws/sandesha2/modules/core/src/main/java/org/apache/sandesha2/util/FaultManager.java>:419:
warning: no description for @throws
[ERROR] * @throws AxisFault
[ERROR] ^
[ERROR] <https://builds.apache.org/job/sandesha2-trunk/ws/sandesha2/modules/core/src/main/java/org/apache/sandesha2/util/FaultManager.java>:421:
warning: no @param for bean
[ERROR] public static boolean checkForSequenceTerminated(RMMsgContext referenceRMMessage,
String sequenceID, RMSequenceBean bean
[ERROR] ^
[ERROR] <https://builds.apache.org/job/sandesha2-trunk/ws/sandesha2/modules/core/src/main/java/org/apache/sandesha2/util/FaultManager.java>:421:
warning: no @param for piggybackedMessage
[ERROR] public static boolean checkForSequenceTerminated(RMMsgContext referenceRMMessage,
String sequenceID, RMSequenceBean bean
[ERROR] ^
[ERROR] <https://builds.apache.org/job/sandesha2-trunk/ws/sandesha2/modules/core/src/main/java/org/apache/sandesha2/util/FaultManager.java>:503:
error: invalid use of @return
[ERROR] * @return - The dummy fault to be thrown out.
[ERROR] ^
[ERROR] <https://builds.apache.org/job/sandesha2-trunk/ws/sandesha2/modules/core/src/main/java/org/apache/sandesha2/util/FaultManager.java>:505:
warning: no description for @throws
[ERROR] * @throws AxisFault
[ERROR] ^
[ERROR] <https://builds.apache.org/job/sandesha2-trunk/ws/sandesha2/modules/core/src/main/java/org/apache/sandesha2/util/FaultManager.java>:507:
warning: no @param for acksToEPR
[ERROR] public static void getOrSendFault(RMMsgContext referenceRMMsgContext, FaultData data,
boolean throwable, EndpointReference acksToEPR) throws AxisFault {
[ERROR] ^
[ERROR] <https://builds.apache.org/job/sandesha2-trunk/ws/sandesha2/modules/core/src/main/java/org/apache/sandesha2/util/FaultManager.java>:804:
warning: no description for @throws
[ERROR] * @throws AxisFault
[ERROR] ^
[ERROR] <https://builds.apache.org/job/sandesha2-trunk/ws/sandesha2/modules/core/src/main/java/org/apache/sandesha2/util/FaultManager.java>:806:
warning: no @param for rmMessageContext
[ERROR] public static boolean checkForMessageRolledOver(RMMsgContext rmMessageContext, String
sequenceId, long msgNo, RMDBean bean)throws AxisFault {
[ERROR] ^
[ERROR] <https://builds.apache.org/job/sandesha2-trunk/ws/sandesha2/modules/core/src/main/java/org/apache/sandesha2/util/FaultManager.java>:806:
warning: no @param for sequenceId
[ERROR] public static boolean checkForMessageRolledOver(RMMsgContext rmMessageContext, String
sequenceId, long msgNo, RMDBean bean)throws AxisFault {
[ERROR] ^
[ERROR] <https://builds.apache.org/job/sandesha2-trunk/ws/sandesha2/modules/core/src/main/java/org/apache/sandesha2/util/FaultManager.java>:806:
warning: no @param for msgNo
[ERROR] public static boolean checkForMessageRolledOver(RMMsgContext rmMessageContext, String
sequenceId, long msgNo, RMDBean bean)throws AxisFault {
[ERROR] ^
[ERROR] <https://builds.apache.org/job/sandesha2-trunk/ws/sandesha2/modules/core/src/main/java/org/apache/sandesha2/util/FaultManager.java>:806:
warning: no @param for bean
[ERROR] public static boolean checkForMessageRolledOver(RMMsgContext rmMessageContext, String
sequenceId, long msgNo, RMDBean bean)throws AxisFault {
[ERROR] ^
[ERROR] <https://builds.apache.org/job/sandesha2-trunk/ws/sandesha2/modules/core/src/main/java/org/apache/sandesha2/util/FaultManager.java>:806:
warning: no @return
[ERROR] public static boolean checkForMessageRolledOver(RMMsgContext rmMessageContext, String
sequenceId, long msgNo, RMDBean bean)throws AxisFault {
[ERROR] ^
[ERROR] <https://builds.apache.org/job/sandesha2-trunk/ws/sandesha2/modules/core/src/main/java/org/apache/sandesha2/util/MsgInitializer.java>:51:
warning: no description for @param
[ERROR] * @param ctx
[ERROR] ^
[ERROR] <https://builds.apache.org/job/sandesha2-trunk/ws/sandesha2/modules/core/src/main/java/org/apache/sandesha2/util/MsgInitializer.java>:52:
error: @param name not found
[ERROR] * @param assumedRMNamespace
[ERROR] ^
[ERROR] <https://builds.apache.org/job/sandesha2-trunk/ws/sandesha2/modules/core/src/main/java/org/apache/sandesha2/util/MsgInitializer.java>:58:
warning: no description for @return
[ERROR] * @return
[ERROR] ^
[ERROR] <https://builds.apache.org/job/sandesha2-trunk/ws/sandesha2/modules/core/src/main/java/org/apache/sandesha2/util/MsgInitializer.java>:59:
warning: no description for @throws
[ERROR] * @throws SandeshaException
[ERROR] ^
[ERROR] <https://builds.apache.org/job/sandesha2-trunk/ws/sandesha2/modules/core/src/main/java/org/apache/sandesha2/util/Range.java>:103:
warning: no @param for value
[ERROR] public boolean rangeContainsValue(long value){
[ERROR] ^
[ERROR] <https://builds.apache.org/job/sandesha2-trunk/ws/sandesha2/modules/core/src/main/java/org/apache/sandesha2/util/Range.java>:103:
warning: no @return
[ERROR] public boolean rangeContainsValue(long value){
[ERROR] ^
[ERROR] <https://builds.apache.org/job/sandesha2-trunk/ws/sandesha2/modules/core/src/main/java/org/apache/sandesha2/util/Range.java>:30:
error: bad use of '>'
[ERROR] * Data structure to represent a range of values from lowerValue->upperValue inclusive.
[ERROR] ^
[ERROR] <https://builds.apache.org/job/sandesha2-trunk/ws/sandesha2/modules/core/src/main/java/org/apache/sandesha2/util/Range.java>:43:
warning: no description for @param
[ERROR] * @param value
[ERROR] ^
[ERROR] <https://builds.apache.org/job/sandesha2-trunk/ws/sandesha2/modules/core/src/main/java/org/apache/sandesha2/util/RMMsgCreator.java>:85:
error: @param name not found
[ERROR] * @param internalSequenceId
[ERROR] ^
[ERROR] <https://builds.apache.org/job/sandesha2-trunk/ws/sandesha2/modules/core/src/main/java/org/apache/sandesha2/util/RMMsgCreator.java>:86:
error: @param name not found
[ERROR] * @param acksToEPR
[ERROR] ^
[ERROR] <https://builds.apache.org/job/sandesha2-trunk/ws/sandesha2/modules/core/src/main/java/org/apache/sandesha2/util/RMMsgCreator.java>:331:
error: @param name not found
[ERROR] * @param outMessage
[ERROR] ^
[ERROR] <https://builds.apache.org/job/sandesha2-trunk/ws/sandesha2/modules/core/src/main/java/org/apache/sandesha2/util/RMMsgCreator.java>:332:
error: @param name not found
[ERROR] * @param newSequenceID
[ERROR] ^
[ERROR] <https://builds.apache.org/job/sandesha2-trunk/ws/sandesha2/modules/core/src/main/java/org/apache/sandesha2/util/SandeshaUtil.java>:136:
error: @param name not found
[ERROR] * @param msgNoStr
[ERROR] ^
[ERROR] <https://builds.apache.org/job/sandesha2-trunk/ws/sandesha2/modules/core/src/main/java/org/apache/sandesha2/util/SandeshaUtil.java>:137:
error: @param name not found
[ERROR] * @param factory
[ERROR] ^
[ERROR] <https://builds.apache.org/job/sandesha2-trunk/ws/sandesha2/modules/core/src/main/java/org/apache/sandesha2/util/SandeshaUtil.java>:139:
error: exception not thrown: org.apache.sandesha2.SandeshaException
[ERROR] * @throws SandeshaException
[ERROR] ^
[ERROR] <https://builds.apache.org/job/sandesha2-trunk/ws/sandesha2/modules/core/src/main/java/org/apache/sandesha2/util/TerminateManager.java>:143:
error: @param name not found
[ERROR] * @param sequenceID
[ERROR] ^
[ERROR] <https://builds.apache.org/job/sandesha2-trunk/ws/sandesha2/modules/core/src/main/java/org/apache/sandesha2/util/TerminateManager.java>:193:
error: @param name not found
[ERROR] * @param sequenceID
[ERROR] ^
[ERROR] <https://builds.apache.org/job/sandesha2-trunk/ws/sandesha2/modules/core/src/main/java/org/apache/sandesha2/util/TerminateManager.java>:231:
error: @param name not found
[ERROR] * @param configContext
[ERROR] ^
[ERROR] <https://builds.apache.org/job/sandesha2-trunk/ws/sandesha2/modules/core/src/main/java/org/apache/sandesha2/util/TerminateManager.java>:232:
error: @param name not found
[ERROR] * @param sequenceID
[ERROR] ^
[ERROR] <https://builds.apache.org/job/sandesha2-trunk/ws/sandesha2/modules/core/src/main/java/org/apache/sandesha2/client/SandeshaClient.java>:1325:
error: reference not found
[ERROR] * @see getLastSendTimestamp .
[ERROR] ^
[ERROR] <https://builds.apache.org/job/sandesha2-trunk/ws/sandesha2/modules/core/src/main/java/org/apache/sandesha2/storage/beans/InvokerBean.java>:122:
error: @param name not found
[ERROR] * @param sequenceID
[ERROR] ^
[ERROR] <https://builds.apache.org/job/sandesha2-trunk/ws/sandesha2/modules/core/src/main/java/org/apache/sandesha2/storage/beans/RMSequenceBean.java>:135:
error: @param name not found
[ERROR] * @param sequenceId
[ERROR] ^
[ERROR] 
[ERROR] Command line was:/home/jenkins/jdk1.8.0_05/jre/../bin/javadoc @options @packages
[ERROR] -> [Help 1]
[ERROR] 
[ERROR] To see the full stack trace of the errors, re-run Maven with the -e switch.
[ERROR] Re-run Maven using the -X switch to enable full debug logging.
[ERROR] 
[ERROR] For more information about the errors and possible solutions, please read the following
articles:
[ERROR] [Help 1] http://cwiki.apache.org/confluence/display/MAVEN/MojoExecutionException
[ERROR] 
[ERROR] After correcting the problems, you can resume the build with the command
[ERROR]   mvn <goals> -rf :sandesha2-core
[JENKINS] Archiving <https://builds.apache.org/job/sandesha2-trunk/ws/sandesha2/modules/client/pom.xml>
to org.apache.sandesha2/sandesha2-client-constants/1.7.0-SNAPSHOT/sandesha2-client-constants-1.7.0-SNAPSHOT.pom
[JENKINS] Archiving <https://builds.apache.org/job/sandesha2-trunk/ws/sandesha2/modules/rampart-integration/pom.xml>
to org.apache.sandesha2/sandesha2-rampart-integration/1.7.0-SNAPSHOT/sandesha2-rampart-integration-1.7.0-SNAPSHOT.pom
[JENKINS] Archiving <https://builds.apache.org/job/sandesha2-trunk/ws/sandesha2/modules/interop/pom.xml>
to org.apache.sandesha2/sandesha2-interop/1.7.0-SNAPSHOT/sandesha2-interop-1.7.0-SNAPSHOT.pom
[JENKINS] Archiving <https://builds.apache.org/job/sandesha2-trunk/ws/sandesha2/pom.xml>
to org.apache.sandesha2/sandesha2-parent/1.7.0-SNAPSHOT/sandesha2-parent-1.7.0-SNAPSHOT.pom
[JENKINS] Archiving <https://builds.apache.org/job/sandesha2-trunk/ws/sandesha2/modules/tests/pom.xml>
to org.apache.sandesha2/sandesha2-tests/1.7.0-SNAPSHOT/sandesha2-tests-1.7.0-SNAPSHOT.pom
[JENKINS] Archiving <https://builds.apache.org/job/sandesha2-trunk/ws/sandesha2/modules/persistence/pom.xml>
to org.apache.sandesha2/sandesha2-persistence/1.7.0-SNAPSHOT/sandesha2-persistence-1.7.0-SNAPSHOT.pom
[JENKINS] Archiving <https://builds.apache.org/job/sandesha2-trunk/ws/sandesha2/modules/resource-bundle/pom.xml>
to org.apache.sandesha2/sandesha2-resource-bundle/1.7.0-SNAPSHOT/sandesha2-resource-bundle-1.7.0-SNAPSHOT.pom
[JENKINS] Archiving <https://builds.apache.org/job/sandesha2-trunk/ws/sandesha2/modules/resource-bundle/target/sandesha2-resource-bundle-1.7.0-SNAPSHOT.jar>
to org.apache.sandesha2/sandesha2-resource-bundle/1.7.0-20140514.223952-706/sandesha2-resource-bundle-1.7.0-20140514.223952-706.jar
[JENKINS] Archiving <https://builds.apache.org/job/sandesha2-trunk/ws/sandesha2/modules/resource-bundle/target/sandesha2-resource-bundle-1.7.0-SNAPSHOT-sources.jar>
to org.apache.sandesha2/sandesha2-resource-bundle/1.7.0-20140514.223952-706/sandesha2-resource-bundle-1.7.0-20140514.223952-706-sources.jar
[JENKINS] Archiving <https://builds.apache.org/job/sandesha2-trunk/ws/sandesha2/modules/samples/pom.xml>
to org.apache.sandesha2/sandesha2-samples/1.7.0-SNAPSHOT/sandesha2-samples-1.7.0-SNAPSHOT.pom
[JENKINS] Archiving <https://builds.apache.org/job/sandesha2-trunk/ws/sandesha2/modules/core/pom.xml>
to org.apache.sandesha2/sandesha2-core/1.7.0-SNAPSHOT/sandesha2-core-1.7.0-SNAPSHOT.pom
[JENKINS] Archiving <https://builds.apache.org/job/sandesha2-trunk/ws/sandesha2/modules/core/target/sandesha2-core-1.7.0-SNAPSHOT.jar>
to org.apache.sandesha2/sandesha2-core/1.7.0-SNAPSHOT/sandesha2-core-1.7.0-SNAPSHOT.jar
[JENKINS] Archiving <https://builds.apache.org/job/sandesha2-trunk/ws/sandesha2/modules/policy/pom.xml>
to org.apache.sandesha2/sandesha2-policy/1.7.0-SNAPSHOT/sandesha2-policy-1.7.0-SNAPSHOT.pom
[JENKINS] Archiving <https://builds.apache.org/job/sandesha2-trunk/ws/sandesha2/modules/distribution/pom.xml>
to org.apache.sandesha2/distribution/1.7.0-SNAPSHOT/distribution-1.7.0-SNAPSHOT.pom
[JENKINS] Archiving <https://builds.apache.org/job/sandesha2-trunk/ws/sandesha2/modules/mar/pom.xml>
to org.apache.sandesha2/sandesha2/1.7.0-SNAPSHOT/sandesha2-1.7.0-SNAPSHOT.pom
Sending e-mails to: java-dev@axis.apache.org
channel stopped

---------------------------------------------------------------------
To unsubscribe, e-mail: java-dev-unsubscribe@axis.apache.org
For additional commands, e-mail: java-dev-help@axis.apache.org


Mime
View raw message