axis-java-dev mailing list archives

Site index · List index
Message view « Date » · « Thread »
Top « Date » · « Thread »
From Apache Jenkins Server <jenk...@builds.apache.org>
Subject Build failed in Jenkins: sandesha2-trunk #1351
Date Fri, 21 Mar 2014 10:19:34 GMT
See <https://builds.apache.org/job/sandesha2-trunk/1351/>

------------------------------------------
[...truncated 876 lines...]
Downloaded: http://repo1.maven.org/maven2/org/codehaus/plexus/plexus-containers/1.0-alpha-30/plexus-containers-1.0-alpha-30.pom
(2 KB at 462.4 KB/sec)
Downloading: http://repo1.maven.org/maven2/org/codehaus/plexus/plexus-classworlds/1.2-alpha-9/plexus-classworlds-1.2-alpha-9.pom
Downloaded: http://repo1.maven.org/maven2/org/codehaus/plexus/plexus-classworlds/1.2-alpha-9/plexus-classworlds-1.2-alpha-9.pom
(4 KB at 286.1 KB/sec)
Downloading: http://repo1.maven.org/maven2/org/codehaus/plexus/plexus-i18n/1.0-beta-7/plexus-i18n-1.0-beta-7.pom
Downloaded: http://repo1.maven.org/maven2/org/codehaus/plexus/plexus-i18n/1.0-beta-7/plexus-i18n-1.0-beta-7.pom
(2 KB at 258.5 KB/sec)
Downloading: http://repo1.maven.org/maven2/org/codehaus/plexus/plexus-components/1.1.12/plexus-components-1.1.12.pom
Downloaded: http://repo1.maven.org/maven2/org/codehaus/plexus/plexus-components/1.1.12/plexus-components-1.1.12.pom
(3 KB at 733.2 KB/sec)
Downloading: http://repo1.maven.org/maven2/org/codehaus/plexus/plexus-velocity/1.1.7/plexus-velocity-1.1.7.pom
Downloaded: http://repo1.maven.org/maven2/org/codehaus/plexus/plexus-velocity/1.1.7/plexus-velocity-1.1.7.pom
(2 KB at 477.8 KB/sec)
Downloading: http://repo1.maven.org/maven2/org/codehaus/plexus/plexus-container-default/1.0-alpha-20/plexus-container-default-1.0-alpha-20.pom
Downloaded: http://repo1.maven.org/maven2/org/codehaus/plexus/plexus-container-default/1.0-alpha-20/plexus-container-default-1.0-alpha-20.pom
(3 KB at 265.5 KB/sec)
Downloading: http://repo1.maven.org/maven2/org/codehaus/plexus/plexus-containers/1.0-alpha-20/plexus-containers-1.0-alpha-20.pom
Downloaded: http://repo1.maven.org/maven2/org/codehaus/plexus/plexus-containers/1.0-alpha-20/plexus-containers-1.0-alpha-20.pom
(2 KB at 307.0 KB/sec)
Downloading: http://repo1.maven.org/maven2/org/apache/velocity/velocity/1.5/velocity-1.5.pom
Downloaded: http://repo1.maven.org/maven2/org/apache/velocity/velocity/1.5/velocity-1.5.pom
(8 KB at 1516.6 KB/sec)
Downloading: http://repo1.maven.org/maven2/commons-collections/commons-collections/3.1/commons-collections-3.1.pom
Downloaded: http://repo1.maven.org/maven2/commons-collections/commons-collections/3.1/commons-collections-3.1.pom
(6 KB at 1188.3 KB/sec)
Downloading: http://repo1.maven.org/maven2/commons-lang/commons-lang/2.1/commons-lang-2.1.pom
Downloaded: http://repo1.maven.org/maven2/commons-lang/commons-lang/2.1/commons-lang-2.1.pom
(10 KB at 1939.1 KB/sec)
Downloading: http://repo1.maven.org/maven2/oro/oro/2.0.8/oro-2.0.8.pom
Downloaded: http://repo1.maven.org/maven2/oro/oro/2.0.8/oro-2.0.8.pom (140 B at 27.3 KB/sec)
Downloading: http://repo1.maven.org/maven2/org/apache/maven/doxia/doxia-decoration-model/1.0-alpha-11/doxia-decoration-model-1.0-alpha-11.pom
Downloaded: http://repo1.maven.org/maven2/org/apache/maven/doxia/doxia-decoration-model/1.0-alpha-11/doxia-decoration-model-1.0-alpha-11.pom
(3 KB at 588.3 KB/sec)
Downloading: http://repo1.maven.org/maven2/commons-collections/commons-collections/3.2/commons-collections-3.2.pom
Downloaded: http://repo1.maven.org/maven2/commons-collections/commons-collections/3.2/commons-collections-3.2.pom
(11 KB at 2693.8 KB/sec)
Downloading: http://repo1.maven.org/maven2/org/apache/maven/doxia/doxia-module-apt/1.0-alpha-11/doxia-module-apt-1.0-alpha-11.pom
Downloaded: http://repo1.maven.org/maven2/org/apache/maven/doxia/doxia-module-apt/1.0-alpha-11/doxia-module-apt-1.0-alpha-11.pom
(3 KB at 360.2 KB/sec)
Downloading: http://repo1.maven.org/maven2/org/apache/maven/doxia/doxia-modules/1.0-alpha-11/doxia-modules-1.0-alpha-11.pom
Downloaded: http://repo1.maven.org/maven2/org/apache/maven/doxia/doxia-modules/1.0-alpha-11/doxia-modules-1.0-alpha-11.pom
(3 KB at 460.0 KB/sec)
Downloading: http://repo1.maven.org/maven2/org/apache/maven/doxia/doxia-module-fml/1.0-alpha-11/doxia-module-fml-1.0-alpha-11.pom
Downloaded: http://repo1.maven.org/maven2/org/apache/maven/doxia/doxia-module-fml/1.0-alpha-11/doxia-module-fml-1.0-alpha-11.pom
(3 KB at 517.6 KB/sec)
Downloading: http://repo1.maven.org/maven2/org/apache/maven/doxia/doxia-module-xdoc/1.0-alpha-11/doxia-module-xdoc-1.0-alpha-11.pom
Downloaded: http://repo1.maven.org/maven2/org/apache/maven/doxia/doxia-module-xdoc/1.0-alpha-11/doxia-module-xdoc-1.0-alpha-11.pom
(3 KB at 430.1 KB/sec)
Downloading: http://repo1.maven.org/maven2/org/apache/maven/doxia/doxia-module-xhtml/1.0-alpha-11/doxia-module-xhtml-1.0-alpha-11.pom
Downloaded: http://repo1.maven.org/maven2/org/apache/maven/doxia/doxia-module-xhtml/1.0-alpha-11/doxia-module-xhtml-1.0-alpha-11.pom
(2 KB at 252.8 KB/sec)
Downloading: http://repo1.maven.org/maven2/org/apache/maven/wagon/wagon-provider-api/1.0-beta-2/wagon-provider-api-1.0-beta-2.pom
Downloaded: http://repo1.maven.org/maven2/org/apache/maven/wagon/wagon-provider-api/1.0-beta-2/wagon-provider-api-1.0-beta-2.pom
(680 B at 132.8 KB/sec)
Downloading: http://repo1.maven.org/maven2/org/apache/maven/wagon/wagon/1.0-beta-2/wagon-1.0-beta-2.pom
Downloaded: http://repo1.maven.org/maven2/org/apache/maven/wagon/wagon/1.0-beta-2/wagon-1.0-beta-2.pom
(6 KB at 1148.8 KB/sec)
Downloading: http://repo1.maven.org/maven2/org/apache/maven/maven-toolchain/1.0/maven-toolchain-1.0.pom
Downloaded: http://repo1.maven.org/maven2/org/apache/maven/maven-toolchain/1.0/maven-toolchain-1.0.pom
(4 KB at 666.8 KB/sec)
Downloading: http://repo1.maven.org/maven2/org/apache/maven/maven-archiver/2.3/maven-archiver-2.3.jar
Downloading: http://repo1.maven.org/maven2/org/apache/maven/doxia/doxia-site-renderer/1.0-alpha-11/doxia-site-renderer-1.0-alpha-11.jar
Downloading: http://repo1.maven.org/maven2/org/apache/maven/doxia/doxia-core/1.0-alpha-11/doxia-core-1.0-alpha-11.jar
Downloading: http://repo1.maven.org/maven2/org/codehaus/plexus/plexus-i18n/1.0-beta-7/plexus-i18n-1.0-beta-7.jar
Downloading: http://repo1.maven.org/maven2/org/apache/maven/doxia/doxia-sink-api/1.0-alpha-11/doxia-sink-api-1.0-alpha-11.jar
Downloaded: http://repo1.maven.org/maven2/org/apache/maven/maven-archiver/2.3/maven-archiver-2.3.jar
(18 KB at 2475.2 KB/sec)
Downloading: http://repo1.maven.org/maven2/org/codehaus/plexus/plexus-velocity/1.1.7/plexus-velocity-1.1.7.jar
Downloaded: http://repo1.maven.org/maven2/org/codehaus/plexus/plexus-i18n/1.0-beta-7/plexus-i18n-1.0-beta-7.jar
(11 KB at 2052.5 KB/sec)
Downloading: http://repo1.maven.org/maven2/org/apache/velocity/velocity/1.5/velocity-1.5.jar
Downloaded: http://repo1.maven.org/maven2/org/apache/maven/doxia/doxia-core/1.0-alpha-11/doxia-core-1.0-alpha-11.jar
(54 KB at 7622.9 KB/sec)
Downloading: http://repo1.maven.org/maven2/oro/oro/2.0.8/oro-2.0.8.jar
Downloaded: http://repo1.maven.org/maven2/org/apache/maven/doxia/doxia-site-renderer/1.0-alpha-11/doxia-site-renderer-1.0-alpha-11.jar
(45 KB at 4488.2 KB/sec)
Downloading: http://repo1.maven.org/maven2/org/apache/maven/doxia/doxia-decoration-model/1.0-alpha-11/doxia-decoration-model-1.0-alpha-11.jar
Downloaded: http://repo1.maven.org/maven2/org/codehaus/plexus/plexus-velocity/1.1.7/plexus-velocity-1.1.7.jar
(8 KB at 1497.7 KB/sec)
Downloading: http://repo1.maven.org/maven2/commons-collections/commons-collections/3.2/commons-collections-3.2.jar
Downloaded: http://repo1.maven.org/maven2/org/apache/maven/doxia/doxia-decoration-model/1.0-alpha-11/doxia-decoration-model-1.0-alpha-11.jar
(49 KB at 8103.7 KB/sec)
Downloading: http://repo1.maven.org/maven2/org/apache/maven/doxia/doxia-module-apt/1.0-alpha-11/doxia-module-apt-1.0-alpha-11.jar
Downloaded: http://repo1.maven.org/maven2/oro/oro/2.0.8/oro-2.0.8.jar (64 KB at 6373.1 KB/sec)
Downloading: http://repo1.maven.org/maven2/org/apache/maven/doxia/doxia-module-fml/1.0-alpha-11/doxia-module-fml-1.0-alpha-11.jar
Downloaded: http://repo1.maven.org/maven2/org/apache/maven/doxia/doxia-module-apt/1.0-alpha-11/doxia-module-apt-1.0-alpha-11.jar
(46 KB at 9132.6 KB/sec)
Downloading: http://repo1.maven.org/maven2/org/apache/maven/doxia/doxia-module-xdoc/1.0-alpha-11/doxia-module-xdoc-1.0-alpha-11.jar
Downloaded: http://repo1.maven.org/maven2/org/apache/maven/doxia/doxia-module-xdoc/1.0-alpha-11/doxia-module-xdoc-1.0-alpha-11.jar
(27 KB at 6708.5 KB/sec)
Downloading: http://repo1.maven.org/maven2/org/apache/maven/doxia/doxia-module-xhtml/1.0-alpha-11/doxia-module-xhtml-1.0-alpha-11.jar
Downloaded: http://repo1.maven.org/maven2/org/apache/maven/doxia/doxia-module-fml/1.0-alpha-11/doxia-module-fml-1.0-alpha-11.jar
(18 KB at 1483.3 KB/sec)
Downloading: http://repo1.maven.org/maven2/commons-lang/commons-lang/2.1/commons-lang-2.1.jar
Downloaded: http://repo1.maven.org/maven2/org/apache/maven/doxia/doxia-module-xhtml/1.0-alpha-11/doxia-module-xhtml-1.0-alpha-11.jar
(21 KB at 4194.9 KB/sec)
Downloading: http://repo1.maven.org/maven2/org/codehaus/plexus/plexus-utils/1.5.6/plexus-utils-1.5.6.jar
Downloaded: http://repo1.maven.org/maven2/org/apache/maven/doxia/doxia-sink-api/1.0-alpha-11/doxia-sink-api-1.0-alpha-11.jar
(10 KB at 253.4 KB/sec)
Downloaded: http://repo1.maven.org/maven2/org/apache/velocity/velocity/1.5/velocity-1.5.jar
(383 KB at 9339.8 KB/sec)
Downloaded: http://repo1.maven.org/maven2/org/codehaus/plexus/plexus-utils/1.5.6/plexus-utils-1.5.6.jar
(245 KB at 16311.6 KB/sec)
Downloaded: http://repo1.maven.org/maven2/commons-collections/commons-collections/3.2/commons-collections-3.2.jar
(558 KB at 14304.4 KB/sec)
Downloaded: http://repo1.maven.org/maven2/commons-lang/commons-lang/2.1/commons-lang-2.1.jar
(203 KB at 6543.7 KB/sec)
[INFO] Not executing Javadoc as the project is not a Java classpath-capable package
[INFO] 
[INFO] --- apache-rat-plugin:0.7:check (default) @ sandesha2-parent ---
Downloading: http://repo1.maven.org/maven2/org/apache/rat/apache-rat-core/0.7/apache-rat-core-0.7.pom
Downloaded: http://repo1.maven.org/maven2/org/apache/rat/apache-rat-core/0.7/apache-rat-core-0.7.pom
(3 KB at 451.5 KB/sec)
Downloading: http://repo1.maven.org/maven2/commons-io/commons-io/1.4/commons-io-1.4.pom
Downloaded: http://repo1.maven.org/maven2/commons-io/commons-io/1.4/commons-io-1.4.pom (13
KB at 2142.9 KB/sec)
Downloading: http://repo1.maven.org/maven2/org/apache/commons/commons-parent/7/commons-parent-7.pom
Downloaded: http://repo1.maven.org/maven2/org/apache/commons/commons-parent/7/commons-parent-7.pom
(18 KB at 2847.7 KB/sec)
Downloading: http://repo1.maven.org/maven2/org/apache/commons/commons-compress/1.0/commons-compress-1.0.pom
Downloaded: http://repo1.maven.org/maven2/org/apache/commons/commons-compress/1.0/commons-compress-1.0.pom
(8 KB at 1314.9 KB/sec)
Downloading: http://repo1.maven.org/maven2/org/apache/commons/commons-parent/11/commons-parent-11.pom
Downloaded: http://repo1.maven.org/maven2/org/apache/commons/commons-parent/11/commons-parent-11.pom
(25 KB at 4011.9 KB/sec)
Downloading: http://repo1.maven.org/maven2/commons-cli/commons-cli/1.1/commons-cli-1.1.pom
Downloaded: http://repo1.maven.org/maven2/commons-cli/commons-cli/1.1/commons-cli-1.1.pom
(5 KB at 810.1 KB/sec)
Downloading: http://repo1.maven.org/maven2/org/codehaus/plexus/plexus-utils/1.4/plexus-utils-1.4.pom
Downloaded: http://repo1.maven.org/maven2/org/codehaus/plexus/plexus-utils/1.4/plexus-utils-1.4.pom
(2 KB at 224.8 KB/sec)
Downloading: http://repo1.maven.org/maven2/org/apache/maven/doxia/doxia-site-renderer/1.0-alpha-8/doxia-site-renderer-1.0-alpha-8.pom
Downloaded: http://repo1.maven.org/maven2/org/apache/maven/doxia/doxia-site-renderer/1.0-alpha-8/doxia-site-renderer-1.0-alpha-8.pom
(2 KB at 154.1 KB/sec)
Downloading: http://repo1.maven.org/maven2/org/apache/maven/doxia/doxia/1.0-alpha-8/doxia-1.0-alpha-8.pom
Downloaded: http://repo1.maven.org/maven2/org/apache/maven/doxia/doxia/1.0-alpha-8/doxia-1.0-alpha-8.pom
(3 KB at 560.2 KB/sec)
Downloading: http://repo1.maven.org/maven2/org/apache/maven/maven-parent/1/maven-parent-1.pom
Downloaded: http://repo1.maven.org/maven2/org/apache/maven/maven-parent/1/maven-parent-1.pom
(7 KB at 1569.6 KB/sec)
Downloading: http://repo1.maven.org/maven2/org/apache/apache/1/apache-1.pom
Downloaded: http://repo1.maven.org/maven2/org/apache/apache/1/apache-1.pom (4 KB at 555.0
KB/sec)
Downloading: http://repo1.maven.org/maven2/org/apache/maven/doxia/doxia-core/1.0-alpha-8/doxia-core-1.0-alpha-8.pom
Downloaded: http://repo1.maven.org/maven2/org/apache/maven/doxia/doxia-core/1.0-alpha-8/doxia-core-1.0-alpha-8.pom
(2 KB at 259.9 KB/sec)
Downloading: http://repo1.maven.org/maven2/oro/oro/2.0.7/oro-2.0.7.pom
Downloaded: http://repo1.maven.org/maven2/oro/oro/2.0.7/oro-2.0.7.pom (141 B at 27.5 KB/sec)
Downloading: http://repo1.maven.org/maven2/org/apache/maven/doxia/doxia-sink-api/1.0-alpha-8/doxia-sink-api-1.0-alpha-8.pom
Downloaded: http://repo1.maven.org/maven2/org/apache/maven/doxia/doxia-sink-api/1.0-alpha-8/doxia-sink-api-1.0-alpha-8.pom
(424 B at 82.8 KB/sec)
Downloading: http://repo1.maven.org/maven2/org/apache/maven/doxia/doxia-decoration-model/1.0-alpha-8/doxia-decoration-model-1.0-alpha-8.pom
Downloaded: http://repo1.maven.org/maven2/org/apache/maven/doxia/doxia-decoration-model/1.0-alpha-8/doxia-decoration-model-1.0-alpha-8.pom
(2 KB at 277.1 KB/sec)
Downloading: http://repo1.maven.org/maven2/org/apache/maven/reporting/maven-reporting-impl/2.0.4/maven-reporting-impl-2.0.4.pom
Downloaded: http://repo1.maven.org/maven2/org/apache/maven/reporting/maven-reporting-impl/2.0.4/maven-reporting-impl-2.0.4.pom
(2 KB at 360.7 KB/sec)
Downloading: http://repo1.maven.org/maven2/org/apache/maven/reporting/maven-reporting/2.0.4/maven-reporting-2.0.4.pom
Downloaded: http://repo1.maven.org/maven2/org/apache/maven/reporting/maven-reporting/2.0.4/maven-reporting-2.0.4.pom
(700 B at 136.7 KB/sec)
Downloading: http://repo1.maven.org/maven2/commons-validator/commons-validator/1.2.0/commons-validator-1.2.0.pom
Downloaded: http://repo1.maven.org/maven2/commons-validator/commons-validator/1.2.0/commons-validator-1.2.0.pom
(9 KB at 1774.2 KB/sec)
Downloading: http://repo1.maven.org/maven2/commons-beanutils/commons-beanutils/1.7.0/commons-beanutils-1.7.0.pom
Downloaded: http://repo1.maven.org/maven2/commons-beanutils/commons-beanutils/1.7.0/commons-beanutils-1.7.0.pom
(357 B at 34.9 KB/sec)
Downloading: http://repo1.maven.org/maven2/commons-logging/commons-logging/1.0.3/commons-logging-1.0.3.pom
Downloaded: http://repo1.maven.org/maven2/commons-logging/commons-logging/1.0.3/commons-logging-1.0.3.pom
(866 B at 94.0 KB/sec)
Downloading: http://repo1.maven.org/maven2/commons-digester/commons-digester/1.6/commons-digester-1.6.pom
Downloaded: http://repo1.maven.org/maven2/commons-digester/commons-digester/1.6/commons-digester-1.6.pom
(974 B at 73.2 KB/sec)
Downloading: http://repo1.maven.org/maven2/commons-beanutils/commons-beanutils/1.6/commons-beanutils-1.6.pom
Downloaded: http://repo1.maven.org/maven2/commons-beanutils/commons-beanutils/1.6/commons-beanutils-1.6.pom
(3 KB at 188.0 KB/sec)
Downloading: http://repo1.maven.org/maven2/commons-logging/commons-logging/1.0/commons-logging-1.0.pom
Downloaded: http://repo1.maven.org/maven2/commons-logging/commons-logging/1.0/commons-logging-1.0.pom
(163 B at 31.8 KB/sec)
Downloading: http://repo1.maven.org/maven2/xml-apis/xml-apis/1.0.b2/xml-apis-1.0.b2.pom
Downloaded: http://repo1.maven.org/maven2/xml-apis/xml-apis/1.0.b2/xml-apis-1.0.b2.pom (3
KB at 366.0 KB/sec)
Downloading: http://repo1.maven.org/maven2/commons-logging/commons-logging/1.0.4/commons-logging-1.0.4.pom
Downloaded: http://repo1.maven.org/maven2/commons-logging/commons-logging/1.0.4/commons-logging-1.0.4.pom
(6 KB at 571.2 KB/sec)
Downloading: http://repo1.maven.org/maven2/xml-apis/xml-apis/2.0.2/xml-apis-2.0.2.pom
Downloaded: http://repo1.maven.org/maven2/xml-apis/xml-apis/2.0.2/xml-apis-2.0.2.pom (346
B at 42.2 KB/sec)
Downloading: http://repo1.maven.org/maven2/org/apache/maven/doxia/doxia-core/1.0-alpha-7/doxia-core-1.0-alpha-7.pom
Downloaded: http://repo1.maven.org/maven2/org/apache/maven/doxia/doxia-core/1.0-alpha-7/doxia-core-1.0-alpha-7.pom
(2 KB at 73.1 KB/sec)
Downloading: http://repo1.maven.org/maven2/org/apache/maven/reporting/maven-reporting-api/2.0.4/maven-reporting-api-2.0.4.pom
Downloaded: http://repo1.maven.org/maven2/org/apache/maven/reporting/maven-reporting-api/2.0.4/maven-reporting-api-2.0.4.pom
(902 B at 73.4 KB/sec)
Downloading: http://repo1.maven.org/maven2/org/apache/maven/doxia/doxia-site-renderer/1.0-alpha-7/doxia-site-renderer-1.0-alpha-7.pom
Downloaded: http://repo1.maven.org/maven2/org/apache/maven/doxia/doxia-site-renderer/1.0-alpha-7/doxia-site-renderer-1.0-alpha-7.pom
(2 KB at 233.9 KB/sec)
Downloading: http://repo1.maven.org/maven2/org/codehaus/plexus/plexus-velocity/1.1.2/plexus-velocity-1.1.2.pom
Downloaded: http://repo1.maven.org/maven2/org/codehaus/plexus/plexus-velocity/1.1.2/plexus-velocity-1.1.2.pom
(8 KB at 1236.2 KB/sec)
Downloading: http://repo1.maven.org/maven2/org/codehaus/plexus/plexus-container-default/1.0-alpha-7/plexus-container-default-1.0-alpha-7.pom
Downloaded: http://repo1.maven.org/maven2/org/codehaus/plexus/plexus-container-default/1.0-alpha-7/plexus-container-default-1.0-alpha-7.pom
(2 KB at 179.8 KB/sec)
Downloading: http://repo1.maven.org/maven2/plexus/plexus-containers/1.0.2/plexus-containers-1.0.2.pom
Downloaded: http://repo1.maven.org/maven2/plexus/plexus-containers/1.0.2/plexus-containers-1.0.2.pom
(471 B at 92.0 KB/sec)
Downloading: http://repo1.maven.org/maven2/plexus/plexus-root/1.0.3/plexus-root-1.0.3.pom
Downloaded: http://repo1.maven.org/maven2/plexus/plexus-root/1.0.3/plexus-root-1.0.3.pom (6
KB at 839.7 KB/sec)
Downloading: http://repo1.maven.org/maven2/plexus/plexus-utils/1.0.2/plexus-utils-1.0.2.pom
Downloaded: http://repo1.maven.org/maven2/plexus/plexus-utils/1.0.2/plexus-utils-1.0.2.pom
(740 B at 120.4 KB/sec)
Downloading: http://repo1.maven.org/maven2/commons-logging/commons-logging-api/1.0.4/commons-logging-api-1.0.4.pom
Downloaded: http://repo1.maven.org/maven2/commons-logging/commons-logging-api/1.0.4/commons-logging-api-1.0.4.pom
(168 B at 27.3 KB/sec)
Downloading: http://repo1.maven.org/maven2/org/apache/maven/doxia/doxia-decoration-model/1.0-alpha-7/doxia-decoration-model-1.0-alpha-7.pom
Downloaded: http://repo1.maven.org/maven2/org/apache/maven/doxia/doxia-decoration-model/1.0-alpha-7/doxia-decoration-model-1.0-alpha-7.pom
(2 KB at 277.1 KB/sec)
Downloading: http://repo1.maven.org/maven2/org/apache/maven/shared/maven-plugin-testing-harness/1.0-beta-1/maven-plugin-testing-harness-1.0-beta-1.pom
Downloaded: http://repo1.maven.org/maven2/org/apache/maven/shared/maven-plugin-testing-harness/1.0-beta-1/maven-plugin-testing-harness-1.0-beta-1.pom
(2 KB at 208.2 KB/sec)
Downloading: http://repo1.maven.org/maven2/org/apache/maven/shared/maven-shared-components/1/maven-shared-components-1.pom
Downloaded: http://repo1.maven.org/maven2/org/apache/maven/shared/maven-shared-components/1/maven-shared-components-1.pom
(2 KB at 461.4 KB/sec)
Downloading: http://repo1.maven.org/maven2/org/apache/rat/apache-rat-core/0.7/apache-rat-core-0.7.jar
Downloading: http://repo1.maven.org/maven2/commons-io/commons-io/1.4/commons-io-1.4.jar
Downloading: http://repo1.maven.org/maven2/commons-cli/commons-cli/1.1/commons-cli-1.1.jar
Downloading: http://repo1.maven.org/maven2/org/codehaus/plexus/plexus-utils/1.4/plexus-utils-1.4.jar
Downloading: http://repo1.maven.org/maven2/org/apache/commons/commons-compress/1.0/commons-compress-1.0.jar
Downloaded: http://repo1.maven.org/maven2/org/apache/rat/apache-rat-core/0.7/apache-rat-core-0.7.jar
(95 KB at 10548.2 KB/sec)
Downloading: http://repo1.maven.org/maven2/org/apache/maven/doxia/doxia-site-renderer/1.0-alpha-8/doxia-site-renderer-1.0-alpha-8.jar
Downloaded: http://repo1.maven.org/maven2/commons-io/commons-io/1.4/commons-io-1.4.jar (107
KB at 10648.7 KB/sec)
Downloading: http://repo1.maven.org/maven2/org/apache/maven/doxia/doxia-core/1.0-alpha-8/doxia-core-1.0-alpha-8.jar
Downloaded: http://repo1.maven.org/maven2/org/apache/maven/doxia/doxia-site-renderer/1.0-alpha-8/doxia-site-renderer-1.0-alpha-8.jar
(34 KB at 5557.5 KB/sec)
Downloading: http://repo1.maven.org/maven2/org/apache/maven/doxia/doxia-sink-api/1.0-alpha-8/doxia-sink-api-1.0-alpha-8.jar
Downloaded: http://repo1.maven.org/maven2/org/apache/maven/doxia/doxia-core/1.0-alpha-8/doxia-core-1.0-alpha-8.jar
(200 KB at 22158.0 KB/sec)
Downloading: http://repo1.maven.org/maven2/org/apache/maven/doxia/doxia-decoration-model/1.0-alpha-8/doxia-decoration-model-1.0-alpha-8.jar
Downloaded: http://repo1.maven.org/maven2/org/apache/maven/doxia/doxia-sink-api/1.0-alpha-8/doxia-sink-api-1.0-alpha-8.jar
(7 KB at 1309.4 KB/sec)
Downloading: http://repo1.maven.org/maven2/org/apache/maven/reporting/maven-reporting-impl/2.0.4/maven-reporting-impl-2.0.4.jar
Downloaded: http://repo1.maven.org/maven2/commons-cli/commons-cli/1.1/commons-cli-1.1.jar
(36 KB at 1766.3 KB/sec)
Downloading: http://repo1.maven.org/maven2/commons-validator/commons-validator/1.2.0/commons-validator-1.2.0.jar
Downloaded: http://repo1.maven.org/maven2/org/apache/maven/doxia/doxia-decoration-model/1.0-alpha-8/doxia-decoration-model-1.0-alpha-8.jar
(40 KB at 5626.4 KB/sec)
Downloading: http://repo1.maven.org/maven2/commons-beanutils/commons-beanutils/1.7.0/commons-beanutils-1.7.0.jar
Downloaded: http://repo1.maven.org/maven2/org/apache/maven/reporting/maven-reporting-impl/2.0.4/maven-reporting-impl-2.0.4.jar
(14 KB at 2222.7 KB/sec)
Downloading: http://repo1.maven.org/maven2/commons-digester/commons-digester/1.6/commons-digester-1.6.jar
Downloaded: http://repo1.maven.org/maven2/commons-validator/commons-validator/1.2.0/commons-validator-1.2.0.jar
(89 KB at 8897.8 KB/sec)
Downloading: http://repo1.maven.org/maven2/commons-logging/commons-logging/1.0.4/commons-logging-1.0.4.jar
Downloaded: http://repo1.maven.org/maven2/commons-beanutils/commons-beanutils/1.7.0/commons-beanutils-1.7.0.jar
(185 KB at 23031.1 KB/sec)
Downloading: http://repo1.maven.org/maven2/xml-apis/xml-apis/1.0.b2/xml-apis-1.0.b2.jar
Downloaded: http://repo1.maven.org/maven2/commons-logging/commons-logging/1.0.4/commons-logging-1.0.4.jar
(38 KB at 6187.3 KB/sec)
Downloading: http://repo1.maven.org/maven2/oro/oro/2.0.7/oro-2.0.7.jar
Downloaded: http://repo1.maven.org/maven2/org/apache/commons/commons-compress/1.0/commons-compress-1.0.jar
(141 KB at 4013.6 KB/sec)
Downloading: http://repo1.maven.org/maven2/org/apache/maven/reporting/maven-reporting-api/2.0.4/maven-reporting-api-2.0.4.jar
Downloaded: http://repo1.maven.org/maven2/org/codehaus/plexus/plexus-utils/1.4/plexus-utils-1.4.jar
(178 KB at 4808.0 KB/sec)
Downloading: http://repo1.maven.org/maven2/org/apache/maven/shared/maven-plugin-testing-harness/1.0-beta-1/maven-plugin-testing-harness-1.0-beta-1.jar
Downloaded: http://repo1.maven.org/maven2/xml-apis/xml-apis/1.0.b2/xml-apis-1.0.b2.jar (107
KB at 15250.8 KB/sec)
Downloaded: http://repo1.maven.org/maven2/org/apache/maven/reporting/maven-reporting-api/2.0.4/maven-reporting-api-2.0.4.jar
(5 KB at 974.0 KB/sec)
Downloaded: http://repo1.maven.org/maven2/oro/oro/2.0.7/oro-2.0.7.jar (64 KB at 9127.4 KB/sec)
Downloaded: http://repo1.maven.org/maven2/commons-digester/commons-digester/1.6/commons-digester-1.6.jar
(165 KB at 8657.8 KB/sec)
Downloaded: http://repo1.maven.org/maven2/org/apache/maven/shared/maven-plugin-testing-harness/1.0-beta-1/maven-plugin-testing-harness-1.0-beta-1.jar
(18 KB at 2873.0 KB/sec)
[INFO] Exclude: dependency-reduced-pom.xml
[INFO] 
[INFO] --- maven-gpg-plugin:1.1:sign (default) @ sandesha2-parent ---
[INFO] 
[INFO] --- maven-install-plugin:2.3:install (default-install) @ sandesha2-parent ---
Downloading: http://repo1.maven.org/maven2/org/codehaus/plexus/plexus-digest/1.0/plexus-digest-1.0.pom
Downloaded: http://repo1.maven.org/maven2/org/codehaus/plexus/plexus-digest/1.0/plexus-digest-1.0.pom
(2 KB at 0.3 KB/sec)
Downloading: http://repo1.maven.org/maven2/org/codehaus/plexus/plexus-components/1.1.7/plexus-components-1.1.7.pom
Downloaded: http://repo1.maven.org/maven2/org/codehaus/plexus/plexus-components/1.1.7/plexus-components-1.1.7.pom
(5 KB at 142.9 KB/sec)
Downloading: http://repo1.maven.org/maven2/org/codehaus/plexus/plexus-digest/1.0/plexus-digest-1.0.jar
Downloaded: http://repo1.maven.org/maven2/org/codehaus/plexus/plexus-digest/1.0/plexus-digest-1.0.jar
(12 KB at 413.6 KB/sec)
[INFO] Installing <https://builds.apache.org/job/sandesha2-trunk/ws/sandesha2/pom.xml>
to <https://builds.apache.org/job/sandesha2-trunk/ws/.repository/org/apache/sandesha2/sandesha2-parent/1.7.0-SNAPSHOT/sandesha2-parent-1.7.0-SNAPSHOT.pom>
[INFO] 
[INFO] --- maven-deploy-plugin:2.5:deploy (default-deploy) @ sandesha2-parent ---
Downloading: https://repository.apache.org/content/repositories/snapshots/org/apache/sandesha2/sandesha2-parent/1.7.0-SNAPSHOT/maven-metadata.xml
Downloaded: https://repository.apache.org/content/repositories/snapshots/org/apache/sandesha2/sandesha2-parent/1.7.0-SNAPSHOT/maven-metadata.xml
(617 B at 0.4 KB/sec)
Uploading: https://repository.apache.org/content/repositories/snapshots/org/apache/sandesha2/sandesha2-parent/1.7.0-SNAPSHOT/sandesha2-parent-1.7.0-20140321.101349-700.pom
[INFO] ------------------------------------------------------------------------
[INFO] Reactor Summary:
[INFO] 
[INFO] Apache Sandesha ................................... FAILURE [57.096s]
[INFO] Sandesha2 - Resource bundle ....................... SKIPPED
[INFO] Sandesha2 - Core .................................. SKIPPED
[INFO] Sandesha2 - Mar ................................... SKIPPED
[INFO] Sandesha2 - Client ................................ SKIPPED
[INFO] Sandesha2 - Policy ................................ SKIPPED
[INFO] Sandesha2 - Rampart Integration ................... SKIPPED
[INFO] Sandesha2 - Samples ............................... SKIPPED
[INFO] Sandesha2 - Test Suite ............................ SKIPPED
[INFO] Sandesha2 - Interop ............................... SKIPPED
[INFO] Sandesha2 - Persistent Storage .................... SKIPPED
[INFO] Sandesha2 - Distribution .......................... SKIPPED
[INFO] ------------------------------------------------------------------------
[INFO] BUILD FAILURE
[INFO] ------------------------------------------------------------------------
[INFO] Total time: 1:06.294s
[INFO] Finished at: Fri Mar 21 10:14:05 UTC 2014
[INFO] Final Memory: 25M/490M
[INFO] ------------------------------------------------------------------------
Waiting for Jenkins to finish collecting data
[ERROR] Failed to execute goal org.apache.maven.plugins:maven-deploy-plugin:2.5:deploy (default-deploy)
on project sandesha2-parent: Failed to deploy artifacts: Could not transfer artifact org.apache.sandesha2:sandesha2-parent:pom:1.7.0-20140321.101349-700
from/to apache.snapshots.https (https://repository.apache.org/content/repositories/snapshots):
Failed to transfer file: https://repository.apache.org/content/repositories/snapshots/org/apache/sandesha2/sandesha2-parent/1.7.0-SNAPSHOT/sandesha2-parent-1.7.0-20140321.101349-700.pom.
Return code is: 400 -> [Help 1]
[ERROR] 
[ERROR] To see the full stack trace of the errors, re-run Maven with the -e switch.
[ERROR] Re-run Maven using the -X switch to enable full debug logging.
[ERROR] 
[ERROR] For more information about the errors and possible solutions, please read the following
articles:
[JENKINS] Archiving <https://builds.apache.org/job/sandesha2-trunk/ws/sandesha2/modules/tests/pom.xml>
to org.apache.sandesha2/sandesha2-tests/1.7.0-SNAPSHOT/sandesha2-tests-1.7.0-SNAPSHOT.pom
[ERROR] [Help 1] http://cwiki.apache.org/confluence/display/MAVEN/MojoExecutionException
[JENKINS] Archiving <https://builds.apache.org/job/sandesha2-trunk/ws/sandesha2/modules/rampart-integration/pom.xml>
to org.apache.sandesha2/sandesha2-rampart-integration/1.7.0-SNAPSHOT/sandesha2-rampart-integration-1.7.0-SNAPSHOT.pom
[JENKINS] Archiving <https://builds.apache.org/job/sandesha2-trunk/ws/sandesha2/modules/core/pom.xml>
to org.apache.sandesha2/sandesha2-core/1.7.0-SNAPSHOT/sandesha2-core-1.7.0-SNAPSHOT.pom
[JENKINS] Archiving <https://builds.apache.org/job/sandesha2-trunk/ws/sandesha2/modules/policy/pom.xml>
to org.apache.sandesha2/sandesha2-policy/1.7.0-SNAPSHOT/sandesha2-policy-1.7.0-SNAPSHOT.pom
[JENKINS] Archiving <https://builds.apache.org/job/sandesha2-trunk/ws/sandesha2/modules/client/pom.xml>
to org.apache.sandesha2/sandesha2-client-constants/1.7.0-SNAPSHOT/sandesha2-client-constants-1.7.0-SNAPSHOT.pom
[JENKINS] Archiving <https://builds.apache.org/job/sandesha2-trunk/ws/sandesha2/modules/mar/pom.xml>
to org.apache.sandesha2/sandesha2/1.7.0-SNAPSHOT/sandesha2-1.7.0-SNAPSHOT.pom
[JENKINS] Archiving <https://builds.apache.org/job/sandesha2-trunk/ws/sandesha2/modules/samples/pom.xml>
to org.apache.sandesha2/sandesha2-samples/1.7.0-SNAPSHOT/sandesha2-samples-1.7.0-SNAPSHOT.pom
[JENKINS] Archiving <https://builds.apache.org/job/sandesha2-trunk/ws/sandesha2/modules/resource-bundle/pom.xml>
to org.apache.sandesha2/sandesha2-resource-bundle/1.7.0-SNAPSHOT/sandesha2-resource-bundle-1.7.0-SNAPSHOT.pom
[JENKINS] Archiving <https://builds.apache.org/job/sandesha2-trunk/ws/sandesha2/pom.xml>
to org.apache.sandesha2/sandesha2-parent/1.7.0-SNAPSHOT/sandesha2-parent-1.7.0-SNAPSHOT.pom
[JENKINS] Archiving <https://builds.apache.org/job/sandesha2-trunk/ws/sandesha2/modules/distribution/pom.xml>
to org.apache.sandesha2/distribution/1.7.0-SNAPSHOT/distribution-1.7.0-SNAPSHOT.pom
[JENKINS] Archiving <https://builds.apache.org/job/sandesha2-trunk/ws/sandesha2/modules/persistence/pom.xml>
to org.apache.sandesha2/sandesha2-persistence/1.7.0-SNAPSHOT/sandesha2-persistence-1.7.0-SNAPSHOT.pom
[JENKINS] Archiving <https://builds.apache.org/job/sandesha2-trunk/ws/sandesha2/modules/interop/pom.xml>
to org.apache.sandesha2/sandesha2-interop/1.7.0-SNAPSHOT/sandesha2-interop-1.7.0-SNAPSHOT.pom
Sending e-mails to: java-dev@axis.apache.org
channel stopped

---------------------------------------------------------------------
To unsubscribe, e-mail: java-dev-unsubscribe@axis.apache.org
For additional commands, e-mail: java-dev-help@axis.apache.org


Mime
View raw message