axis-java-dev mailing list archives

Site index · List index
Message view « Date » · « Thread »
Top « Date » · « Thread »
From Apache Jenkins Server <jenk...@builds.apache.org>
Subject Build failed in Jenkins: axis-trunk » Axis Runtime Core #247
Date Wed, 05 Feb 2014 13:57:58 GMT
See <https://builds.apache.org/job/axis-trunk/org.apache.axis$axis-rt-core/247/>

------------------------------------------
[...truncated 54 lines...]
[ERROR] <https://builds.apache.org/job/axis-trunk/org.apache.axis$axis-rt-core/ws/src/test/java/test/soap12/TestDeser.java>:[3,23]
package junit.framework does not exist
[ERROR] <https://builds.apache.org/job/axis-trunk/org.apache.axis$axis-rt-core/ws/src/test/java/test/soap12/TestDeser.java>:[29,31]
cannot find symbol
symbol: class TestCase
public class TestDeser extends TestCase {
[ERROR] <https://builds.apache.org/job/axis-trunk/org.apache.axis$axis-rt-core/ws/src/test/java/test/types/TestNCName.java>:[19,23]
package junit.framework does not exist
[ERROR] <https://builds.apache.org/job/axis-trunk/org.apache.axis$axis-rt-core/ws/src/test/java/test/types/TestNCName.java>:[25,32]
cannot find symbol
symbol: class TestCase
public class TestNCName extends TestCase {
[ERROR] <https://builds.apache.org/job/axis-trunk/org.apache.axis$axis-rt-core/ws/src/test/java/test/saaj/TestText.java>:[24,45]
package junit.framework does not exist
[ERROR] <https://builds.apache.org/job/axis-trunk/org.apache.axis$axis-rt-core/ws/src/test/java/test/encoding/TestBeanDeser.java>:[3,23]
package junit.framework does not exist
[ERROR] <https://builds.apache.org/job/axis-trunk/org.apache.axis$axis-rt-core/ws/src/test/java/test/encoding/TestBeanDeser.java>:[21,35]
cannot find symbol
symbol: class TestCase
public class TestBeanDeser extends TestCase {
[ERROR] <https://builds.apache.org/job/axis-trunk/org.apache.axis$axis-rt-core/ws/src/test/java/test/encoding/TestMultiRefIdentity.java>:[19,23]
package junit.framework does not exist
[ERROR] <https://builds.apache.org/job/axis-trunk/org.apache.axis$axis-rt-core/ws/src/test/java/test/encoding/TestMultiRefIdentity.java>:[30,42]
cannot find symbol
symbol: class TestCase
public class TestMultiRefIdentity extends TestCase {
[ERROR] <https://builds.apache.org/job/axis-trunk/org.apache.axis$axis-rt-core/ws/src/test/java/test/soap12/TestSer.java>:[3,23]
package junit.framework does not exist
[ERROR] <https://builds.apache.org/job/axis-trunk/org.apache.axis$axis-rt-core/ws/src/test/java/test/soap12/TestSer.java>:[32,29]
cannot find symbol
symbol: class TestCase
public class TestSer extends TestCase {
[ERROR] <https://builds.apache.org/job/axis-trunk/org.apache.axis$axis-rt-core/ws/src/test/java/test/AxisTestBase.java>:[26,16]
cannot access junit.framework.TestCase
file junit/framework/TestCase.class not found
public abstract class AxisTestBase extends XMLTestCase {
[ERROR] <https://builds.apache.org/job/axis-trunk/org.apache.axis$axis-rt-core/ws/src/test/java/test/encoding/TestArray.java>:[15,31]
cannot find symbol
symbol: class TestCase
public class TestArray extends TestCase {
[ERROR] <https://builds.apache.org/job/axis-trunk/org.apache.axis$axis-rt-core/ws/src/test/java/test/utils/TestMessages.java>:[3,23]
package junit.framework does not exist
[ERROR] <https://builds.apache.org/job/axis-trunk/org.apache.axis$axis-rt-core/ws/src/test/java/test/utils/TestMessages.java>:[17,34]
cannot find symbol
symbol: class TestCase
public class TestMessages extends TestCase {
[ERROR] <https://builds.apache.org/job/axis-trunk/org.apache.axis$axis-rt-core/ws/src/test/java/test/wsdd/TestXSD.java>:[13,29]
cannot find symbol
symbol: class TestCase
public class TestXSD extends TestCase {
[ERROR] <https://builds.apache.org/job/axis-trunk/org.apache.axis$axis-rt-core/ws/src/test/java/test/types/TestNMToken.java>:[25,33]
cannot find symbol
symbol: class TestCase
public class TestNMToken extends TestCase {
[ERROR] <https://builds.apache.org/job/axis-trunk/org.apache.axis$axis-rt-core/ws/src/test/java/test/encoding/TestXsiType.java>:[26,33]
cannot find symbol
symbol: class TestCase
public class TestXsiType extends TestCase {
[ERROR] <https://builds.apache.org/job/axis-trunk/org.apache.axis$axis-rt-core/ws/src/test/java/test/soap12/TestFault.java>:[24,31]
cannot find symbol
symbol: class TestCase
public class TestFault extends TestCase {
[ERROR] <https://builds.apache.org/job/axis-trunk/org.apache.axis$axis-rt-core/ws/src/test/java/test/message/TestMessageSerialization.java>:[32,46]
cannot find symbol
symbol: class TestCase
public class TestMessageSerialization extends TestCase {
[ERROR] <https://builds.apache.org/job/axis-trunk/org.apache.axis$axis-rt-core/ws/src/test/java/test/types/TestToken.java>:[25,31]
cannot find symbol
symbol: class TestCase
public class TestToken extends TestCase {
[ERROR] <https://builds.apache.org/job/axis-trunk/org.apache.axis$axis-rt-core/ws/src/test/java/test/GenericLocalTest.java>:[47,47]
cannot find symbol
symbol: class TestCase
public abstract class GenericLocalTest extends TestCase {
[ERROR] <https://builds.apache.org/job/axis-trunk/org.apache.axis$axis-rt-core/ws/src/test/java/test/utils/bytecode/TestChainedParamReader.java>:[18,44]
cannot find symbol
symbol: class TestCase
public class TestChainedParamReader extends TestCase{
[ERROR] <https://builds.apache.org/job/axis-trunk/org.apache.axis$axis-rt-core/ws/src/test/java/test/soap/TestHeaderAttrs.java>:[40,37]
cannot find symbol
symbol: class TestCase
public class TestHeaderAttrs extends TestCase {
[ERROR] <https://builds.apache.org/job/axis-trunk/org.apache.axis$axis-rt-core/ws/src/test/java/test/outparams2/TestOutParams2.java>:[31,36]
cannot find symbol
symbol: class TestCase
public class TestOutParams2 extends TestCase {
[ERROR] <https://builds.apache.org/job/axis-trunk/org.apache.axis$axis-rt-core/ws/src/test/java/test/soap12/TestEncodingStyle.java>:[40,39]
cannot find symbol
symbol: class TestCase
public class TestEncodingStyle extends TestCase {
[ERROR] <https://builds.apache.org/job/axis-trunk/org.apache.axis$axis-rt-core/ws/src/test/java/test/wsdd/TestUndeployment.java>:[20,38]
cannot find symbol
symbol: class TestCase
public class TestUndeployment extends TestCase
[ERROR] <https://builds.apache.org/job/axis-trunk/org.apache.axis$axis-rt-core/ws/src/test/java/test/properties/TestScopedProperties.java>:[37,42]
cannot find symbol
symbol: class TestCase
public class TestScopedProperties extends TestCase {
[ERROR] <https://builds.apache.org/job/axis-trunk/org.apache.axis$axis-rt-core/ws/src/test/java/test/encoding/TestDefaultTM.java>:[28,35]
cannot find symbol
symbol: class TestCase
public class TestDefaultTM extends TestCase {
[ERROR] <https://builds.apache.org/job/axis-trunk/org.apache.axis$axis-rt-core/ws/src/test/java/test/encoding/TestDerivatedBeanSerializer.java>:[43,49]
cannot find symbol
symbol: class TestCase
public class TestDerivatedBeanSerializer extends TestCase {
[ERROR] <https://builds.apache.org/job/axis-trunk/org.apache.axis$axis-rt-core/ws/src/test/java/test/utils/TestSrcContent.java>:[3,23]
package junit.framework does not exist
[ERROR] <https://builds.apache.org/job/axis-trunk/org.apache.axis$axis-rt-core/ws/src/test/java/test/utils/TestSrcContent.java>:[37,36]
cannot find symbol
symbol: class TestCase
public class TestSrcContent extends TestCase {
[ERROR] <https://builds.apache.org/job/axis-trunk/org.apache.axis$axis-rt-core/ws/src/test/java/test/utils/TestStringUtils.java>:[7,37]
cannot find symbol
symbol: class TestCase
public class TestStringUtils extends TestCase
[ERROR] <https://builds.apache.org/job/axis-trunk/org.apache.axis$axis-rt-core/ws/src/test/java/test/outparams/TestOutParams.java>:[25,35]
cannot find symbol
symbol: class TestCase
public class TestOutParams extends TestCase {
[ERROR] <https://builds.apache.org/job/axis-trunk/org.apache.axis$axis-rt-core/ws/src/test/java/test/types/TestName.java>:[25,30]
cannot find symbol
symbol: class TestCase
public class TestName extends TestCase {
[ERROR] <https://builds.apache.org/job/axis-trunk/org.apache.axis$axis-rt-core/ws/src/test/java/test/encoding/TestAutoTypes.java>:[16,35]
cannot find symbol
symbol: class TestCase
public class TestAutoTypes extends TestCase {
[ERROR] <https://builds.apache.org/job/axis-trunk/org.apache.axis$axis-rt-core/ws/src/test/java/test/encoding/TestOmittedValues.java>:[45,39]
cannot find symbol
symbol: class TestCase
public class TestOmittedValues extends TestCase {
[ERROR] <https://builds.apache.org/job/axis-trunk/org.apache.axis$axis-rt-core/ws/src/test/java/test/encoding/TestAttributes.java>:[34,36]
cannot find symbol
symbol: class TestCase
public class TestAttributes extends TestCase {
[ERROR] <https://builds.apache.org/job/axis-trunk/org.apache.axis$axis-rt-core/ws/src/test/java/test/wsdd/TestOptions.java>:[9,33]
cannot find symbol
symbol: class TestCase
public class TestOptions extends TestCase
[ERROR] <https://builds.apache.org/job/axis-trunk/org.apache.axis$axis-rt-core/ws/src/test/java/test/wsdd/TestJAXRPCHandlerInfoChain.java>:[42,48]
cannot find symbol
symbol: class TestCase
public class TestJAXRPCHandlerInfoChain extends TestCase implements Handler {
[ERROR] <https://builds.apache.org/job/axis-trunk/org.apache.axis$axis-rt-core/ws/src/test/java/test/encoding/TestArrayListConversions.java>:[20,46]
cannot find symbol
symbol: class TestCase
public class TestArrayListConversions extends TestCase {
[ERROR] <https://builds.apache.org/job/axis-trunk/org.apache.axis$axis-rt-core/ws/src/test/java/test/encoding/TestRoundTrip.java>:[20,35]
cannot find symbol
symbol: class TestCase
public class TestRoundTrip extends TestCase {
[ERROR] <https://builds.apache.org/job/axis-trunk/org.apache.axis$axis-rt-core/ws/src/test/java/test/utils/TestJavaUtils.java>:[17,35]
cannot find symbol
symbol: class TestCase
public class TestJavaUtils extends TestCase
[ERROR] <https://builds.apache.org/job/axis-trunk/org.apache.axis$axis-rt-core/ws/src/test/java/test/types/TestYearMonth.java>:[25,35]
cannot find symbol
symbol: class TestCase
public class TestYearMonth extends TestCase {
[ERROR] <https://builds.apache.org/job/axis-trunk/org.apache.axis$axis-rt-core/ws/src/test/java/test/types/TestDay.java>:[27,29]
cannot find symbol
symbol: class TestCase
public class TestDay extends TestCase {
[ERROR] <https://builds.apache.org/job/axis-trunk/org.apache.axis$axis-rt-core/ws/src/test/java/test/types/TestPositiveInteger.java>:[25,41]
cannot find symbol
symbol: class TestCase
public class TestPositiveInteger extends TestCase {
[ERROR] <https://builds.apache.org/job/axis-trunk/org.apache.axis$axis-rt-core/ws/src/test/java/test/encoding/TestString3.java>:[17,33]
cannot find symbol
symbol: class TestCase
public class TestString3 extends TestCase {
[ERROR] <https://builds.apache.org/job/axis-trunk/org.apache.axis$axis-rt-core/ws/src/test/java/test/types/TestYear.java>:[25,30]
cannot find symbol
symbol: class TestCase
public class TestYear extends TestCase {
[ERROR] <https://builds.apache.org/job/axis-trunk/org.apache.axis$axis-rt-core/ws/src/test/java/test/soap12/TestRPC.java>:[29,29]
cannot find symbol
symbol: class TestCase
public class TestRPC extends TestCase {
[ERROR] <https://builds.apache.org/job/axis-trunk/org.apache.axis$axis-rt-core/ws/src/test/java/test/message/TestMUValues.java>:[22,34]
cannot find symbol
symbol: class TestCase
public class TestMUValues extends TestCase {
[ERROR] <https://builds.apache.org/job/axis-trunk/org.apache.axis$axis-rt-core/ws/src/test/java/test/types/TestMonthDay.java>:[27,34]
cannot find symbol
symbol: class TestCase
public class TestMonthDay extends TestCase {
[ERROR] <https://builds.apache.org/job/axis-trunk/org.apache.axis$axis-rt-core/ws/src/test/java/test/types/TestUnsignedInt.java>:[25,37]
cannot find symbol
symbol: class TestCase
public class TestUnsignedInt extends TestCase {
[ERROR] <https://builds.apache.org/job/axis-trunk/org.apache.axis$axis-rt-core/ws/src/test/java/test/types/TestDuration.java>:[31,34]
cannot find symbol
symbol: class TestCase
public class TestDuration extends TestCase {
[ERROR] <https://builds.apache.org/job/axis-trunk/org.apache.axis$axis-rt-core/ws/src/test/java/test/utils/TestOptions.java>:[8,33]
cannot find symbol
symbol: class TestCase
public class TestOptions extends TestCase
[ERROR] <https://builds.apache.org/job/axis-trunk/org.apache.axis$axis-rt-core/ws/src/test/java/test/message/TestJavaSerialization.java>:[47,43]
cannot find symbol
symbol: class TestCase
public class TestJavaSerialization extends TestCase {
[ERROR] <https://builds.apache.org/job/axis-trunk/org.apache.axis$axis-rt-core/ws/src/test/java/test/wsdd/TestAllowedMethods.java>:[19,40]
cannot find symbol
symbol: class TestCase
public class TestAllowedMethods extends TestCase {
[ERROR] <https://builds.apache.org/job/axis-trunk/org.apache.axis$axis-rt-core/ws/src/test/java/test/outparams2/TestOutParams.java>:[23,35]
cannot find symbol
symbol: class TestCase
public class TestOutParams extends TestCase {
[ERROR] <https://builds.apache.org/job/axis-trunk/org.apache.axis$axis-rt-core/ws/src/test/java/test/types/TestId.java>:[25,28]
cannot find symbol
symbol: class TestCase
public class TestId extends TestCase {
[ERROR] <https://builds.apache.org/job/axis-trunk/org.apache.axis$axis-rt-core/ws/src/test/java/test/encoding/TestString2.java>:[18,33]
cannot find symbol
symbol: class TestCase
public class TestString2 extends TestCase {
[ERROR] <https://builds.apache.org/job/axis-trunk/org.apache.axis$axis-rt-core/ws/src/test/java/test/wsdd/TestRoles.java>:[11,31]
cannot find symbol
symbol: class TestCase
public class TestRoles extends TestCase
[ERROR] <https://builds.apache.org/job/axis-trunk/org.apache.axis$axis-rt-core/ws/src/test/java/test/types/TestNormalizedString.java>:[25,42]
cannot find symbol
symbol: class TestCase
public class TestNormalizedString extends TestCase {
[ERROR] <https://builds.apache.org/job/axis-trunk/org.apache.axis$axis-rt-core/ws/src/test/java/test/typedesc/TestTypesNonBeanCompatible.java>:[32,48]
cannot find symbol
symbol: class TestCase
public class TestTypesNonBeanCompatible extends TestCase {
[ERROR] <https://builds.apache.org/job/axis-trunk/org.apache.axis$axis-rt-core/ws/src/test/java/test/soap12/TestHrefs.java>:[20,31]
cannot find symbol
symbol: class TestCase
public class TestHrefs extends TestCase {
[ERROR] <https://builds.apache.org/job/axis-trunk/org.apache.axis$axis-rt-core/ws/src/test/java/test/encoding/TestHrefs.java>:[20,31]
cannot find symbol
symbol: class TestCase
public class TestHrefs extends TestCase {
[ERROR] <https://builds.apache.org/job/axis-trunk/org.apache.axis$axis-rt-core/ws/src/test/java/test/encoding/TestBody.java>:[21,30]
cannot find symbol
symbol: class TestCase
public class TestBody extends TestCase {
[ERROR] <https://builds.apache.org/job/axis-trunk/org.apache.axis$axis-rt-core/ws/src/test/java/test/components/TestUUID.java>:[31,30]
cannot find symbol
symbol: class TestCase
public class TestUUID extends TestCase {
[ERROR] <https://builds.apache.org/job/axis-trunk/org.apache.axis$axis-rt-core/ws/src/test/java/test/soap12/TestVersionMismatch.java>:[26,0]
package junit.framework does not exist
[ERROR] <https://builds.apache.org/job/axis-trunk/org.apache.axis$axis-rt-core/ws/src/test/java/test/soap12/TestVersionMismatch.java>:[37,41]
cannot find symbol
symbol: class TestCase
public class TestVersionMismatch extends TestCase {
[ERROR] <https://builds.apache.org/job/axis-trunk/org.apache.axis$axis-rt-core/ws/src/test/java/test/types/TestNonPositiveInteger.java>:[25,44]
cannot find symbol
symbol: class TestCase
public class TestNonPositiveInteger extends TestCase {
[ERROR] <https://builds.apache.org/job/axis-trunk/org.apache.axis$axis-rt-core/ws/src/test/java/test/chains/TestSimpleChain.java>:[26,37]
cannot find symbol
symbol: class TestCase
public class TestSimpleChain extends TestCase
[ERROR] <https://builds.apache.org/job/axis-trunk/org.apache.axis$axis-rt-core/ws/src/test/java/test/types/TestNegativeInteger.java>:[25,41]
cannot find symbol
symbol: class TestCase
public class TestNegativeInteger extends TestCase {
[ERROR] <https://builds.apache.org/job/axis-trunk/org.apache.axis$axis-rt-core/ws/src/test/java/test/encoding/EncodingTest.java>:[14,34]
cannot find symbol
symbol: class TestCase
public class EncodingTest extends TestCase {
[ERROR] <https://builds.apache.org/job/axis-trunk/org.apache.axis$axis-rt-core/ws/src/test/java/test/MSGDispatch/TestMessageService.java>:[45,40]
cannot find symbol
symbol: class TestCase
public class TestMessageService extends TestCase {
[ERROR] <https://builds.apache.org/job/axis-trunk/org.apache.axis$axis-rt-core/ws/src/test/java/test/wsdd/TestGlobalConfiguration.java>:[9,45]
cannot find symbol
symbol: class TestCase
public class TestGlobalConfiguration extends TestCase
[ERROR] <https://builds.apache.org/job/axis-trunk/org.apache.axis$axis-rt-core/ws/src/test/java/test/utils/bytecode/TestParamNameExtractor.java>:[18,44]
cannot find symbol
symbol: class TestCase
public class TestParamNameExtractor extends TestCase {
[ERROR] <https://builds.apache.org/job/axis-trunk/org.apache.axis$axis-rt-core/ws/src/test/java/test/message/TestText.java>:[12,30]
cannot find symbol
symbol: class TestCase
public class TestText extends TestCase
[ERROR] <https://builds.apache.org/job/axis-trunk/org.apache.axis$axis-rt-core/ws/src/test/java/test/saaj/TestEnvelope.java>:[26,23]
package junit.framework does not exist
[ERROR] <https://builds.apache.org/job/axis-trunk/org.apache.axis$axis-rt-core/ws/src/test/java/test/types/TestURI.java>:[25,29]
cannot find symbol
symbol: class TestCase
public class TestURI extends TestCase {
[ERROR] <https://builds.apache.org/job/axis-trunk/org.apache.axis$axis-rt-core/ws/src/test/java/test/concurrency/TestApplicationScope.java>:[40,42]
cannot find symbol
symbol: class TestCase
public class TestApplicationScope extends TestCase {
[ERROR] <https://builds.apache.org/job/axis-trunk/org.apache.axis$axis-rt-core/ws/src/test/java/test/encoding/TestSer.java>:[31,29]
cannot find symbol
symbol: class TestCase
public class TestSer extends TestCase {
[ERROR] <https://builds.apache.org/job/axis-trunk/org.apache.axis$axis-rt-core/ws/src/test/java/test/faults/FaultDecode.java>:[18,23]
package junit.framework does not exist
[ERROR] <https://builds.apache.org/job/axis-trunk/org.apache.axis$axis-rt-core/ws/src/test/java/test/faults/FaultDecode.java>:[20,23]
package junit.framework does not exist
[ERROR] <https://builds.apache.org/job/axis-trunk/org.apache.axis$axis-rt-core/ws/src/test/java/test/faults/FaultDecode.java>:[21,20]
package junit.textui does not exist
[ERROR] <https://builds.apache.org/job/axis-trunk/org.apache.axis$axis-rt-core/ws/src/test/java/test/faults/FaultDecode.java>:[41,33]
cannot find symbol
symbol: class TestCase
public class FaultDecode extends TestCase {
[ERROR] <https://builds.apache.org/job/axis-trunk/org.apache.axis$axis-rt-core/ws/src/test/java/test/faults/FaultDecode.java>:[51,18]
cannot find symbol
symbol  : class Test
location: class test.faults.FaultDecode
[ERROR] <https://builds.apache.org/job/axis-trunk/org.apache.axis$axis-rt-core/ws/src/test/java/test/wsdd/TestScopeOption.java>:[9,37]
cannot find symbol
symbol: class TestCase
public class TestScopeOption extends TestCase
[ERROR] <https://builds.apache.org/job/axis-trunk/org.apache.axis$axis-rt-core/ws/src/test/java/test/wsdd/TestAdminService.java>:[19,38]
cannot find symbol
symbol: class TestCase
public class TestAdminService extends TestCase
[ERROR] <https://builds.apache.org/job/axis-trunk/org.apache.axis$axis-rt-core/ws/src/test/java/test/saaj/TestSOAPElement.java>:[26,37]
cannot find symbol
symbol: class TestCase
public class TestSOAPElement extends TestCase
[ERROR] <https://builds.apache.org/job/axis-trunk/org.apache.axis$axis-rt-core/ws/src/test/java/test/servicedesc/TestServiceDesc.java>:[26,37]
cannot find symbol
symbol: class TestCase
public class TestServiceDesc extends TestCase {
[ERROR] <https://builds.apache.org/job/axis-trunk/org.apache.axis$axis-rt-core/ws/src/test/java/test/message/TestSOAPHeader.java>:[39,36]
cannot find symbol
symbol: class TestCase
public class TestSOAPHeader extends TestCase {
[ERROR] <https://builds.apache.org/job/axis-trunk/org.apache.axis$axis-rt-core/ws/src/test/java/test/providers/TestBasicProvider.java>:[46,39]
cannot find symbol
symbol: class TestCase
public class TestBasicProvider extends TestCase {
[INFO] 100 errors 
[INFO] -------------------------------------------------------------

---------------------------------------------------------------------
To unsubscribe, e-mail: java-dev-unsubscribe@axis.apache.org
For additional commands, e-mail: java-dev-help@axis.apache.org


Mime
View raw message