axis-java-dev mailing list archives

Site index · List index
Message view « Date » · « Thread »
Top « Date » · « Thread »
From Apache Jenkins Server <jenk...@builds.apache.org>
Subject Build failed in Jenkins: axis2-1.6 #338
Date Thu, 02 Jan 2014 05:14:18 GMT
See <https://builds.apache.org/job/axis2-1.6/338/>

------------------------------------------
[...truncated 10944 lines...]
[ERROR] <https://builds.apache.org/job/axis2-1.6/ws/axis2/modules/transport/testkit/src/main/java/org/apache/axis2/transport/testkit/doclet/TestkitJavadocDoclet.java>:[52,32]
cannot find symbol
symbol  : class RootDoc
location: class org.apache.axis2.transport.testkit.doclet.TestkitJavadocDoclet

[ERROR] <https://builds.apache.org/job/axis2-1.6/ws/axis2/modules/transport/testkit/src/main/java/org/apache/axis2/transport/testkit/doclet/ResourceInfoDoclet.java>:[46,13]
cannot find symbol
symbol  : class ClassDoc
location: class org.apache.axis2.transport.testkit.doclet.ResourceInfoDoclet

[ERROR] <https://builds.apache.org/job/axis2-1.6/ws/axis2/modules/transport/testkit/src/main/java/org/apache/axis2/transport/testkit/doclet/ResourceInfoDoclet.java>:[48,17]
cannot find symbol
symbol  : class MethodDoc
location: class org.apache.axis2.transport.testkit.doclet.ResourceInfoDoclet

[ERROR] <https://builds.apache.org/job/axis2-1.6/ws/axis2/modules/transport/testkit/src/main/java/org/apache/axis2/transport/testkit/doclet/ResourceInfoDoclet.java>:[53,20]
cannot find symbol
symbol  : class ParamTag
location: class org.apache.axis2.transport.testkit.doclet.ResourceInfoDoclet

[ERROR] <https://builds.apache.org/job/axis2-1.6/ws/axis2/modules/transport/testkit/src/main/java/org/apache/axis2/transport/testkit/doclet/ResourceInfoDoclet.java>:[54,25]
cannot find symbol
symbol  : class Parameter
location: class org.apache.axis2.transport.testkit.doclet.ResourceInfoDoclet

[ERROR] <https://builds.apache.org/job/axis2-1.6/ws/axis2/modules/transport/testkit/src/main/java/org/apache/axis2/transport/testkit/doclet/ResourceInfoDoclet.java>:[55,24]
cannot find symbol
symbol  : class Type
location: class org.apache.axis2.transport.testkit.doclet.ResourceInfoDoclet

[ERROR] <https://builds.apache.org/job/axis2-1.6/ws/axis2/modules/transport/testkit/src/main/java/org/apache/axis2/transport/testkit/doclet/ResourceInfoDoclet.java>:[58,29]
cannot find symbol
symbol  : class ParamTag
location: class org.apache.axis2.transport.testkit.doclet.ResourceInfoDoclet

[ERROR] <https://builds.apache.org/job/axis2-1.6/ws/axis2/modules/transport/testkit/src/main/java/org/apache/axis2/transport/testkit/doclet/ResourceInfoDoclet.java>:[84,13]
cannot find symbol
symbol  : class AnnotationDesc
location: class org.apache.axis2.transport.testkit.doclet.ResourceInfoDoclet

[ERROR] <https://builds.apache.org/job/axis2-1.6/ws/axis2/modules/transport/testkit/src/main/java/org/apache/axis2/transport/testkit/doclet/ResourceInfoDoclet.java>:[93,8]
cannot find symbol
symbol  : class Tag
location: class org.apache.axis2.transport.testkit.doclet.ResourceInfoDoclet

[ERROR] <https://builds.apache.org/job/axis2-1.6/ws/axis2/modules/transport/testkit/src/main/java/org/apache/axis2/transport/testkit/doclet/ResourceInfoDoclet.java>:[98,13]
cannot find symbol
symbol  : class Tag
location: class org.apache.axis2.transport.testkit.doclet.ResourceInfoDoclet

[ERROR] <https://builds.apache.org/job/axis2-1.6/ws/axis2/modules/transport/testkit/src/main/java/org/apache/axis2/transport/testkit/doclet/ResourceInfoDoclet.java>:[99,31]
cannot find symbol
symbol  : class SeeTag
location: class org.apache.axis2.transport.testkit.doclet.ResourceInfoDoclet

[ERROR] <https://builds.apache.org/job/axis2-1.6/ws/axis2/modules/transport/testkit/src/main/java/org/apache/axis2/transport/testkit/doclet/ResourceInfoDoclet.java>:[103,32]
cannot find symbol
symbol  : class SeeTag
location: class org.apache.axis2.transport.testkit.doclet.ResourceInfoDoclet

[ERROR] <https://builds.apache.org/job/axis2-1.6/ws/axis2/modules/transport/testkit/src/main/java/org/apache/axis2/transport/testkit/doclet/TestkitJavadocDoclet.java>:[37,15]
cannot find symbol
symbol  : variable Standard
location: class org.apache.axis2.transport.testkit.doclet.TestkitJavadocDoclet

[ERROR] <https://builds.apache.org/job/axis2-1.6/ws/axis2/modules/transport/testkit/src/main/java/org/apache/axis2/transport/testkit/doclet/TestkitJavadocDoclet.java>:[44,19]
cannot find symbol
symbol  : variable Standard
location: class org.apache.axis2.transport.testkit.doclet.TestkitJavadocDoclet

[ERROR] <https://builds.apache.org/job/axis2-1.6/ws/axis2/modules/transport/testkit/src/main/java/org/apache/axis2/transport/testkit/doclet/TestkitJavadocDoclet.java>:[49,15]
cannot find symbol
symbol  : variable Standard
location: class org.apache.axis2.transport.testkit.doclet.TestkitJavadocDoclet

[ERROR] <https://builds.apache.org/job/axis2-1.6/ws/axis2/modules/transport/testkit/src/main/java/org/apache/axis2/transport/testkit/doclet/TestkitJavadocDoclet.java>:[57,13]
cannot find symbol
symbol  : class ClassDoc
location: class org.apache.axis2.transport.testkit.doclet.TestkitJavadocDoclet

[ERROR] <https://builds.apache.org/job/axis2-1.6/ws/axis2/modules/transport/testkit/src/main/java/org/apache/axis2/transport/testkit/doclet/TestkitJavadocDoclet.java>:[101,15]
cannot find symbol
symbol  : variable Standard
location: class org.apache.axis2.transport.testkit.doclet.TestkitJavadocDoclet

[INFO] 41 errors 
[INFO] -------------------------------------------------------------
[INFO] ------------------------------------------------------------------------
[ERROR] BUILD FAILURE
[INFO] ------------------------------------------------------------------------
[INFO] Compilation failure

<https://builds.apache.org/job/axis2-1.6/ws/axis2/modules/transport/testkit/src/main/java/org/apache/axis2/transport/testkit/doclet/ResourceInfoDoclet.java>:[27,23]
package com.sun.javadoc does not exist

<https://builds.apache.org/job/axis2-1.6/ws/axis2/modules/transport/testkit/src/main/java/org/apache/axis2/transport/testkit/doclet/ResourceInfoDoclet.java>:[28,23]
package com.sun.javadoc does not exist

<https://builds.apache.org/job/axis2-1.6/ws/axis2/modules/transport/testkit/src/main/java/org/apache/axis2/transport/testkit/doclet/ResourceInfoDoclet.java>:[29,23]
package com.sun.javadoc does not exist

<https://builds.apache.org/job/axis2-1.6/ws/axis2/modules/transport/testkit/src/main/java/org/apache/axis2/transport/testkit/doclet/ResourceInfoDoclet.java>:[30,23]
package com.sun.javadoc does not exist

<https://builds.apache.org/job/axis2-1.6/ws/axis2/modules/transport/testkit/src/main/java/org/apache/axis2/transport/testkit/doclet/ResourceInfoDoclet.java>:[31,23]
package com.sun.javadoc does not exist

<https://builds.apache.org/job/axis2-1.6/ws/axis2/modules/transport/testkit/src/main/java/org/apache/axis2/transport/testkit/doclet/ResourceInfoDoclet.java>:[32,23]
package com.sun.javadoc does not exist

<https://builds.apache.org/job/axis2-1.6/ws/axis2/modules/transport/testkit/src/main/java/org/apache/axis2/transport/testkit/doclet/ResourceInfoDoclet.java>:[33,23]
package com.sun.javadoc does not exist

<https://builds.apache.org/job/axis2-1.6/ws/axis2/modules/transport/testkit/src/main/java/org/apache/axis2/transport/testkit/doclet/ResourceInfoDoclet.java>:[34,23]
package com.sun.javadoc does not exist

<https://builds.apache.org/job/axis2-1.6/ws/axis2/modules/transport/testkit/src/main/java/org/apache/axis2/transport/testkit/doclet/ResourceInfoDoclet.java>:[35,23]
package com.sun.javadoc does not exist

<https://builds.apache.org/job/axis2-1.6/ws/axis2/modules/transport/testkit/src/main/java/org/apache/axis2/transport/testkit/doclet/ResourceInfoDoclet.java>:[36,23]
package com.sun.javadoc does not exist

<https://builds.apache.org/job/axis2-1.6/ws/axis2/modules/transport/testkit/src/main/java/org/apache/axis2/transport/testkit/doclet/ResourceInfoDoclet.java>:[37,23]
package com.sun.javadoc does not exist

<https://builds.apache.org/job/axis2-1.6/ws/axis2/modules/transport/testkit/src/main/java/org/apache/axis2/transport/testkit/doclet/ResourceInfoDoclet.java>:[38,23]
package com.sun.javadoc does not exist

<https://builds.apache.org/job/axis2-1.6/ws/axis2/modules/transport/testkit/src/main/java/org/apache/axis2/transport/testkit/doclet/ResourceInfoDoclet.java>:[43,32]
cannot find symbol
symbol  : class RootDoc
location: class org.apache.axis2.transport.testkit.doclet.ResourceInfoDoclet

<https://builds.apache.org/job/axis2-1.6/ws/axis2/modules/transport/testkit/src/main/java/org/apache/axis2/transport/testkit/doclet/ResourceInfoDoclet.java>:[83,48]
cannot find symbol
symbol  : class ProgramElementDoc
location: class org.apache.axis2.transport.testkit.doclet.ResourceInfoDoclet

<https://builds.apache.org/job/axis2-1.6/ws/axis2/modules/transport/testkit/src/main/java/org/apache/axis2/transport/testkit/doclet/ResourceInfoDoclet.java>:[83,19]
cannot find symbol
symbol  : class AnnotationDesc
location: class org.apache.axis2.transport.testkit.doclet.ResourceInfoDoclet

<https://builds.apache.org/job/axis2-1.6/ws/axis2/modules/transport/testkit/src/main/java/org/apache/axis2/transport/testkit/doclet/ResourceInfoDoclet.java>:[92,43]
cannot find symbol
symbol  : class Doc
location: class org.apache.axis2.transport.testkit.doclet.ResourceInfoDoclet

<https://builds.apache.org/job/axis2-1.6/ws/axis2/modules/transport/testkit/src/main/java/org/apache/axis2/transport/testkit/doclet/ResourceInfoDoclet.java>:[129,59]
cannot find symbol
symbol  : class DocErrorReporter
location: class org.apache.axis2.transport.testkit.doclet.ResourceInfoDoclet

<https://builds.apache.org/job/axis2-1.6/ws/axis2/modules/transport/testkit/src/main/java/org/apache/axis2/transport/testkit/doclet/TestkitJavadocDoclet.java>:[27,23]
package com.sun.javadoc does not exist

<https://builds.apache.org/job/axis2-1.6/ws/axis2/modules/transport/testkit/src/main/java/org/apache/axis2/transport/testkit/doclet/TestkitJavadocDoclet.java>:[28,23]
package com.sun.javadoc does not exist

<https://builds.apache.org/job/axis2-1.6/ws/axis2/modules/transport/testkit/src/main/java/org/apache/axis2/transport/testkit/doclet/TestkitJavadocDoclet.java>:[29,23]
package com.sun.javadoc does not exist

<https://builds.apache.org/job/axis2-1.6/ws/axis2/modules/transport/testkit/src/main/java/org/apache/axis2/transport/testkit/doclet/TestkitJavadocDoclet.java>:[30,23]
package com.sun.javadoc does not exist

<https://builds.apache.org/job/axis2-1.6/ws/axis2/modules/transport/testkit/src/main/java/org/apache/axis2/transport/testkit/doclet/TestkitJavadocDoclet.java>:[31,38]
package com.sun.tools.doclets.standard does not exist

<https://builds.apache.org/job/axis2-1.6/ws/axis2/modules/transport/testkit/src/main/java/org/apache/axis2/transport/testkit/doclet/TestkitJavadocDoclet.java>:[36,18]
cannot find symbol
symbol  : class LanguageVersion
location: class org.apache.axis2.transport.testkit.doclet.TestkitJavadocDoclet

<https://builds.apache.org/job/axis2-1.6/ws/axis2/modules/transport/testkit/src/main/java/org/apache/axis2/transport/testkit/doclet/TestkitJavadocDoclet.java>:[48,59]
cannot find symbol
symbol  : class DocErrorReporter
location: class org.apache.axis2.transport.testkit.doclet.TestkitJavadocDoclet

<https://builds.apache.org/job/axis2-1.6/ws/axis2/modules/transport/testkit/src/main/java/org/apache/axis2/transport/testkit/doclet/TestkitJavadocDoclet.java>:[52,32]
cannot find symbol
symbol  : class RootDoc
location: class org.apache.axis2.transport.testkit.doclet.TestkitJavadocDoclet

<https://builds.apache.org/job/axis2-1.6/ws/axis2/modules/transport/testkit/src/main/java/org/apache/axis2/transport/testkit/doclet/ResourceInfoDoclet.java>:[46,13]
cannot find symbol
symbol  : class ClassDoc
location: class org.apache.axis2.transport.testkit.doclet.ResourceInfoDoclet

<https://builds.apache.org/job/axis2-1.6/ws/axis2/modules/transport/testkit/src/main/java/org/apache/axis2/transport/testkit/doclet/ResourceInfoDoclet.java>:[48,17]
cannot find symbol
symbol  : class MethodDoc
location: class org.apache.axis2.transport.testkit.doclet.ResourceInfoDoclet

<https://builds.apache.org/job/axis2-1.6/ws/axis2/modules/transport/testkit/src/main/java/org/apache/axis2/transport/testkit/doclet/ResourceInfoDoclet.java>:[53,20]
cannot find symbol
symbol  : class ParamTag
location: class org.apache.axis2.transport.testkit.doclet.ResourceInfoDoclet

<https://builds.apache.org/job/axis2-1.6/ws/axis2/modules/transport/testkit/src/main/java/org/apache/axis2/transport/testkit/doclet/ResourceInfoDoclet.java>:[54,25]
cannot find symbol
symbol  : class Parameter
location: class org.apache.axis2.transport.testkit.doclet.ResourceInfoDoclet

<https://builds.apache.org/job/axis2-1.6/ws/axis2/modules/transport/testkit/src/main/java/org/apache/axis2/transport/testkit/doclet/ResourceInfoDoclet.java>:[55,24]
cannot find symbol
symbol  : class Type
location: class org.apache.axis2.transport.testkit.doclet.ResourceInfoDoclet

<https://builds.apache.org/job/axis2-1.6/ws/axis2/modules/transport/testkit/src/main/java/org/apache/axis2/transport/testkit/doclet/ResourceInfoDoclet.java>:[58,29]
cannot find symbol
symbol  : class ParamTag
location: class org.apache.axis2.transport.testkit.doclet.ResourceInfoDoclet

<https://builds.apache.org/job/axis2-1.6/ws/axis2/modules/transport/testkit/src/main/java/org/apache/axis2/transport/testkit/doclet/ResourceInfoDoclet.java>:[84,13]
cannot find symbol
symbol  : class AnnotationDesc
location: class org.apache.axis2.transport.testkit.doclet.ResourceInfoDoclet

<https://builds.apache.org/job/axis2-1.6/ws/axis2/modules/transport/testkit/src/main/java/org/apache/axis2/transport/testkit/doclet/ResourceInfoDoclet.java>:[93,8]
cannot find symbol
symbol  : class Tag
location: class org.apache.axis2.transport.testkit.doclet.ResourceInfoDoclet

<https://builds.apache.org/job/axis2-1.6/ws/axis2/modules/transport/testkit/src/main/java/org/apache/axis2/transport/testkit/doclet/ResourceInfoDoclet.java>:[98,13]
cannot find symbol
symbol  : class Tag
location: class org.apache.axis2.transport.testkit.doclet.ResourceInfoDoclet

<https://builds.apache.org/job/axis2-1.6/ws/axis2/modules/transport/testkit/src/main/java/org/apache/axis2/transport/testkit/doclet/ResourceInfoDoclet.java>:[99,31]
cannot find symbol
symbol  : class SeeTag
location: class org.apache.axis2.transport.testkit.doclet.ResourceInfoDoclet

<https://builds.apache.org/job/axis2-1.6/ws/axis2/modules/transport/testkit/src/main/java/org/apache/axis2/transport/testkit/doclet/ResourceInfoDoclet.java>:[103,32]
cannot find symbol
symbol  : class SeeTag
location: class org.apache.axis2.transport.testkit.doclet.ResourceInfoDoclet

<https://builds.apache.org/job/axis2-1.6/ws/axis2/modules/transport/testkit/src/main/java/org/apache/axis2/transport/testkit/doclet/TestkitJavadocDoclet.java>:[37,15]
cannot find symbol
symbol  : variable Standard
location: class org.apache.axis2.transport.testkit.doclet.TestkitJavadocDoclet

<https://builds.apache.org/job/axis2-1.6/ws/axis2/modules/transport/testkit/src/main/java/org/apache/axis2/transport/testkit/doclet/TestkitJavadocDoclet.java>:[44,19]
cannot find symbol
symbol  : variable Standard
location: class org.apache.axis2.transport.testkit.doclet.TestkitJavadocDoclet

<https://builds.apache.org/job/axis2-1.6/ws/axis2/modules/transport/testkit/src/main/java/org/apache/axis2/transport/testkit/doclet/TestkitJavadocDoclet.java>:[49,15]
cannot find symbol
symbol  : variable Standard
location: class org.apache.axis2.transport.testkit.doclet.TestkitJavadocDoclet

<https://builds.apache.org/job/axis2-1.6/ws/axis2/modules/transport/testkit/src/main/java/org/apache/axis2/transport/testkit/doclet/TestkitJavadocDoclet.java>:[57,13]
cannot find symbol
symbol  : class ClassDoc
location: class org.apache.axis2.transport.testkit.doclet.TestkitJavadocDoclet

<https://builds.apache.org/job/axis2-1.6/ws/axis2/modules/transport/testkit/src/main/java/org/apache/axis2/transport/testkit/doclet/TestkitJavadocDoclet.java>:[101,15]
cannot find symbol
symbol  : variable Standard
location: class org.apache.axis2.transport.testkit.doclet.TestkitJavadocDoclet


[INFO] ------------------------------------------------------------------------
[INFO] For more information, run Maven with the -e switch
[INFO] ------------------------------------------------------------------------
[INFO] Total time: 2 minutes 56 seconds
[INFO] Finished at: Thu Jan 02 05:13:46 UTC 2014
[INFO] Final Memory: 100M/944M
[INFO] ------------------------------------------------------------------------
[JENKINS] Archiving <https://builds.apache.org/job/axis2-1.6/ws/axis2/modules/resource-bundle/pom.xml>
to org.apache.axis2/axis2-resource-bundle/1.6.3-SNAPSHOT/axis2-resource-bundle-1.6.3-SNAPSHOT.pom
[JENKINS] Archiving <https://builds.apache.org/job/axis2-1.6/ws/axis2/modules/resource-bundle/target/axis2-resource-bundle-1.6.3-SNAPSHOT.jar>
to org.apache.axis2/axis2-resource-bundle/1.6.3-20140102.051112-42/axis2-resource-bundle-1.6.3-20140102.051112-42.jar
[JENKINS] Archiving <https://builds.apache.org/job/axis2-1.6/ws/axis2/modules/resource-bundle/target/axis2-resource-bundle-1.6.3-SNAPSHOT-sources.jar>
to org.apache.axis2/axis2-resource-bundle/1.6.3-20140102.051112-42/axis2-resource-bundle-1.6.3-20140102.051112-42-sources.jar
[JENKINS] Archiving <https://builds.apache.org/job/axis2-1.6/ws/axis2/modules/transport/base/pom.xml>
to org.apache.axis2/axis2-transport-base/1.6.3-SNAPSHOT/axis2-transport-base-1.6.3-SNAPSHOT.pom
[JENKINS] Archiving <https://builds.apache.org/job/axis2-1.6/ws/axis2/modules/transport/base/target/axis2-transport-base-1.6.3-SNAPSHOT.jar>
to org.apache.axis2/axis2-transport-base/1.6.3-20140102.051112-5/axis2-transport-base-1.6.3-20140102.051112-5.jar
[JENKINS] Archiving <https://builds.apache.org/job/axis2-1.6/ws/axis2/modules/transport/base/target/axis2-transport-base-1.6.3-SNAPSHOT-sources.jar>
to org.apache.axis2/axis2-transport-base/1.6.3-20140102.051112-5/axis2-transport-base-1.6.3-20140102.051112-5-sources.jar
[JENKINS] Archiving <https://builds.apache.org/job/axis2-1.6/ws/axis2/modules/transport/base/target/axis2-transport-base-1.6.3-SNAPSHOT-javadoc.jar>
to org.apache.axis2/axis2-transport-base/1.6.3-20140102.051112-5/axis2-transport-base-1.6.3-20140102.051112-5-javadoc.jar
[JENKINS] Archiving <https://builds.apache.org/job/axis2-1.6/ws/axis2/modules/adb/pom.xml>
to org.apache.axis2/axis2-adb/1.6.3-SNAPSHOT/axis2-adb-1.6.3-SNAPSHOT.pom
[JENKINS] Archiving <https://builds.apache.org/job/axis2-1.6/ws/axis2/modules/adb/target/axis2-adb-1.6.3-SNAPSHOT.jar>
to org.apache.axis2/axis2-adb/1.6.3-20140102.051112-42/axis2-adb-1.6.3-20140102.051112-42.jar
[JENKINS] Archiving <https://builds.apache.org/job/axis2-1.6/ws/axis2/modules/adb/target/axis2-adb-1.6.3-SNAPSHOT-sources.jar>
to org.apache.axis2/axis2-adb/1.6.3-20140102.051112-42/axis2-adb-1.6.3-20140102.051112-42-sources.jar
[JENKINS] Archiving <https://builds.apache.org/job/axis2-1.6/ws/axis2/modules/adb/target/axis2-adb-1.6.3-SNAPSHOT-javadoc.jar>
to org.apache.axis2/axis2-adb/1.6.3-20140102.051112-42/axis2-adb-1.6.3-20140102.051112-42-javadoc.jar
[JENKINS] Archiving <https://builds.apache.org/job/axis2-1.6/ws/axis2/modules/tool/axis2-mar-maven-plugin/pom.xml>
to org.apache.axis2/axis2-mar-maven-plugin/1.6.3-SNAPSHOT/axis2-mar-maven-plugin-1.6.3-SNAPSHOT.pom
[JENKINS] Archiving <https://builds.apache.org/job/axis2-1.6/ws/axis2/modules/tool/axis2-mar-maven-plugin/target/axis2-mar-maven-plugin-1.6.3-SNAPSHOT.jar>
to org.apache.axis2/axis2-mar-maven-plugin/1.6.3-20140102.051112-41/axis2-mar-maven-plugin-1.6.3-20140102.051112-41.jar
[JENKINS] Archiving <https://builds.apache.org/job/axis2-1.6/ws/axis2/modules/tool/axis2-mar-maven-plugin/target/axis2-mar-maven-plugin-1.6.3-SNAPSHOT-sources.jar>
to org.apache.axis2/axis2-mar-maven-plugin/1.6.3-20140102.051112-41/axis2-mar-maven-plugin-1.6.3-20140102.051112-41-sources.jar
[JENKINS] Archiving <https://builds.apache.org/job/axis2-1.6/ws/axis2/modules/tool/axis2-mar-maven-plugin/target/axis2-mar-maven-plugin-1.6.3-SNAPSHOT-javadoc.jar>
to org.apache.axis2/axis2-mar-maven-plugin/1.6.3-20140102.051112-41/axis2-mar-maven-plugin-1.6.3-20140102.051112-41-javadoc.jar
[JENKINS] Archiving <https://builds.apache.org/job/axis2-1.6/ws/axis2/modules/transport/local/pom.xml>
to org.apache.axis2/axis2-transport-local/1.6.3-SNAPSHOT/axis2-transport-local-1.6.3-SNAPSHOT.pom
[JENKINS] Archiving <https://builds.apache.org/job/axis2-1.6/ws/axis2/modules/transport/local/target/axis2-transport-local-1.6.3-SNAPSHOT.jar>
to org.apache.axis2/axis2-transport-local/1.6.3-20140102.051112-42/axis2-transport-local-1.6.3-20140102.051112-42.jar
[JENKINS] Archiving <https://builds.apache.org/job/axis2-1.6/ws/axis2/modules/transport/local/target/axis2-transport-local-1.6.3-SNAPSHOT-sources.jar>
to org.apache.axis2/axis2-transport-local/1.6.3-20140102.051112-42/axis2-transport-local-1.6.3-20140102.051112-42-sources.jar
[JENKINS] Archiving <https://builds.apache.org/job/axis2-1.6/ws/axis2/modules/transport/local/target/axis2-transport-local-1.6.3-SNAPSHOT-javadoc.jar>
to org.apache.axis2/axis2-transport-local/1.6.3-20140102.051112-42/axis2-transport-local-1.6.3-20140102.051112-42-javadoc.jar
[JENKINS] Archiving <https://builds.apache.org/job/axis2-1.6/ws/axis2/modules/parent/pom.xml>
to org.apache.axis2/axis2-parent/1.6.3-SNAPSHOT/axis2-parent-1.6.3-SNAPSHOT.pom
[JENKINS] Archiving <https://builds.apache.org/job/axis2-1.6/ws/.repository/org/apache/axis2/axis2-parent/1.6.3-SNAPSHOT/axis2-parent-1.6.3-SNAPSHOT.pom>
to org.apache.axis2/axis2-parent/1.6.3-20140102.051112-42/axis2-parent-1.6.3-20140102.051112-42.pom
<https://builds.apache.org/job/axis2-1.6/ws/.repository/org/apache/axis2/axis2-parent/1.6.3-SNAPSHOT/axis2-parent-1.6.3-SNAPSHOT.pom>
is not inside <https://builds.apache.org/job/axis2-1.6/ws/axis2/modules/parent/;> will
archive in a separate pass
[JENKINS] Archiving <https://builds.apache.org/job/axis2-1.6/ws/axis2/modules/addressing/pom.xml>
to org.apache.axis2/addressing/1.6.3-SNAPSHOT/addressing-1.6.3-SNAPSHOT.pom
[JENKINS] Archiving <https://builds.apache.org/job/axis2-1.6/ws/axis2/modules/addressing/target/addressing-1.6.3-SNAPSHOT.mar>
to org.apache.axis2/addressing/1.6.3-20140102.051112-39/addressing-1.6.3-20140102.051112-39.mar
[JENKINS] Archiving <https://builds.apache.org/job/axis2-1.6/ws/axis2/modules/addressing/target/addressing-1.6.3-SNAPSHOT-sources.jar>
to org.apache.axis2/addressing/1.6.3-20140102.051112-39/addressing-1.6.3-20140102.051112-39-sources.jar
[JENKINS] Archiving <https://builds.apache.org/job/axis2-1.6/ws/axis2/modules/addressing/target/addressing-1.6.3-SNAPSHOT-javadoc.jar>
to org.apache.axis2/addressing/1.6.3-20140102.051112-39/addressing-1.6.3-20140102.051112-39-javadoc.jar
[JENKINS] Archiving <https://builds.apache.org/job/axis2-1.6/ws/axis2/modules/addressing/target/addressing-1.6.3-SNAPSHOT-classpath-module.jar>
to org.apache.axis2/addressing/1.6.3-20140102.051112-39/addressing-1.6.3-20140102.051112-39-classpath-module.jar
[JENKINS] Archiving <https://builds.apache.org/job/axis2-1.6/ws/axis2/modules/transport/testkit/pom.xml>
to org.apache.axis2/axis2-transport-testkit/1.6.3-SNAPSHOT/axis2-transport-testkit-1.6.3-SNAPSHOT.pom
[JENKINS] Archiving <https://builds.apache.org/job/axis2-1.6/ws/axis2/modules/kernel/pom.xml>
to org.apache.axis2/axis2-kernel/1.6.3-SNAPSHOT/axis2-kernel-1.6.3-SNAPSHOT.pom
[JENKINS] Archiving <https://builds.apache.org/job/axis2-1.6/ws/axis2/modules/kernel/target/axis2-kernel-1.6.3-SNAPSHOT.jar>
to org.apache.axis2/axis2-kernel/1.6.3-20140102.051112-42/axis2-kernel-1.6.3-20140102.051112-42.jar
[JENKINS] Archiving <https://builds.apache.org/job/axis2-1.6/ws/axis2/modules/kernel/target/axis2-kernel-1.6.3-SNAPSHOT-sources.jar>
to org.apache.axis2/axis2-kernel/1.6.3-20140102.051112-42/axis2-kernel-1.6.3-20140102.051112-42-sources.jar
[JENKINS] Archiving <https://builds.apache.org/job/axis2-1.6/ws/axis2/modules/kernel/target/axis2-kernel-1.6.3-SNAPSHOT-javadoc.jar>
to org.apache.axis2/axis2-kernel/1.6.3-20140102.051112-42/axis2-kernel-1.6.3-20140102.051112-42-javadoc.jar
Sending e-mails to: java-dev@axis.apache.org
channel stopped
[locks-and-latches] Releasing all the locks
[locks-and-latches] All the locks released

---------------------------------------------------------------------
To unsubscribe, e-mail: java-dev-unsubscribe@axis.apache.org
For additional commands, e-mail: java-dev-help@axis.apache.org


Mime
View raw message