axis-java-dev mailing list archives

Site index · List index
Message view « Date » · « Thread »
Top « Date » · « Thread »
From Apache Jenkins Server <jenk...@builds.apache.org>
Subject Build failed in Jenkins: axis2-transports-trunk #1434
Date Sat, 14 Dec 2013 21:17:27 GMT
See <https://builds.apache.org/job/axis2-transports-trunk/1434/>

------------------------------------------
[...truncated 952 lines...]
1K downloaded  (maven-plugin-registry-2.0.9.pom)
Downloading: http://repo1.maven.org/maven2/org/apache/maven/maven-archiver/2.4/maven-archiver-2.4.pom
3K downloaded  (maven-archiver-2.4.pom)
Downloading: http://repo1.maven.org/maven2/org/apache/maven/shared/maven-shared-components/10/maven-shared-components-10.pom
8K downloaded  (maven-shared-components-10.pom)
Downloading: http://repo1.maven.org/maven2/org/apache/maven/maven-parent/9/maven-parent-9.pom
32K downloaded  (maven-parent-9.pom)
Downloading: http://repo1.maven.org/maven2/org/apache/maven/maven-model/2.0/maven-model-2.0.pom
2K downloaded  (maven-model-2.0.pom)
Downloading: http://repo1.maven.org/maven2/org/codehaus/plexus/plexus-archiver/1.0-alpha-11/plexus-archiver-1.0-alpha-11.pom
1K downloaded  (plexus-archiver-1.0-alpha-11.pom)
Downloading: http://repo1.maven.org/maven2/org/codehaus/plexus/plexus-components/1.1.9/plexus-components-1.1.9.pom
2K downloaded  (plexus-components-1.1.9.pom)
Downloading: http://repo1.maven.org/maven2/org/codehaus/plexus/plexus-container-default/1.0-alpha-15/plexus-container-default-1.0-alpha-15.pom
1K downloaded  (plexus-container-default-1.0-alpha-15.pom)
Downloading: http://repo1.maven.org/maven2/org/codehaus/plexus/plexus-containers/1.0-alpha-15/plexus-containers-1.0-alpha-15.pom
1K downloaded  (plexus-containers-1.0-alpha-15.pom)
Downloading: http://repo1.maven.org/maven2/org/codehaus/plexus/plexus/1.0.9/plexus-1.0.9.pom
7K downloaded  (plexus-1.0.9.pom)
Downloading: http://repo1.maven.org/maven2/org/codehaus/plexus/plexus-component-api/1.0-alpha-15/plexus-component-api-1.0-alpha-15.pom
948b downloaded  (plexus-component-api-1.0-alpha-15.pom)
Downloading: http://repo1.maven.org/maven2/org/codehaus/plexus/plexus-classworlds/1.2-alpha-6/plexus-classworlds-1.2-alpha-6.pom
2K downloaded  (plexus-classworlds-1.2-alpha-6.pom)
Downloading: http://repo1.maven.org/maven2/org/codehaus/plexus/plexus-io/1.0-alpha-3/plexus-io-1.0-alpha-3.pom
1K downloaded  (plexus-io-1.0-alpha-3.pom)
Downloading: http://repo1.maven.org/maven2/org/codehaus/plexus/plexus-component-api/1.0-alpha-16/plexus-component-api-1.0-alpha-16.pom
2K downloaded  (plexus-component-api-1.0-alpha-16.pom)
Downloading: http://repo1.maven.org/maven2/org/codehaus/plexus/plexus-containers/1.0-alpha-16/plexus-containers-1.0-alpha-16.pom
1K downloaded  (plexus-containers-1.0-alpha-16.pom)
Downloading: http://repo1.maven.org/maven2/org/codehaus/plexus/plexus-utils/1.4.9/plexus-utils-1.4.9.pom
2K downloaded  (plexus-utils-1.4.9.pom)
Downloading: http://repo1.maven.org/maven2/org/codehaus/plexus/plexus-interpolation/1.6/plexus-interpolation-1.6.pom
2K downloaded  (plexus-interpolation-1.6.pom)
Downloading: http://repo1.maven.org/maven2/org/codehaus/plexus/plexus-archiver/1.0-alpha-9/plexus-archiver-1.0-alpha-9.pom
1K downloaded  (plexus-archiver-1.0-alpha-9.pom)
Downloading: http://repo1.maven.org/maven2/org/codehaus/plexus/plexus-io/1.0-alpha-1/plexus-io-1.0-alpha-1.pom
1K downloaded  (plexus-io-1.0-alpha-1.pom)
Downloading: http://repo1.maven.org/maven2/org/codehaus/plexus/plexus-utils/1.5.8/plexus-utils-1.5.8.jar
Downloading: http://repo1.maven.org/maven2/org/apache/maven/maven-archiver/2.4/maven-archiver-2.4.jar
19K downloaded  (maven-archiver-2.4.jar)
261K downloaded  (plexus-utils-1.5.8.jar)
Downloading: http://repo1.maven.org/maven2/org/codehaus/plexus/plexus-archiver/1.0-alpha-9/plexus-archiver-1.0-alpha-9.jar
153K downloaded  (plexus-archiver-1.0-alpha-9.jar)
Downloading: http://repo1.maven.org/maven2/org/codehaus/plexus/plexus-io/1.0-alpha-1/plexus-io-1.0-alpha-1.jar
11K downloaded  (plexus-io-1.0-alpha-1.jar)
Downloading: http://repo1.maven.org/maven2/org/codehaus/plexus/plexus-interpolation/1.6/plexus-interpolation-1.6.jar
49K downloaded  (plexus-interpolation-1.6.jar)
[INFO] [source:jar {execution: default}]
Downloading: http://repo1.maven.org/maven2/org/codehaus/plexus/plexus-digest/1.0/plexus-digest-1.0.pom
1K downloaded  (plexus-digest-1.0.pom)
Downloading: http://repo1.maven.org/maven2/org/codehaus/plexus/plexus-components/1.1.7/plexus-components-1.1.7.pom
4K downloaded  (plexus-components-1.1.7.pom)
Downloading: http://repo1.maven.org/maven2/org/codehaus/plexus/plexus-digest/1.0/plexus-digest-1.0.jar
11K downloaded  (plexus-digest-1.0.jar)
[INFO] [install:install {execution: default-install}]
[INFO] Installing <https://builds.apache.org/job/axis2-transports-trunk/ws/transports/pom.xml>
to <https://builds.apache.org/job/axis2-transports-trunk/ws/.repository/org/apache/axis2/axis2-transports/1.7.0-SNAPSHOT/axis2-transports-1.7.0-SNAPSHOT.pom>
[INFO] Installing <https://builds.apache.org/job/axis2-transports-trunk/ws/transports/target/axis2-transports-1.7.0-SNAPSHOT-site.xml>
to <https://builds.apache.org/job/axis2-transports-trunk/ws/.repository/org/apache/axis2/axis2-transports/1.7.0-SNAPSHOT/axis2-transports-1.7.0-SNAPSHOT-site.xml>
Downloading: http://repo1.maven.org/maven2/org/codehaus/plexus/plexus-utils/1.5.6/plexus-utils-1.5.6.pom
5K downloaded  (plexus-utils-1.5.6.pom)
Downloading: http://repo1.maven.org/maven2/org/codehaus/plexus/plexus/1.0.12/plexus-1.0.12.pom
9K downloaded  (plexus-1.0.12.pom)
Downloading: http://repo1.maven.org/maven2/org/codehaus/plexus/plexus-utils/1.5.6/plexus-utils-1.5.6.jar
244K downloaded  (plexus-utils-1.5.6.jar)
[INFO] [deploy:deploy {execution: default-deploy}]
[INFO] Retrieving previous build number from apache.snapshots.https
Uploading: https://repository.apache.org/content/repositories/snapshots/org/apache/axis2/axis2-transports/1.7.0-SNAPSHOT/axis2-transports-1.7.0-20131214.211649-957.pom
16K uploaded  (axis2-transports-1.7.0-20131214.211649-957.pom)
[INFO] Retrieving previous metadata from apache.snapshots.https
[INFO] Uploading repository metadata for: 'snapshot org.apache.axis2:axis2-transports:1.7.0-SNAPSHOT'
[INFO] Retrieving previous metadata from apache.snapshots.https
[INFO] Uploading repository metadata for: 'artifact org.apache.axis2:axis2-transports'
[INFO] Retrieving previous build number from apache.snapshots.https
Uploading: https://repository.apache.org/content/repositories/snapshots/org/apache/axis2/axis2-transports/1.7.0-SNAPSHOT/axis2-transports-1.7.0-20131214.211649-957-site.xml
2K uploaded  (axis2-transports-1.7.0-20131214.211649-957-site.xml)
[INFO] ------------------------------------------------------------------------
[INFO] Building Apache Axis2 - Transport - Sms
[INFO]    task-segment: [clean, deploy]
[INFO] ------------------------------------------------------------------------
Downloading: http://repo1.maven.org/maven2/org/apache/maven/plugins/maven-dependency-plugin/2.0/maven-dependency-plugin-2.0.pom
11K downloaded  (maven-dependency-plugin-2.0.pom)
Downloading: http://repo1.maven.org/maven2/org/apache/maven/plugins/maven-plugins/10/maven-plugins-10.pom
7K downloaded  (maven-plugins-10.pom)
Downloading: http://repo1.maven.org/maven2/org/apache/maven/plugins/maven-dependency-plugin/2.0/maven-dependency-plugin-2.0.jar
87K downloaded  (maven-dependency-plugin-2.0.jar)
Downloading: http://repo1.maven.org/maven2/org/apache/maven/plugins/maven-surefire-plugin/2.12/maven-surefire-plugin-2.12.pom
9K downloaded  (maven-surefire-plugin-2.12.pom)
Downloading: http://repo1.maven.org/maven2/org/apache/maven/surefire/surefire/2.12/surefire-2.12.pom
10K downloaded  (surefire-2.12.pom)
Downloading: http://repo1.maven.org/maven2/org/apache/maven/maven-parent/21/maven-parent-21.pom
25K downloaded  (maven-parent-21.pom)
Downloading: http://repo1.maven.org/maven2/org/apache/maven/plugins/maven-surefire-plugin/2.12/maven-surefire-plugin-2.12.jar
30K downloaded  (maven-surefire-plugin-2.12.jar)
Downloading: http://repo1.maven.org/maven2/org/apache/maven/plugins/maven-antrun-plugin/1.6/maven-antrun-plugin-1.6.pom
4K downloaded  (maven-antrun-plugin-1.6.pom)
Downloading: http://repo1.maven.org/maven2/org/apache/maven/plugins/maven-antrun-plugin/1.6/maven-antrun-plugin-1.6.jar
28K downloaded  (maven-antrun-plugin-1.6.jar)
[INFO] [clean:clean {execution: default-clean}]
Downloading: http://repo1.maven.org/maven2/org/apache/maven/plugins/maven-resources-plugin/2.4.3/maven-resources-plugin-2.4.3.pom
5K downloaded  (maven-resources-plugin-2.4.3.pom)
Downloading: http://repo1.maven.org/maven2/org/apache/maven/plugins/maven-resources-plugin/2.4.3/maven-resources-plugin-2.4.3.jar
23K downloaded  (maven-resources-plugin-2.4.3.jar)
[INFO] [remote-resources:process {execution: default}]
[INFO] snapshot org.apache.axis2:axis2-transport-base:1.7.0-SNAPSHOT: checking for updates
from apache-snapshots
[INFO] snapshot org.apache.axis2:axis2-transport-base:1.7.0-SNAPSHOT: checking for updates
from wso2-m2
[INFO] snapshot org.apache.axis2:axis2-transport-base:1.7.0-SNAPSHOT: checking for updates
from apache.snapshots
Downloading: http://repository.apache.org/snapshots/org/apache/axis2/axis2-transport-base/1.7.0-SNAPSHOT/axis2-transport-base-1.7.0-20131214.191749-1209.pom

Downloading: http://people.apache.org/repo/m2-snapshot-repository//com/google/code/jsmpp/2.0.1/jsmpp-2.0.1.pom
[INFO] Unable to find resource 'com.google.code:jsmpp:pom:2.0.1' in repository apache-snapshots
(http://people.apache.org/repo/m2-snapshot-repository/)
Downloading: http://dist.wso2.org/maven2//com/google/code/jsmpp/2.0.1/jsmpp-2.0.1.pom
156b downloaded  (jsmpp-2.0.1.pom)
Downloading: http://people.apache.org/repo/m2-snapshot-repository//org/slf4j/slf4j-api/1.4.3/slf4j-api-1.4.3.pom
[INFO] Unable to find resource 'org.slf4j:slf4j-api:pom:1.4.3' in repository apache-snapshots
(http://people.apache.org/repo/m2-snapshot-repository/)
Downloading: http://dist.wso2.org/maven2//org/slf4j/slf4j-api/1.4.3/slf4j-api-1.4.3.pom
2K downloaded  (slf4j-api-1.4.3.pom)
Downloading: http://people.apache.org/repo/m2-snapshot-repository//org/slf4j/slf4j-parent/1.4.3/slf4j-parent-1.4.3.pom
[INFO] Unable to find resource 'org.slf4j:slf4j-parent:pom:1.4.3' in repository apache-snapshots
(http://people.apache.org/repo/m2-snapshot-repository/)
Downloading: http://dist.wso2.org/maven2//org/slf4j/slf4j-parent/1.4.3/slf4j-parent-1.4.3.pom
7K downloaded  (slf4j-parent-1.4.3.pom)
Downloading: http://people.apache.org/repo/m2-snapshot-repository//org/slf4j/slf4j-log4j12/1.4.3/slf4j-log4j12-1.4.3.pom
[INFO] Unable to find resource 'org.slf4j:slf4j-log4j12:pom:1.4.3' in repository apache-snapshots
(http://people.apache.org/repo/m2-snapshot-repository/)
Downloading: http://dist.wso2.org/maven2//org/slf4j/slf4j-log4j12/1.4.3/slf4j-log4j12-1.4.3.pom
1K downloaded  (slf4j-log4j12-1.4.3.pom)
Downloading: http://people.apache.org/repo/m2-snapshot-repository//log4j/log4j/1.2.13/log4j-1.2.13.pom
[INFO] Unable to find resource 'log4j:log4j:pom:1.2.13' in repository apache-snapshots (http://people.apache.org/repo/m2-snapshot-repository/)
Downloading: http://dist.wso2.org/maven2//log4j/log4j/1.2.13/log4j-1.2.13.pom
389b downloaded  (log4j-1.2.13.pom)
Downloading: http://people.apache.org/repo/m2-snapshot-repository//log4j/log4j/1.2.14/log4j-1.2.14.pom
[INFO] Unable to find resource 'log4j:log4j:pom:1.2.14' in repository apache-snapshots (http://people.apache.org/repo/m2-snapshot-repository/)
Downloading: http://dist.wso2.org/maven2//log4j/log4j/1.2.14/log4j-1.2.14.pom
2K downloaded  (log4j-1.2.14.pom)
Downloading: http://people.apache.org/repo/m2-snapshot-repository//org/smslib/smslib/3.4.1/smslib-3.4.1.pom
[INFO] Unable to find resource 'org.smslib:smslib:pom:3.4.1' in repository apache-snapshots
(http://people.apache.org/repo/m2-snapshot-repository/)
Downloading: http://dist.wso2.org/maven2//org/smslib/smslib/3.4.1/smslib-3.4.1.pom
[INFO] Unable to find resource 'org.smslib:smslib:pom:3.4.1' in repository wso2-m2 (http://dist.wso2.org/maven2/)
Downloading: http://repo1.maven.org/maven2/org/smslib/smslib/3.4.1/smslib-3.4.1.pom
[INFO] Unable to find resource 'org.smslib:smslib:pom:3.4.1' in repository central (http://repo1.maven.org/maven2)
Downloading: http://people.apache.org/repo/m2-snapshot-repository//junit/junit/3.8.2/junit-3.8.2.pom
[INFO] Unable to find resource 'junit:junit:pom:3.8.2' in repository apache-snapshots (http://people.apache.org/repo/m2-snapshot-repository/)
Downloading: http://dist.wso2.org/maven2//junit/junit/3.8.2/junit-3.8.2.pom
747b downloaded  (junit-3.8.2.pom)
[INFO] snapshot org.apache.axis2:addressing:1.7.0-SNAPSHOT: checking for updates from apache-snapshots
[INFO] snapshot org.apache.axis2:addressing:1.7.0-SNAPSHOT: checking for updates from wso2-m2
[INFO] snapshot org.apache.axis2:addressing:1.7.0-SNAPSHOT: checking for updates from apache.snapshots
Downloading: http://repository.apache.org/snapshots/org/apache/axis2/addressing/1.7.0-SNAPSHOT/addressing-1.7.0-20131214.191712-1736.pom

Downloading: http://people.apache.org/repo/m2-snapshot-repository//junit/junit/3.8.2/junit-3.8.2.jar
Downloading: http://repository.apache.org/snapshots/org/apache/axis2/axis2-transport-base/1.7.0-SNAPSHOT/axis2-transport-base-1.7.0-20131214.191749-1209.jar
Downloading: http://people.apache.org/repo/m2-snapshot-repository//org/slf4j/slf4j-api/1.4.3/slf4j-api-1.4.3.jar
Downloading: http://people.apache.org/repo/m2-snapshot-repository//org/smslib/smslib/3.4.1/smslib-3.4.1.jar
Downloading: http://people.apache.org/repo/m2-snapshot-repository//com/google/code/jsmpp/2.0.1/jsmpp-2.0.1.jar
[INFO] Unable to find resource 'junit:junit:jar:3.8.2' in repository apache-snapshots (http://people.apache.org/repo/m2-snapshot-repository/)
[INFO] Unable to find resource 'org.slf4j:slf4j-api:jar:1.4.3' in repository apache-snapshots
(http://people.apache.org/repo/m2-snapshot-repository/)
Downloading: http://dist.wso2.org/maven2//junit/junit/3.8.2/junit-3.8.2.jar
Downloading: http://dist.wso2.org/maven2//org/slf4j/slf4j-api/1.4.3/slf4j-api-1.4.3.jar
[INFO] Unable to find resource 'org.smslib:smslib:jar:3.4.1' in repository apache-snapshots
(http://people.apache.org/repo/m2-snapshot-repository/)
Downloading: http://dist.wso2.org/maven2//org/smslib/smslib/3.4.1/smslib-3.4.1.jar
[INFO] Unable to find resource 'com.google.code:jsmpp:jar:2.0.1' in repository apache-snapshots
(http://people.apache.org/repo/m2-snapshot-repository/)
Downloading: http://dist.wso2.org/maven2//com/google/code/jsmpp/2.0.1/jsmpp-2.0.1.jar
14K downloaded  (slf4j-api-1.4.3.jar)
117K downloaded  (junit-3.8.2.jar)
Downloading: http://people.apache.org/repo/m2-snapshot-repository//log4j/log4j/1.2.14/log4j-1.2.14.jar
Downloading: http://people.apache.org/repo/m2-snapshot-repository//org/slf4j/slf4j-log4j12/1.4.3/slf4j-log4j12-1.4.3.jar
102K downloaded  (axis2-transport-base-1.7.0-20131214.191749-1209.jar)
[INFO] Unable to find resource 'log4j:log4j:jar:1.2.14' in repository apache-snapshots (http://people.apache.org/repo/m2-snapshot-repository/)
Downloading: http://dist.wso2.org/maven2//log4j/log4j/1.2.14/log4j-1.2.14.jar
234K downloaded  (smslib-3.4.1.jar)
223K downloaded  (jsmpp-2.0.1.jar)
[INFO] Unable to find resource 'org.slf4j:slf4j-log4j12:jar:1.4.3' in repository apache-snapshots
(http://people.apache.org/repo/m2-snapshot-repository/)
Downloading: http://dist.wso2.org/maven2//org/slf4j/slf4j-log4j12/1.4.3/slf4j-log4j12-1.4.3.jar
Downloading: http://repository.apache.org/snapshots/org/apache/axis2/addressing/1.7.0-SNAPSHOT/addressing-1.7.0-20131214.191712-1736.mar
8K downloaded  (slf4j-log4j12-1.4.3.jar)

358K downloaded  (log4j-1.2.14.jar)
[WARNING] org.apache.velocity.runtime.exception.ReferenceException: reference : template =
META-INF/DEPENDENCIES.vm [line 40,column 14] : $license.name is not a valid reference.
Downloading: http://repo1.maven.org/maven2/org/apache/maven/shared/maven-filtering/1.0-beta-4/maven-filtering-1.0-beta-4.pom
4K downloaded  (maven-filtering-1.0-beta-4.pom)
Downloading: http://repo1.maven.org/maven2/org/codehaus/plexus/plexus-interpolation/1.13/plexus-interpolation-1.13.pom
890b downloaded  (plexus-interpolation-1.13.pom)
Downloading: http://repo1.maven.org/maven2/org/codehaus/plexus/plexus-interpolation/1.13/plexus-interpolation-1.13.jar
Downloading: http://repo1.maven.org/maven2/org/apache/maven/shared/maven-filtering/1.0-beta-4/maven-filtering-1.0-beta-4.jar
33K downloaded  (maven-filtering-1.0-beta-4.jar)
59K downloaded  (plexus-interpolation-1.13.jar)
[INFO] [resources:resources {execution: default-resources}]
[INFO] Using 'UTF-8' encoding to copy filtered resources.
[INFO] skip non existing resourceDirectory <https://builds.apache.org/job/axis2-transports-trunk/ws/transports/modules/sms/src/main/resources>
[INFO] Copying 3 resources
Downloading: http://repo1.maven.org/maven2/org/apache/maven/maven-toolchain/1.0/maven-toolchain-1.0.pom
3K downloaded  (maven-toolchain-1.0.pom)
Downloading: http://repo1.maven.org/maven2/org/codehaus/plexus/plexus-compiler-api/1.8.1/plexus-compiler-api-1.8.1.pom
805b downloaded  (plexus-compiler-api-1.8.1.pom)
Downloading: http://repo1.maven.org/maven2/org/codehaus/plexus/plexus-compiler/1.8.1/plexus-compiler-1.8.1.pom
3K downloaded  (plexus-compiler-1.8.1.pom)
Downloading: http://repo1.maven.org/maven2/org/codehaus/plexus/plexus-components/1.1.18/plexus-components-1.1.18.pom
5K downloaded  (plexus-components-1.1.18.pom)
Downloading: http://repo1.maven.org/maven2/org/codehaus/plexus/plexus/2.0.7/plexus-2.0.7.pom
16K downloaded  (plexus-2.0.7.pom)
Downloading: http://repo1.maven.org/maven2/org/codehaus/plexus/plexus-compiler-manager/1.8.1/plexus-compiler-manager-1.8.1.pom
713b downloaded  (plexus-compiler-manager-1.8.1.pom)
Downloading: http://repo1.maven.org/maven2/org/codehaus/plexus/plexus-compiler-javac/1.8.1/plexus-compiler-javac-1.8.1.pom
710b downloaded  (plexus-compiler-javac-1.8.1.pom)
Downloading: http://repo1.maven.org/maven2/org/codehaus/plexus/plexus-compilers/1.8.1/plexus-compilers-1.8.1.pom
1K downloaded  (plexus-compilers-1.8.1.pom)
Downloading: http://repo1.maven.org/maven2/org/codehaus/plexus/plexus-compiler-api/1.8.1/plexus-compiler-api-1.8.1.jar
19K downloaded  (plexus-compiler-api-1.8.1.jar)
Downloading: http://repo1.maven.org/maven2/org/codehaus/plexus/plexus-compiler-manager/1.8.1/plexus-compiler-manager-1.8.1.jar
5K downloaded  (plexus-compiler-manager-1.8.1.jar)
Downloading: http://repo1.maven.org/maven2/org/codehaus/plexus/plexus-compiler-javac/1.8.1/plexus-compiler-javac-1.8.1.jar
12K downloaded  (plexus-compiler-javac-1.8.1.jar)
[INFO] [compiler:compile {execution: default-compile}]
[INFO] Compiling 24 source files to <https://builds.apache.org/job/axis2-transports-trunk/ws/transports/modules/sms/target/classes>
[INFO] -------------------------------------------------------------
[ERROR] COMPILATION ERROR : 
[INFO] -------------------------------------------------------------
[ERROR] <https://builds.apache.org/job/axis2-transports-trunk/ws/transports/modules/sms/src/main/java/org/apache/axis2/transport/sms/DefaultSMSMessageBuilderImpl.java>:[173,24]
cannot find symbol
symbol  : class XmlSchemaGroupBase
location: class org.apache.axis2.transport.sms.DefaultSMSMessageBuilderImpl
[ERROR] <https://builds.apache.org/job/axis2-transports-trunk/ws/transports/modules/sms/src/main/java/org/apache/axis2/transport/sms/DefaultSMSMessageBuilderImpl.java>:[173,65]
cannot find symbol
symbol  : class XmlSchemaGroupBase
location: class org.apache.axis2.transport.sms.DefaultSMSMessageBuilderImpl
[INFO] 2 errors 
[INFO] -------------------------------------------------------------
[INFO] ------------------------------------------------------------------------
[ERROR] BUILD FAILURE
[INFO] ------------------------------------------------------------------------
[INFO] Compilation failure

<https://builds.apache.org/job/axis2-transports-trunk/ws/transports/modules/sms/src/main/java/org/apache/axis2/transport/sms/DefaultSMSMessageBuilderImpl.java>:[173,24]
cannot find symbol
symbol  : class XmlSchemaGroupBase
location: class org.apache.axis2.transport.sms.DefaultSMSMessageBuilderImpl
<https://builds.apache.org/job/axis2-transports-trunk/ws/transports/modules/sms/src/main/java/org/apache/axis2/transport/sms/DefaultSMSMessageBuilderImpl.java>:[173,65]
cannot find symbol
symbol  : class XmlSchemaGroupBase
location: class org.apache.axis2.transport.sms.DefaultSMSMessageBuilderImpl

[INFO] ------------------------------------------------------------------------
[INFO] For more information, run Maven with the -e switch
[INFO] ------------------------------------------------------------------------
[INFO] Total time: 1 minute 1 second
[INFO] Finished at: Sat Dec 14 21:17:16 UTC 2013
[INFO] Final Memory: 54M/343M
[INFO] ------------------------------------------------------------------------
[JENKINS] Archiving <https://builds.apache.org/job/axis2-transports-trunk/ws/transports/pom.xml>
to org.apache.axis2/axis2-transports/1.7.0-SNAPSHOT/axis2-transports-1.7.0-SNAPSHOT.pom
[JENKINS] Archiving <https://builds.apache.org/job/axis2-transports-trunk/ws/.repository/org/apache/axis2/axis2-transports/1.7.0-SNAPSHOT/axis2-transports-1.7.0-SNAPSHOT.pom>
to org.apache.axis2/axis2-transports/1.7.0-20131214.211649-957/axis2-transports-1.7.0-20131214.211649-957.pom
[JENKINS] Archiving <https://builds.apache.org/job/axis2-transports-trunk/ws/transports/target/axis2-transports-1.7.0-SNAPSHOT-site.xml>
to org.apache.axis2/axis2-transports/1.7.0-20131214.211649-957/axis2-transports-1.7.0-20131214.211649-957-site.xml
<https://builds.apache.org/job/axis2-transports-trunk/ws/.repository/org/apache/axis2/axis2-transports/1.7.0-SNAPSHOT/axis2-transports-1.7.0-SNAPSHOT.pom>
is not inside <https://builds.apache.org/job/axis2-transports-trunk/ws/transports/;>
will archive in a separate pass
[JENKINS] Archiving <https://builds.apache.org/job/axis2-transports-trunk/ws/transports/modules/sms/pom.xml>
to org.apache.axis2/axis2-transport-sms/1.7.0-SNAPSHOT/axis2-transport-sms-1.7.0-SNAPSHOT.pom
channel stopped
[locks-and-latches] Releasing all the locks
[locks-and-latches] All the locks released

---------------------------------------------------------------------
To unsubscribe, e-mail: java-dev-unsubscribe@axis.apache.org
For additional commands, e-mail: java-dev-help@axis.apache.org


Mime
View raw message