axis-java-dev mailing list archives

Site index · List index
Message view « Date » · « Thread »
Top « Date » · « Thread »
From Apache Jenkins Server <jenk...@builds.apache.org>
Subject Build failed in Jenkins: axis2-transports-trunk #1436
Date Tue, 17 Dec 2013 21:31:24 GMT
See <https://builds.apache.org/job/axis2-transports-trunk/1436/>

------------------------------------------
Started by upstream project "Axis2" build number 2520
originally caused by:
 Started by an SCM change
Started by upstream project "Axis2" build number 2521
originally caused by:
 Started by an SCM change
Building remotely on ubuntu1 in workspace <https://builds.apache.org/job/axis2-transports-trunk/ws/>
Updating http://svn.apache.org/repos/asf/axis/axis2/java/transports/trunk at revision '2013-12-17T21:28:20.507
+0000'
At revision 1551721
no change for http://svn.apache.org/repos/asf/axis/axis2/java/transports/trunk since the previous
build
[axis2-transports-trunk] $ /bin/bash -xe /tmp/hudson4770998581477129461.sh
+ '[' -d <https://builds.apache.org/job/axis2-transports-trunk/ws/.repository> ']'
++ find <https://builds.apache.org/job/axis2-transports-trunk/ws/.repository> -type
d -and -name '*-SNAPSHOT'
+ rm -rf <https://builds.apache.org/job/axis2-transports-trunk/ws/.repository/org/apache/neethi/neethi/3.0.3-SNAPSHOT>
<https://builds.apache.org/job/axis2-transports-trunk/ws/.repository/org/apache/axis2/axis2-parent/1.7.0-SNAPSHOT>
<https://builds.apache.org/job/axis2-transports-trunk/ws/.repository/org/apache/axis2/axis2-transport-base/1.7.0-SNAPSHOT>
<https://builds.apache.org/job/axis2-transports-trunk/ws/.repository/org/apache/axis2/axis2-transports/1.7.0-SNAPSHOT>
<https://builds.apache.org/job/axis2-transports-trunk/ws/.repository/org/apache/axis2/axis2-kernel/1.7.0-SNAPSHOT>
<https://builds.apache.org/job/axis2-transports-trunk/ws/.repository/org/apache/axis2/addressing/1.7.0-SNAPSHOT>
<https://builds.apache.org/job/axis2-transports-trunk/ws/.repository/org/apache/woden/woden-core/1.0-SNAPSHOT>
<https://builds.apache.org/job/axis2-transports-trunk/ws/.repository/org/apache/woden/woden/1.0-SNAPSHOT>
<https://builds.apache.org/job/axis2-transports-trunk/ws/.repository/org/apache/ws/commons/axiom/axiom/1.2.15-SNAPSHOT>
<https://builds.apache.org/job/axis2-transports-trunk/ws/.repository/org/apache/ws/commons/axiom/axiom-api/1.2.15-SNAPSHOT>
<https://builds.apache.org/job/axis2-transports-trunk/ws/.repository/org/apache/ws/commons/axiom/axiom-impl/1.2.15-SNAPSHOT>
<https://builds.apache.org/job/axis2-transports-trunk/ws/.repository/org/apache/ws/xmlschema/xmlschema-core/2.0.4-SNAPSHOT>
<https://builds.apache.org/job/axis2-transports-trunk/ws/.repository/org/apache/ws/xmlschema/xmlschema/2.0.4-SNAPSHOT>
[locks-and-latches] Checking to see if we really have the locks
[locks-and-latches] Have all the locks, build can start
Parsing POMs
Modules changed, recalculating dependency graph
maven-agent.jar already up to date
classworlds.jar already up to date
maven-interceptor.jar already up to date
maven2.1-interceptor.jar already up to date
[transports] $ /home/hudson/tools/java/latest1.5/bin/java -cp /home/jenkins/jenkins-slave/maven-agent.jar:/home/jenkins/jenkins-slave/classworlds.jar
hudson.maven.agent.Main /home/hudson/tools/maven/apache-maven-2.2.1 /home/jenkins/jenkins-slave/slave.jar
/home/jenkins/jenkins-slave/maven-interceptor.jar 47050 /home/jenkins/jenkins-slave/maven2.1-interceptor.jar
<===[JENKINS REMOTINGchannel started
 CAPACITY]===>   ERROR: [JENKINS-18403] JDK 5 not supported to run Maven; retrying with
slave Java and setting compile/test properties to point to /home/hudson/tools/java/latest1.5
maven-agent.jar already up to date
classworlds.jar already up to date
maven-interceptor.jar already up to date
maven2.1-interceptor.jar already up to date
[transports] $ /home/jenkins/tools/java/jdk1.7.0_25-64/jre/bin/java -cp /home/jenkins/jenkins-slave/maven-agent.jar:/home/jenkins/jenkins-slave/classworlds.jar
hudson.maven.agent.Main /home/hudson/tools/maven/apache-maven-2.2.1 /home/jenkins/jenkins-slave/slave.jar
/home/jenkins/jenkins-slave/maven-interceptor.jar 51483 /home/jenkins/jenkins-slave/maven2.1-interceptor.jar
<===[JENKINS REMOTING CAPACITY]===>channel started
   log4j:WARN No appenders could be found for logger (org.apache.commons.beanutils.converters.BooleanConverter).
log4j:WARN Please initialize the log4j system properly.
Executing Maven:  -B -f <https://builds.apache.org/job/axis2-transports-trunk/ws/transports/pom.xml>
-Dmaven.repo.local=<https://builds.apache.org/job/axis2-transports-trunk/ws/.repository>
clean deploy
[INFO] Scanning for projects...
[INFO] Reactor build order: 
[INFO]   Apache Axis2 - Transport - Root
[INFO]   Apache Axis2 - Transport - Sms
[INFO]   Apache Axis2 - Transport - All
[INFO] ------------------------------------------------------------------------
[INFO] Building Apache Axis2 - Transport - Root
[INFO]    task-segment: [clean, deploy]
[INFO] ------------------------------------------------------------------------
[INFO] [clean:clean {execution: default-clean}]
[INFO] Deleting <https://builds.apache.org/job/axis2-transports-trunk/ws/transports/target>
[INFO] Setting property: classpath.resource.loader.class => 'org.codehaus.plexus.velocity.ContextClassLoaderResourceLoader'.
[INFO] Setting property: velocimacro.messages.on => 'false'.
[INFO] Setting property: resource.loader => 'classpath'.
[INFO] Setting property: resource.manager.logwhenfound => 'false'.
[INFO] [remote-resources:process {execution: default}]
[INFO] snapshot org.apache.axis2:axis2-kernel:1.7.0-SNAPSHOT: checking for updates from apache.snapshots
Downloading: http://repository.apache.org/snapshots/org/apache/axis2/axis2-kernel/1.7.0-SNAPSHOT/axis2-kernel-1.7.0-20131217.192004-1769.pom

[INFO] snapshot org.apache.axis2:axis2-parent:1.7.0-SNAPSHOT: checking for updates from apache.snapshots
Downloading: http://repository.apache.org/snapshots/org/apache/axis2/axis2-parent/1.7.0-SNAPSHOT/axis2-parent-1.7.0-20131217.191841-1789.pom

[INFO] snapshot org.apache.ws.commons.axiom:axiom-api:1.2.15-SNAPSHOT: checking for updates
from apache.snapshots
Downloading: http://repository.apache.org/snapshots/org/apache/ws/commons/axiom/axiom-api/1.2.15-SNAPSHOT/axiom-api-1.2.15-20131216.182214-455.pom

[INFO] snapshot org.apache.ws.commons.axiom:axiom:1.2.15-SNAPSHOT: checking for updates from
apache.snapshots
Downloading: http://repository.apache.org/snapshots/org/apache/ws/commons/axiom/axiom/1.2.15-SNAPSHOT/axiom-1.2.15-20131216.181919-468.pom

[INFO] snapshot org.apache.ws.commons.axiom:axiom-impl:1.2.15-SNAPSHOT: checking for updates
from apache.snapshots
Downloading: http://repository.apache.org/snapshots/org/apache/ws/commons/axiom/axiom-impl/1.2.15-SNAPSHOT/axiom-impl-1.2.15-20131216.182344-445.pom

[INFO] snapshot org.apache.ws.xmlschema:xmlschema-core:2.0.4-SNAPSHOT: checking for updates
from apache.snapshots
Downloading: http://repository.apache.org/snapshots/org/apache/ws/xmlschema/xmlschema-core/2.0.4-SNAPSHOT/xmlschema-core-2.0.4-20131204.112457-62.pom

[INFO] snapshot org.apache.ws.xmlschema:xmlschema:2.0.4-SNAPSHOT: checking for updates from
apache.snapshots
Downloading: http://repository.apache.org/snapshots/org/apache/ws/xmlschema/xmlschema/2.0.4-SNAPSHOT/xmlschema-2.0.4-20131204.111627-65.pom

[INFO] snapshot org.apache.neethi:neethi:3.0.3-SNAPSHOT: checking for updates from apache.snapshots
Downloading: http://repository.apache.org/snapshots/org/apache/neethi/neethi/3.0.3-SNAPSHOT/neethi-3.0.3-20130927.211301-516.pom

[INFO] snapshot org.apache.woden:woden-core:1.0-SNAPSHOT: checking for updates from apache.snapshots
Downloading: http://repository.apache.org/snapshots/org/apache/woden/woden-core/1.0-SNAPSHOT/woden-core-1.0-20131030.110758-498.pom

[INFO] snapshot org.apache.woden:woden:1.0-SNAPSHOT: checking for updates from apache.snapshots
Downloading: http://repository.apache.org/snapshots/org/apache/woden/woden/1.0-SNAPSHOT/woden-1.0-20131030.110749-914.pom

Downloading: http://repository.apache.org/snapshots/org/apache/axis2/axis2-kernel/1.7.0-SNAPSHOT/axis2-kernel-1.7.0-20131217.192004-1769.jar
Downloading: http://repository.apache.org/snapshots/org/apache/woden/woden-core/1.0-SNAPSHOT/woden-core-1.0-20131030.110758-498.jar
Downloading: http://repository.apache.org/snapshots/org/apache/ws/commons/axiom/axiom-api/1.2.15-SNAPSHOT/axiom-api-1.2.15-20131216.182214-455.jar
Downloading: http://repository.apache.org/snapshots/org/apache/ws/xmlschema/xmlschema-core/2.0.4-SNAPSHOT/xmlschema-core-2.0.4-20131204.112457-62.jar
Downloading: http://repository.apache.org/snapshots/org/apache/neethi/neethi/3.0.3-SNAPSHOT/neethi-3.0.3-20130927.211301-516.jar
69K downloaded  (neethi-3.0.3-20130927.211301-516.jar)
159K downloaded  (xmlschema-core-2.0.4-20131204.112457-62.jar)
363K downloaded  (woden-core-1.0-20131030.110758-498.jar)
399K downloaded  (axiom-api-1.2.15-20131216.182214-455.jar)
[WARNING] Component manager not found for returned component. Ignored. component=org.apache.maven.wagon.providers.http.LightweightHttpWagon@483242bb
Downloading: http://repository.apache.org/snapshots/org/apache/ws/commons/axiom/axiom-impl/1.2.15-SNAPSHOT/axiom-impl-1.2.15-20131216.182344-445.jar
1028K downloaded  (axis2-kernel-1.7.0-20131217.192004-1769.jar)
206K downloaded  (axiom-impl-1.2.15-20131216.182344-445.jar)
[WARNING] org.apache.velocity.runtime.exception.ReferenceException: reference : template =
META-INF/DEPENDENCIES.vm [line 40,column 14] : $license.name is not a valid reference.
[INFO] [site:attach-descriptor {execution: default-attach-descriptor}]
[INFO] Parent project loaded from repository: org.apache:apache:pom:9
[INFO] Preparing source:jar
[WARNING] Removing: jar from forked lifecycle, to prevent recursive invocation.
[INFO] No goals needed for project - skipping
[INFO] [source:jar {execution: default}]
[INFO] [install:install {execution: default-install}]
[INFO] Installing <https://builds.apache.org/job/axis2-transports-trunk/ws/transports/pom.xml>
to <https://builds.apache.org/job/axis2-transports-trunk/ws/.repository/org/apache/axis2/axis2-transports/1.7.0-SNAPSHOT/axis2-transports-1.7.0-SNAPSHOT.pom>
[INFO] Installing <https://builds.apache.org/job/axis2-transports-trunk/ws/transports/target/axis2-transports-1.7.0-SNAPSHOT-site.xml>
to <https://builds.apache.org/job/axis2-transports-trunk/ws/.repository/org/apache/axis2/axis2-transports/1.7.0-SNAPSHOT/axis2-transports-1.7.0-SNAPSHOT-site.xml>
[INFO] [deploy:deploy {execution: default-deploy}]
[INFO] Retrieving previous build number from apache.snapshots.https
[WARNING] *** CHECKSUM FAILED - Checksum failed on download: local = '431d76a504a0e2a97f9f863085f792b993176d24';
remote = 'ff15a6615a38bf9209b7ce75e6e50f6f9fdfa1fd' - RETRYING
[WARNING] *** CHECKSUM FAILED - Checksum failed on download: local = '431d76a504a0e2a97f9f863085f792b993176d24';
remote = 'ff15a6615a38bf9209b7ce75e6e50f6f9fdfa1fd' - IGNORING
Uploading: https://repository.apache.org/content/repositories/snapshots/org/apache/axis2/axis2-transports/1.7.0-SNAPSHOT/axis2-transports-1.7.0-20131217.213024-959.pom
16K uploaded  (axis2-transports-1.7.0-20131217.213024-959.pom)
[INFO] Retrieving previous metadata from apache.snapshots.https
[WARNING] *** CHECKSUM FAILED - Checksum failed on download: local = '431d76a504a0e2a97f9f863085f792b993176d24';
remote = 'ff15a6615a38bf9209b7ce75e6e50f6f9fdfa1fd' - RETRYING
[WARNING] *** CHECKSUM FAILED - Checksum failed on download: local = '431d76a504a0e2a97f9f863085f792b993176d24';
remote = 'ff15a6615a38bf9209b7ce75e6e50f6f9fdfa1fd' - IGNORING
[INFO] Uploading repository metadata for: 'snapshot org.apache.axis2:axis2-transports:1.7.0-SNAPSHOT'
[INFO] Retrieving previous metadata from apache.snapshots.https
[INFO] Uploading repository metadata for: 'artifact org.apache.axis2:axis2-transports'
[INFO] Retrieving previous build number from apache.snapshots.https
Uploading: https://repository.apache.org/content/repositories/snapshots/org/apache/axis2/axis2-transports/1.7.0-SNAPSHOT/axis2-transports-1.7.0-20131217.213024-959-site.xml
2K uploaded  (axis2-transports-1.7.0-20131217.213024-959-site.xml)
[INFO] ------------------------------------------------------------------------
[INFO] Building Apache Axis2 - Transport - Sms
[INFO]    task-segment: [clean, deploy]
[INFO] ------------------------------------------------------------------------
[INFO] [clean:clean {execution: default-clean}]
[INFO] Deleting <https://builds.apache.org/job/axis2-transports-trunk/ws/transports/modules/sms/target>
[INFO] [remote-resources:process {execution: default}]
[INFO] snapshot org.apache.axis2:axis2-transport-base:1.7.0-SNAPSHOT: checking for updates
from apache-snapshots
[INFO] snapshot org.apache.axis2:axis2-transport-base:1.7.0-SNAPSHOT: checking for updates
from wso2-m2
[INFO] snapshot org.apache.axis2:axis2-transport-base:1.7.0-SNAPSHOT: checking for updates
from apache.snapshots
Downloading: http://repository.apache.org/snapshots/org/apache/axis2/axis2-transport-base/1.7.0-SNAPSHOT/axis2-transport-base-1.7.0-20131217.192239-1216.pom

Downloading: http://people.apache.org/repo/m2-snapshot-repository//org/smslib/smslib/3.4.1/smslib-3.4.1.pom
[INFO] Unable to find resource 'org.smslib:smslib:pom:3.4.1' in repository apache-snapshots
(http://people.apache.org/repo/m2-snapshot-repository/)
Downloading: http://dist.wso2.org/maven2//org/smslib/smslib/3.4.1/smslib-3.4.1.pom
[INFO] Unable to find resource 'org.smslib:smslib:pom:3.4.1' in repository wso2-m2 (http://dist.wso2.org/maven2/)
Downloading: http://repo1.maven.org/maven2/org/smslib/smslib/3.4.1/smslib-3.4.1.pom
[INFO] Unable to find resource 'org.smslib:smslib:pom:3.4.1' in repository central (http://repo1.maven.org/maven2)
[INFO] snapshot org.apache.axis2:addressing:1.7.0-SNAPSHOT: checking for updates from apache-snapshots
[INFO] snapshot org.apache.axis2:addressing:1.7.0-SNAPSHOT: checking for updates from wso2-m2
[INFO] snapshot org.apache.axis2:addressing:1.7.0-SNAPSHOT: checking for updates from apache.snapshots
Downloading: http://repository.apache.org/snapshots/org/apache/axis2/addressing/1.7.0-SNAPSHOT/addressing-1.7.0-20131217.192205-1743.pom

Downloading: http://repository.apache.org/snapshots/org/apache/axis2/axis2-transport-base/1.7.0-SNAPSHOT/axis2-transport-base-1.7.0-20131217.192239-1216.jar
102K downloaded  (axis2-transport-base-1.7.0-20131217.192239-1216.jar)
Downloading: http://repository.apache.org/snapshots/org/apache/axis2/addressing/1.7.0-SNAPSHOT/addressing-1.7.0-20131217.192205-1743.mar

[WARNING] org.apache.velocity.runtime.exception.ReferenceException: reference : template =
META-INF/DEPENDENCIES.vm [line 40,column 14] : $license.name is not a valid reference.
[INFO] [resources:resources {execution: default-resources}]
[INFO] Using 'UTF-8' encoding to copy filtered resources.
[INFO] skip non existing resourceDirectory <https://builds.apache.org/job/axis2-transports-trunk/ws/transports/modules/sms/src/main/resources>
[INFO] Copying 3 resources
[INFO] [compiler:compile {execution: default-compile}]
[INFO] Compiling 24 source files to <https://builds.apache.org/job/axis2-transports-trunk/ws/transports/modules/sms/target/classes>
[INFO] -------------------------------------------------------------
[ERROR] COMPILATION ERROR : 
[INFO] -------------------------------------------------------------
[ERROR] <https://builds.apache.org/job/axis2-transports-trunk/ws/transports/modules/sms/src/main/java/org/apache/axis2/transport/sms/DefaultSMSMessageBuilderImpl.java>:[173,24]
cannot find symbol
symbol  : class XmlSchemaGroupBase
location: class org.apache.axis2.transport.sms.DefaultSMSMessageBuilderImpl
[ERROR] <https://builds.apache.org/job/axis2-transports-trunk/ws/transports/modules/sms/src/main/java/org/apache/axis2/transport/sms/DefaultSMSMessageBuilderImpl.java>:[173,65]
cannot find symbol
symbol  : class XmlSchemaGroupBase
location: class org.apache.axis2.transport.sms.DefaultSMSMessageBuilderImpl
[INFO] 2 errors 
[INFO] -------------------------------------------------------------
[INFO] ------------------------------------------------------------------------
[ERROR] BUILD FAILURE
[INFO] ------------------------------------------------------------------------
[INFO] Compilation failure

<https://builds.apache.org/job/axis2-transports-trunk/ws/transports/modules/sms/src/main/java/org/apache/axis2/transport/sms/DefaultSMSMessageBuilderImpl.java>:[173,24]
cannot find symbol
symbol  : class XmlSchemaGroupBase
location: class org.apache.axis2.transport.sms.DefaultSMSMessageBuilderImpl
<https://builds.apache.org/job/axis2-transports-trunk/ws/transports/modules/sms/src/main/java/org/apache/axis2/transport/sms/DefaultSMSMessageBuilderImpl.java>:[173,65]
cannot find symbol
symbol  : class XmlSchemaGroupBase
location: class org.apache.axis2.transport.sms.DefaultSMSMessageBuilderImpl

[INFO] ------------------------------------------------------------------------
[INFO] For more information, run Maven with the -e switch
[INFO] ------------------------------------------------------------------------
[INFO] Total time: 1 minute 23 seconds
[INFO] Finished at: Tue Dec 17 21:31:08 UTC 2013
[INFO] Final Memory: 51M/391M
[INFO] ------------------------------------------------------------------------
[JENKINS] Archiving <https://builds.apache.org/job/axis2-transports-trunk/ws/transports/pom.xml>
to org.apache.axis2/axis2-transports/1.7.0-SNAPSHOT/axis2-transports-1.7.0-SNAPSHOT.pom
[JENKINS] Archiving <https://builds.apache.org/job/axis2-transports-trunk/ws/.repository/org/apache/axis2/axis2-transports/1.7.0-SNAPSHOT/axis2-transports-1.7.0-SNAPSHOT.pom>
to org.apache.axis2/axis2-transports/1.7.0-20131217.213024-959/axis2-transports-1.7.0-20131217.213024-959.pom
[JENKINS] Archiving <https://builds.apache.org/job/axis2-transports-trunk/ws/transports/target/axis2-transports-1.7.0-SNAPSHOT-site.xml>
to org.apache.axis2/axis2-transports/1.7.0-20131217.213024-959/axis2-transports-1.7.0-20131217.213024-959-site.xml
<https://builds.apache.org/job/axis2-transports-trunk/ws/.repository/org/apache/axis2/axis2-transports/1.7.0-SNAPSHOT/axis2-transports-1.7.0-SNAPSHOT.pom>
is not inside <https://builds.apache.org/job/axis2-transports-trunk/ws/transports/;>
will archive in a separate pass
[JENKINS] Archiving <https://builds.apache.org/job/axis2-transports-trunk/ws/transports/modules/sms/pom.xml>
to org.apache.axis2/axis2-transport-sms/1.7.0-SNAPSHOT/axis2-transport-sms-1.7.0-SNAPSHOT.pom
channel stopped
[locks-and-latches] Releasing all the locks
[locks-and-latches] All the locks released

---------------------------------------------------------------------
To unsubscribe, e-mail: java-dev-unsubscribe@axis.apache.org
For additional commands, e-mail: java-dev-help@axis.apache.org


Mime
View raw message