axis-java-dev mailing list archives

Site index · List index
Message view « Date » · « Thread »
Top « Date » · « Thread »
From Apache Jenkins Server <jenk...@builds.apache.org>
Subject Build failed in Jenkins: Axis2 » Apache Axis2 - ADB Codegen #2501
Date Sat, 26 Oct 2013 14:19:37 GMT
See <https://builds.apache.org/job/Axis2/org.apache.axis2$axis2-adb-codegen/2501/>

------------------------------------------
[...truncated 7 lines...]
INFO: ------------------------------------------------------------------------
Oct 26, 2013 2:13:28 PM org.apache.maven.cli.event.ExecutionEventLogger mojoStarted
INFO: 
Oct 26, 2013 2:13:28 PM org.apache.maven.cli.event.ExecutionEventLogger mojoStarted
INFO: --- maven-clean-plugin:2.2:clean (default-clean) @ axis2-adb-codegen ---
[INFO] Deleting directory <https://builds.apache.org/job/Axis2/org.apache.axis2$axis2-adb-codegen/ws/target>
Oct 26, 2013 2:13:29 PM org.apache.maven.cli.event.ExecutionEventLogger mojoStarted
INFO: 
Oct 26, 2013 2:13:29 PM org.apache.maven.cli.event.ExecutionEventLogger mojoStarted
INFO: --- maven-enforcer-plugin:1.1:enforce (default) @ axis2-adb-codegen ---
Oct 26, 2013 2:13:29 PM org.apache.maven.cli.event.ExecutionEventLogger mojoStarted
INFO: 
Oct 26, 2013 2:13:29 PM org.apache.maven.cli.event.ExecutionEventLogger mojoStarted
INFO: --- maven-remote-resources-plugin:1.1:process (default) @ axis2-adb-codegen ---
Oct 26, 2013 2:13:29 PM org.apache.maven.cli.event.ExecutionEventLogger mojoStarted
INFO: 
Oct 26, 2013 2:13:29 PM org.apache.maven.cli.event.ExecutionEventLogger mojoStarted
INFO: --- maven-resources-plugin:2.4.2:resources (default-resources) @ axis2-adb-codegen ---
[INFO] Using 'UTF-8' encoding to copy filtered resources.
[INFO] skip non existing resourceDirectory <https://builds.apache.org/job/Axis2/org.apache.axis2$axis2-adb-codegen/ws/conf>
[INFO] Copying 11 resources
[INFO] Copying 2 resources
Oct 26, 2013 2:13:29 PM org.apache.maven.cli.event.ExecutionEventLogger mojoStarted
INFO: 
Oct 26, 2013 2:13:29 PM org.apache.maven.cli.event.ExecutionEventLogger mojoStarted
INFO: --- maven-antrun-plugin:1.2:run (process-resources) @ axis2-adb-codegen ---
[INFO] Executing tasks
     [copy] Copying 7 files to <https://builds.apache.org/job/Axis2/org.apache.axis2$axis2-adb-codegen/ws/target/classes>
[INFO] Executed tasks
Oct 26, 2013 2:13:30 PM org.apache.maven.cli.event.ExecutionEventLogger mojoStarted
INFO: 
Oct 26, 2013 2:13:30 PM org.apache.maven.cli.event.ExecutionEventLogger mojoStarted
INFO: --- maven-compiler-plugin:2.3.1:compile (default-compile) @ axis2-adb-codegen ---
[INFO] Compiling 17 source files to <https://builds.apache.org/job/Axis2/org.apache.axis2$axis2-adb-codegen/ws/target/classes>
[INFO] -------------------------------------------------------------
[ERROR] COMPILATION ERROR : 
[INFO] -------------------------------------------------------------
[ERROR] <https://builds.apache.org/job/Axis2/org.apache.axis2$axis2-adb-codegen/ws/src/org/apache/axis2/schema/SchemaCompiler.java>:[373,51]
cannot find symbol
symbol  : method getIncludes()
location: class org.apache.ws.commons.schema.XmlSchema

[ERROR] <https://builds.apache.org/job/Axis2/org.apache.axis2$axis2-adb-codegen/ws/src/org/apache/axis2/schema/SchemaCompiler.java>:[388,59]
read(org.xml.sax.InputSource,org.apache.ws.commons.schema.utils.TargetNamespaceValidator)
is not public in org.apache.ws.commons.schema.XmlSchemaCollection; cannot be accessed from
outside package

[ERROR] <https://builds.apache.org/job/Axis2/org.apache.axis2$axis2-adb-codegen/ws/src/org/apache/axis2/schema/SchemaCompiler.java>:[417,58]
incompatible types
found   : java.util.Map<javax.xml.namespace.QName,org.apache.ws.commons.schema.XmlSchemaElement>
required: org.apache.ws.commons.schema.XmlSchemaObjectTable

[ERROR] <https://builds.apache.org/job/Axis2/org.apache.axis2$axis2-adb-codegen/ws/src/org/apache/axis2/schema/SchemaCompiler.java>:[438,70]
cannot find symbol
symbol  : method getValues()
location: interface java.util.Map<javax.xml.namespace.QName,org.apache.ws.commons.schema.XmlSchemaType>

[ERROR] <https://builds.apache.org/job/Axis2/org.apache.axis2$axis2-adb-codegen/ws/src/org/apache/axis2/schema/SchemaCompiler.java>:[561,24]
cannot find symbol
symbol  : method getRefName()
location: class org.apache.ws.commons.schema.XmlSchemaElement

[ERROR] <https://builds.apache.org/job/Axis2/org.apache.axis2$axis2-adb-codegen/ws/src/org/apache/axis2/schema/SchemaCompiler.java>:[744,24]
cannot find symbol
symbol  : method getRefName()
location: class org.apache.ws.commons.schema.XmlSchemaElement

[ERROR] <https://builds.apache.org/job/Axis2/org.apache.axis2$axis2-adb-codegen/ws/src/org/apache/axis2/schema/SchemaCompiler.java>:[746,21]
cannot find symbol
symbol  : method getRefName()
location: class org.apache.ws.commons.schema.XmlSchemaElement

[ERROR] <https://builds.apache.org/job/Axis2/org.apache.axis2$axis2-adb-codegen/ws/src/org/apache/axis2/schema/SchemaCompiler.java>:[752,73]
cannot find symbol
symbol  : method getRefName()
location: class org.apache.ws.commons.schema.XmlSchemaElement

[ERROR] <https://builds.apache.org/job/Axis2/org.apache.axis2$axis2-adb-codegen/ws/src/org/apache/axis2/schema/SchemaCompiler.java>:[754,88]
cannot find symbol
symbol  : method getRefName()
location: class org.apache.ws.commons.schema.XmlSchemaElement

[ERROR] <https://builds.apache.org/job/Axis2/org.apache.axis2$axis2-adb-codegen/ws/src/org/apache/axis2/schema/SchemaCompiler.java>:[757,86]
cannot find symbol
symbol  : method getRefName()
location: class org.apache.ws.commons.schema.XmlSchemaElement

[ERROR] <https://builds.apache.org/job/Axis2/org.apache.axis2$axis2-adb-codegen/ws/src/org/apache/axis2/schema/SchemaCompiler.java>:[760,99]
cannot find symbol
symbol  : method getRefName()
location: class org.apache.ws.commons.schema.XmlSchemaElement

[ERROR] <https://builds.apache.org/job/Axis2/org.apache.axis2$axis2-adb-codegen/ws/src/org/apache/axis2/schema/SchemaCompiler.java>:[1170,8]
processAttributes(org.apache.ws.commons.schema.XmlSchemaObjectCollection,org.apache.axis2.schema.BeanWriterMetaInfoHolder,org.apache.ws.commons.schema.XmlSchema)
in org.apache.axis2.schema.SchemaCompiler cannot be applied to (java.util.List<org.apache.ws.commons.schema.XmlSchemaAttributeOrGroupRef>,org.apache.axis2.schema.BeanWriterMetaInfoHolder,org.apache.ws.commons.schema.XmlSchema)

[ERROR] <https://builds.apache.org/job/Axis2/org.apache.axis2$axis2-adb-codegen/ws/src/org/apache/axis2/schema/SchemaCompiler.java>:[1207,55]
cannot find symbol
symbol  : method getRefName()
location: class org.apache.ws.commons.schema.XmlSchemaAttributeGroupRef

[ERROR] <https://builds.apache.org/job/Axis2/org.apache.axis2$axis2-adb-codegen/ws/src/org/apache/axis2/schema/SchemaCompiler.java>:[1215,85]
cannot find symbol
symbol  : method getItem(javax.xml.namespace.QName)
location: interface java.util.Map<javax.xml.namespace.QName,org.apache.ws.commons.schema.XmlSchemaAttributeGroup>

[ERROR] <https://builds.apache.org/job/Axis2/org.apache.axis2$axis2-adb-codegen/ws/src/org/apache/axis2/schema/SchemaCompiler.java>:[1217,20]
processAttributes(org.apache.ws.commons.schema.XmlSchemaObjectCollection,org.apache.axis2.schema.BeanWriterMetaInfoHolder,org.apache.ws.commons.schema.XmlSchema)
in org.apache.axis2.schema.SchemaCompiler cannot be applied to (java.util.List<org.apache.ws.commons.schema.XmlSchemaAttributeGroupMember>,org.apache.axis2.schema.BeanWriterMetaInfoHolder,org.apache.ws.commons.schema.XmlSchema)

[ERROR] <https://builds.apache.org/job/Axis2/org.apache.axis2$axis2-adb-codegen/ws/src/org/apache/axis2/schema/SchemaCompiler.java>:[1298,12]
processAttributes(org.apache.ws.commons.schema.XmlSchemaObjectCollection,org.apache.axis2.schema.BeanWriterMetaInfoHolder,org.apache.ws.commons.schema.XmlSchema)
in org.apache.axis2.schema.SchemaCompiler cannot be applied to (java.util.List<org.apache.ws.commons.schema.XmlSchemaAttributeOrGroupRef>,org.apache.axis2.schema.BeanWriterMetaInfoHolder,org.apache.ws.commons.schema.XmlSchema)

[ERROR] <https://builds.apache.org/job/Axis2/org.apache.axis2$axis2-adb-codegen/ws/src/org/apache/axis2/schema/SchemaCompiler.java>:[1349,12]
processAttributes(org.apache.ws.commons.schema.XmlSchemaObjectCollection,org.apache.axis2.schema.BeanWriterMetaInfoHolder,org.apache.ws.commons.schema.XmlSchema)
in org.apache.axis2.schema.SchemaCompiler cannot be applied to (java.util.List<org.apache.ws.commons.schema.XmlSchemaAttributeOrGroupRef>,org.apache.axis2.schema.BeanWriterMetaInfoHolder,org.apache.ws.commons.schema.XmlSchema)

[ERROR] <https://builds.apache.org/job/Axis2/org.apache.axis2$axis2-adb-codegen/ws/src/org/apache/axis2/schema/SchemaCompiler.java>:[1520,71]
incompatible types
found   : java.util.List<org.apache.ws.commons.schema.XmlSchemaAttributeOrGroupRef>
required: org.apache.ws.commons.schema.XmlSchemaObjectCollection

[ERROR] <https://builds.apache.org/job/Axis2/org.apache.axis2$axis2-adb-codegen/ws/src/org/apache/axis2/schema/SchemaCompiler.java>:[1573,16]
processFacets(org.apache.ws.commons.schema.XmlSchemaObjectCollection,javax.xml.namespace.QName,org.apache.axis2.schema.BeanWriterMetaInfoHolder,org.apache.ws.commons.schema.XmlSchema)
in org.apache.axis2.schema.SchemaCompiler cannot be applied to (java.util.List<org.apache.ws.commons.schema.XmlSchemaFacet>,javax.xml.namespace.QName,org.apache.axis2.schema.BeanWriterMetaInfoHolder,org.apache.ws.commons.schema.XmlSchema)

[ERROR] <https://builds.apache.org/job/Axis2/org.apache.axis2$axis2-adb-codegen/ws/src/org/apache/axis2/schema/SchemaCompiler.java>:[1818,45]
cannot find symbol
symbol  : method getValue()
location: class org.apache.ws.commons.schema.XmlSchemaUse

[ERROR] <https://builds.apache.org/job/Axis2/org.apache.axis2$axis2-adb-codegen/ws/src/org/apache/axis2/schema/SchemaCompiler.java>:[1857,57]
cannot find symbol
symbol  : method getValue()
location: class org.apache.ws.commons.schema.XmlSchemaUse

[ERROR] <https://builds.apache.org/job/Axis2/org.apache.axis2$axis2-adb-codegen/ws/src/org/apache/axis2/schema/SchemaCompiler.java>:[1870,22]
cannot find symbol
symbol  : method getRefName()
location: class org.apache.ws.commons.schema.XmlSchemaAttribute

[ERROR] <https://builds.apache.org/job/Axis2/org.apache.axis2$axis2-adb-codegen/ws/src/org/apache/axis2/schema/SchemaCompiler.java>:[1872,71]
cannot find symbol
symbol  : method getRefName()
location: class org.apache.ws.commons.schema.XmlSchemaAttribute

[ERROR] <https://builds.apache.org/job/Axis2/org.apache.axis2$axis2-adb-codegen/ws/src/org/apache/axis2/schema/SchemaCompiler.java>:[1874,88]
cannot find symbol
symbol  : method getRefName()
location: class org.apache.ws.commons.schema.XmlSchemaAttribute

[ERROR] <https://builds.apache.org/job/Axis2/org.apache.axis2$axis2-adb-codegen/ws/src/org/apache/axis2/schema/SchemaCompiler.java>:[1878,87]
cannot find symbol
symbol  : method getRefName()
location: class org.apache.ws.commons.schema.XmlSchemaAttribute

[ERROR] <https://builds.apache.org/job/Axis2/org.apache.axis2$axis2-adb-codegen/ws/src/org/apache/axis2/schema/SchemaCompiler.java>:[1884,31]
cannot find symbol
symbol  : method getRefName()
location: class org.apache.ws.commons.schema.XmlSchemaAttribute

[ERROR] <https://builds.apache.org/job/Axis2/org.apache.axis2$axis2-adb-codegen/ws/src/org/apache/axis2/schema/SchemaCompiler.java>:[1931,45]
cannot find symbol
symbol  : method getValue()
location: class org.apache.ws.commons.schema.XmlSchemaUse

[ERROR] <https://builds.apache.org/job/Axis2/org.apache.axis2$axis2-adb-codegen/ws/src/org/apache/axis2/schema/SchemaCompiler.java>:[1964,72]
incompatible types
found   : java.util.List<org.apache.ws.commons.schema.XmlSchemaSequenceMember>
required: org.apache.ws.commons.schema.XmlSchemaObjectCollection

[ERROR] <https://builds.apache.org/job/Axis2/org.apache.axis2$axis2-adb-codegen/ws/src/org/apache/axis2/schema/SchemaCompiler.java>:[1997,80]
incompatible types
found   : java.util.List<org.apache.ws.commons.schema.XmlSchemaElement>
required: org.apache.ws.commons.schema.XmlSchemaObjectCollection

[ERROR] <https://builds.apache.org/job/Axis2/org.apache.axis2$axis2-adb-codegen/ws/src/org/apache/axis2/schema/SchemaCompiler.java>:[2001,83]
incompatible types
found   : java.util.List<org.apache.ws.commons.schema.XmlSchemaObject>
required: org.apache.ws.commons.schema.XmlSchemaObjectCollection

[ERROR] <https://builds.apache.org/job/Axis2/org.apache.axis2$axis2-adb-codegen/ws/src/org/apache/axis2/schema/SchemaCompiler.java>:[2045,64]
cannot find symbol
symbol  : method getItem(javax.xml.namespace.QName)
location: interface java.util.Map<javax.xml.namespace.QName,org.apache.ws.commons.schema.XmlSchemaGroup>

[ERROR] <https://builds.apache.org/job/Axis2/org.apache.axis2$axis2-adb-codegen/ws/src/org/apache/axis2/schema/SchemaCompiler.java>:[2131,48]
cannot find symbol
symbol  : method getCount()
location: interface java.util.List<org.apache.ws.commons.schema.XmlSchemaSequenceMember>

[ERROR] <https://builds.apache.org/job/Axis2/org.apache.axis2$axis2-adb-codegen/ws/src/org/apache/axis2/schema/SchemaCompiler.java>:[2133,20]
process(javax.xml.namespace.QName,org.apache.ws.commons.schema.XmlSchemaObjectCollection,org.apache.axis2.schema.BeanWriterMetaInfoHolder,boolean,org.apache.ws.commons.schema.XmlSchema)
in org.apache.axis2.schema.SchemaCompiler cannot be applied to (javax.xml.namespace.QName,java.util.List<org.apache.ws.commons.schema.XmlSchemaSequenceMember>,org.apache.axis2.schema.BeanWriterMetaInfoHolder,boolean,org.apache.ws.commons.schema.XmlSchema)

[ERROR] <https://builds.apache.org/job/Axis2/org.apache.axis2$axis2-adb-codegen/ws/src/org/apache/axis2/schema/SchemaCompiler.java>:[2155,46]
cannot find symbol
symbol  : method getCount()
location: interface java.util.List<org.apache.ws.commons.schema.XmlSchemaObject>

[ERROR] <https://builds.apache.org/job/Axis2/org.apache.axis2$axis2-adb-codegen/ws/src/org/apache/axis2/schema/SchemaCompiler.java>:[2158,20]
process(javax.xml.namespace.QName,org.apache.ws.commons.schema.XmlSchemaObjectCollection,org.apache.axis2.schema.BeanWriterMetaInfoHolder,boolean,org.apache.ws.commons.schema.XmlSchema)
in org.apache.axis2.schema.SchemaCompiler cannot be applied to (javax.xml.namespace.QName,java.util.List<org.apache.ws.commons.schema.XmlSchemaObject>,org.apache.axis2.schema.BeanWriterMetaInfoHolder,boolean,org.apache.ws.commons.schema.XmlSchema)

[ERROR] <https://builds.apache.org/job/Axis2/org.apache.axis2$axis2-adb-codegen/ws/src/org/apache/axis2/schema/SchemaCompiler.java>:[2189,85]
cannot find symbol
symbol  : method getItem(javax.xml.namespace.QName)
location: interface java.util.Map<javax.xml.namespace.QName,org.apache.ws.commons.schema.XmlSchemaGroup>

[ERROR] <https://builds.apache.org/job/Axis2/org.apache.axis2$axis2-adb-codegen/ws/src/org/apache/axis2/schema/SchemaCompiler.java>:[2250,23]
cannot find symbol
symbol  : method getRefName()
location: class org.apache.ws.commons.schema.XmlSchemaElement

[ERROR] <https://builds.apache.org/job/Axis2/org.apache.axis2$axis2-adb-codegen/ws/src/org/apache/axis2/schema/SchemaCompiler.java>:[2251,41]
cannot find symbol
symbol  : method getRefName()
location: class org.apache.ws.commons.schema.XmlSchemaElement

[ERROR] <https://builds.apache.org/job/Axis2/org.apache.axis2$axis2-adb-codegen/ws/src/org/apache/axis2/schema/SchemaCompiler.java>:[2434,74]
incompatible types
found   : org.apache.ws.commons.schema.XmlSchemaGroupParticle
required: org.apache.ws.commons.schema.XmlSchemaGroupBase

[ERROR] <https://builds.apache.org/job/Axis2/org.apache.axis2$axis2-adb-codegen/ws/src/org/apache/axis2/schema/SchemaCompiler.java>:[2436,16]
inconvertible types
found   : org.apache.ws.commons.schema.XmlSchemaGroupBase
required: org.apache.ws.commons.schema.XmlSchemaSequence

[ERROR] <https://builds.apache.org/job/Axis2/org.apache.axis2$axis2-adb-codegen/ws/src/org/apache/axis2/schema/SchemaCompiler.java>:[2437,74]
inconvertible types
found   : org.apache.ws.commons.schema.XmlSchemaGroupBase
required: org.apache.ws.commons.schema.XmlSchemaSequence

[ERROR] <https://builds.apache.org/job/Axis2/org.apache.axis2$axis2-adb-codegen/ws/src/org/apache/axis2/schema/SchemaCompiler.java>:[2438,48]
cannot find symbol
symbol  : method getCount()
location: interface java.util.List<org.apache.ws.commons.schema.XmlSchemaSequenceMember>

[ERROR] <https://builds.apache.org/job/Axis2/org.apache.axis2$axis2-adb-codegen/ws/src/org/apache/axis2/schema/SchemaCompiler.java>:[2440,20]
process(javax.xml.namespace.QName,org.apache.ws.commons.schema.XmlSchemaObjectCollection,org.apache.axis2.schema.BeanWriterMetaInfoHolder,boolean,org.apache.ws.commons.schema.XmlSchema)
in org.apache.axis2.schema.SchemaCompiler cannot be applied to (javax.xml.namespace.QName,java.util.List<org.apache.ws.commons.schema.XmlSchemaSequenceMember>,org.apache.axis2.schema.BeanWriterMetaInfoHolder,boolean,org.apache.ws.commons.schema.XmlSchema)

[ERROR] <https://builds.apache.org/job/Axis2/org.apache.axis2$axis2-adb-codegen/ws/src/org/apache/axis2/schema/SchemaCompiler.java>:[2447,23]
inconvertible types
found   : org.apache.ws.commons.schema.XmlSchemaGroupBase
required: org.apache.ws.commons.schema.XmlSchemaChoice

[ERROR] <https://builds.apache.org/job/Axis2/org.apache.axis2$axis2-adb-codegen/ws/src/org/apache/axis2/schema/SchemaCompiler.java>:[2448,68]
inconvertible types
found   : org.apache.ws.commons.schema.XmlSchemaGroupBase
required: org.apache.ws.commons.schema.XmlSchemaChoice

[ERROR] <https://builds.apache.org/job/Axis2/org.apache.axis2$axis2-adb-codegen/ws/src/org/apache/axis2/schema/SchemaCompiler.java>:[2449,46]
cannot find symbol
symbol  : method getCount()
location: interface java.util.List<org.apache.ws.commons.schema.XmlSchemaObject>

[ERROR] <https://builds.apache.org/job/Axis2/org.apache.axis2$axis2-adb-codegen/ws/src/org/apache/axis2/schema/SchemaCompiler.java>:[2452,20]
process(javax.xml.namespace.QName,org.apache.ws.commons.schema.XmlSchemaObjectCollection,org.apache.axis2.schema.BeanWriterMetaInfoHolder,boolean,org.apache.ws.commons.schema.XmlSchema)
in org.apache.axis2.schema.SchemaCompiler cannot be applied to (javax.xml.namespace.QName,java.util.List<org.apache.ws.commons.schema.XmlSchemaObject>,org.apache.axis2.schema.BeanWriterMetaInfoHolder,boolean,org.apache.ws.commons.schema.XmlSchema)

[ERROR] <https://builds.apache.org/job/Axis2/org.apache.axis2$axis2-adb-codegen/ws/src/org/apache/axis2/schema/SchemaCompiler.java>:[2582,24]
processFacets(org.apache.ws.commons.schema.XmlSchemaObjectCollection,javax.xml.namespace.QName,org.apache.axis2.schema.BeanWriterMetaInfoHolder,org.apache.ws.commons.schema.XmlSchema)
in org.apache.axis2.schema.SchemaCompiler cannot be applied to (java.util.List<org.apache.ws.commons.schema.XmlSchemaFacet>,javax.xml.namespace.QName,org.apache.axis2.schema.BeanWriterMetaInfoHolder,org.apache.ws.commons.schema.XmlSchema)

[ERROR] <https://builds.apache.org/job/Axis2/org.apache.axis2$axis2-adb-codegen/ws/src/org/apache/axis2/schema/SchemaCompiler.java>:[2635,102]
incompatible types
found   : java.util.List<org.apache.ws.commons.schema.XmlSchemaSimpleType>
required: org.apache.ws.commons.schema.XmlSchemaObjectCollection

[ERROR] <https://builds.apache.org/job/Axis2/org.apache.axis2$axis2-adb-codegen/ws/src/org/apache/axis2/schema/SchemaCompiler.java>:[2788,61]
cannot find symbol
symbol  : method getIncludes()
location: class org.apache.ws.commons.schema.XmlSchema

[ERROR] <https://builds.apache.org/job/Axis2/org.apache.axis2$axis2-adb-codegen/ws/src/org/apache/axis2/schema/SchemaCompiler.java>:[2853,50]
cannot find symbol
symbol  : method getItem(javax.xml.namespace.QName)
location: interface java.util.Map<javax.xml.namespace.QName,org.apache.ws.commons.schema.XmlSchemaAttribute>

[ERROR] <https://builds.apache.org/job/Axis2/org.apache.axis2$axis2-adb-codegen/ws/src/org/apache/axis2/schema/SchemaCompiler.java>:[2857,55]
cannot find symbol
symbol  : method getItem(javax.xml.namespace.QName)
location: interface java.util.Map<javax.xml.namespace.QName,org.apache.ws.commons.schema.XmlSchemaAttributeGroup>

[ERROR] <https://builds.apache.org/job/Axis2/org.apache.axis2$axis2-adb-codegen/ws/src/org/apache/axis2/schema/SchemaCompiler.java>:[2861,46]
cannot find symbol
symbol  : method getItem(javax.xml.namespace.QName)
location: interface java.util.Map<javax.xml.namespace.QName,org.apache.ws.commons.schema.XmlSchemaGroup>

[ERROR] <https://builds.apache.org/job/Axis2/org.apache.axis2$axis2-adb-codegen/ws/src/org/apache/axis2/schema/ExtensionUtility.java>:[359,81]
incompatible types
found   : java.util.List<org.apache.ws.commons.schema.XmlSchemaAttributeOrGroupRef>
required: org.apache.ws.commons.schema.XmlSchemaObjectCollection

[ERROR] <https://builds.apache.org/job/Axis2/org.apache.axis2$axis2-adb-codegen/ws/src/org/apache/axis2/schema/ExtensionUtility.java>:[384,59]
cannot find symbol
symbol  : method getIncludes()
location: class org.apache.ws.commons.schema.XmlSchema

[ERROR] <https://builds.apache.org/job/Axis2/org.apache.axis2$axis2-adb-codegen/ws/src/org/apache/axis2/schema/ExtensionUtility.java>:[443,85]
incompatible types
found   : java.util.List<org.apache.ws.commons.schema.XmlSchemaSequenceMember>
required: org.apache.ws.commons.schema.XmlSchemaObjectCollection

[ERROR] <https://builds.apache.org/job/Axis2/org.apache.axis2$axis2-adb-codegen/ws/src/org/apache/axis2/schema/ExtensionUtility.java>:[456,40]
cannot find symbol
symbol  : method getRefName()
location: class org.apache.ws.commons.schema.XmlSchemaElement

[ERROR] <https://builds.apache.org/job/Axis2/org.apache.axis2$axis2-adb-codegen/ws/src/org/apache/axis2/schema/ExtensionUtility.java>:[457,51]
cannot find symbol
symbol  : method getRefName()
location: class org.apache.ws.commons.schema.XmlSchemaElement

[INFO] 58 errors 
[INFO] -------------------------------------------------------------

---------------------------------------------------------------------
To unsubscribe, e-mail: java-dev-unsubscribe@axis.apache.org
For additional commands, e-mail: java-dev-help@axis.apache.org


Mime
View raw message